081381475159;23232323;250 rb;29 Juni;https://app.ocatelkom.co.id
082223812011;23232323;350 rb;29 Juni;https://app.ocatelkom.co.id
081318606456;23232323;450 rb;29 Juni;https://app.ocatelkom.co.id
081289376509;23232323;250 rb;29 Juni;https://app.ocatelkom.co.id
081224192373;23232323;250 rb;29 Juni;https://app.ocatelkom.co.id
085362222219;23232323;250 rb;29 Juni;https://app.ocatelkom.co.id
08111599995;2323232;270 rb; 29 Juni;https://app.ocatelkom.co.id