[gd_scene load_steps=8 format=2]

[ext_resource path="res://Scenes/BG.tscn" type="PackedScene" id=1]
[ext_resource path="res://Scenes/Player.tscn" type="PackedScene" id=2]
[ext_resource path="res://Scenes/Box.tscn" type="PackedScene" id=3]
[ext_resource path="res://Scenes/PressureButton.tscn" type="PackedScene" id=4]
[ext_resource path="res://Scenes/TileMap.tscn" type="PackedScene" id=5]
[ext_resource path="res://Sprites/pipe.png" type="Texture" id=6]
[ext_resource path="res://Scenes/Door.tscn" type="PackedScene" id=7]

[node name="Node2D" type="Node2D"]

[node name="BG" parent="." instance=ExtResource( 1 )]

[node name="Area2D" parent="." instance=ExtResource( 7 )]
position = Vector2( 88, 68 )
toggles = [ NodePath("../PressureButton") ]

[node name="pipe" type="Sprite" parent="."]
position = Vector2( 52, 40 )
texture = ExtResource( 6 )

[node name="TileMap" parent="." instance=ExtResource( 5 )]
tile_data = PoolIntArray( 196609, 0, 0, 196610, 0, 1, 196611, 0, 1, 196612, 0, 1, 196613, 0, 1, 196614, 0, 1, 196615, 0, 1, 196616, 0, 1, 196617, 0, 1, 196618, 0, 1, 196619, 0, 1, 196620, 0, 1, 196621, 0, 1, 196622, 0, 2, 262145, 0, 65536, 262146, 0, 4, 262147, 0, 131073, 262148, 0, 131073, 262149, 0, 131073, 262150, 0, 131073, 262151, 0, 131073, 262152, 0, 131073, 262153, 0, 131073, 262154, 0, 131073, 262155, 0, 131073, 262156, 0, 131073, 262157, 0, 131076, 262158, 0, 65538, 327681, 0, 65536, 327682, 0, 65538, 327693, 0, 65536, 327694, 0, 65538, 393217, 0, 65536, 393218, 0, 65538, 393229, 0, 65536, 393230, 0, 65538, 458753, 0, 65536, 458754, 0, 65538, 458765, 0, 65536, 458766, 0, 65538, 524289, 0, 65536, 524290, 0, 65538, 524301, 0, 65536, 524302, 0, 65538, 589825, 0, 65536, 589826, 0, 65540, 589827, 0, 1, 589828, 0, 1, 589829, 0, 1, 589830, 0, 1, 589831, 0, 1, 589832, 0, 1, 589833, 0, 1, 589834, 0, 1, 589835, 0, 1, 589836, 0, 1, 589837, 0, 196612, 589838, 0, 65538, 655361, 0, 131072, 655362, 0, 131073, 655363, 0, 131073, 655364, 0, 131073, 655365, 0, 131073, 655366, 0, 131073, 655367, 0, 131073, 655368, 0, 131073, 655369, 0, 131073, 655370, 0, 131073, 655371, 0, 131073, 655372, 0, 131073, 655373, 0, 131073, 655374, 0, 131074 )

[node name="PressureButton" parent="." instance=ExtResource( 4 )]
position = Vector2( 68, 68 )

[node name="Box" parent="." instance=ExtResource( 3 )]
position = Vector2( 52, 68 )

[node name="KinematicBody2D" parent="." instance=ExtResource( 2 )]
position = Vector2( 32, 68 )
activegun = false

[node name="Camera2D" type="Camera2D" parent="KinematicBody2D"]
current = true
drag_margin_h_enabled = true
drag_margin_v_enabled = true
smoothing_enabled = true
