[gd_scene load_steps=5 format=2]

[sub_resource type="GDScript" id=1]
script/source = "extends Area2D

var speed = 50
var distance_travelled = 0

func _physics_process(delta):
	if distance_travelled < 64:
		position += transform.x * speed * delta
		distance_travelled += speed * delta
"

[sub_resource type="Curve" id=2]
_data = [ Vector2( 0, 0 ), 0.0, 0.0, 0, 0, Vector2( 0.51, 1 ), 0.0, 0.0, 0, 0, Vector2( 0.998, 0.0582821 ), 0.0, 0.0, 0, 0 ]

[sub_resource type="Gradient" id=3]
offsets = PoolRealArray( 0 )
colors = PoolColorArray( 0, 0.525391, 1, 1 )

[sub_resource type="CircleShape2D" id=4]
radius = 13.0

[node name="GravityProjectile" type="Area2D"]
position = Vector2( 13, 0 )
space_override = 1
gravity_point = true
gravity_vec = Vector2( 0, 0 )
gravity = 1000.0
linear_damp = 5.0
script = SubResource( 1 )

[node name="CPUParticles2D" type="CPUParticles2D" parent="."]
amount = 16
lifetime = 0.5
draw_order = 1
emission_shape = 1
emission_sphere_radius = 12.0
direction = Vector2( 0, 0 )
spread = 180.0
gravity = Vector2( 0, 0 )
angular_velocity = 90.0
angular_velocity_random = 1.0
orbit_velocity = 0.5
orbit_velocity_random = 0.52
radial_accel = -100.0
scale_amount = 4.0
scale_amount_curve = SubResource( 2 )
color_ramp = SubResource( 3 )

[node name="CollisionShape2D" type="CollisionShape2D" parent="."]
shape = SubResource( 4 )
