[gd_scene load_steps=3 format=2]

[ext_resource path="res://Sprites/crosshair.png" type="Texture" id=1]

[sub_resource type="GDScript" id=1]
script/source = "extends Sprite


func _physics_process(_delta):
	position = get_global_mouse_position()
"

[node name="Crosshair" type="Sprite"]
texture = ExtResource( 1 )
script = SubResource( 1 )
