[gd_scene load_steps=5 format=2]

[ext_resource path="res://Sounds/hit.wav" type="AudioStream" id=1]

[sub_resource type="Curve" id=1]
_data = [ Vector2( 0.014, 0.996932 ), 0.0, 0.0, 0, 0, Vector2( 1, 0.43865 ), 0.0, 0.0, 0, 0 ]

[sub_resource type="Gradient" id=2]
colors = PoolColorArray( 1, 1, 1, 1, 1, 1, 1, 0 )

[sub_resource type="GDScript" id=3]
script/source = "extends CPUParticles2D


# Declare member variables here. Examples:
# var a = 2
# var b = \"text\"


# Called when the node enters the scene tree for the first time.
func _ready():
	emitting = true
	$AudioStreamPlayer2D.play()



# Called every frame. 'delta' is the elapsed time since the previous frame.
#func _process(delta):
#	pass


func _on_Timer_timeout():
	queue_free()
"

[node name="HitParticle" type="CPUParticles2D"]
emitting = false
amount = 6
lifetime = 0.5
one_shot = true
explosiveness = 1.0
local_coords = false
direction = Vector2( -1, 0 )
gravity = Vector2( 0, 0 )
initial_velocity = 100.0
initial_velocity_random = 0.47
angular_velocity = 720.0
scale_amount = 4.0
scale_amount_curve = SubResource( 1 )
color_ramp = SubResource( 2 )
script = SubResource( 3 )

[node name="Timer" type="Timer" parent="."]
wait_time = 0.5

[node name="AudioStreamPlayer2D" type="AudioStreamPlayer2D" parent="."]
stream = ExtResource( 1 )
volume_db = 5.0

[connection signal="timeout" from="Timer" to="." method="_on_Timer_timeout"]
