[gd_scene load_steps=4 format=2]

[ext_resource path="res://Sounds/step.wav" type="AudioStream" id=1]

[sub_resource type="Curve" id=1]
_data = [ Vector2( 0, 0.48773 ), 0.0, 0.0, 0, 0, Vector2( 0.998, 0.966258 ), 0.0, 0.0, 0, 0 ]

[sub_resource type="GDScript" id=2]
script/source = "extends CPUParticles2D


# Declare member variables here. Examples:
# var a = 2
# var b = \"text\"


# Called when the node enters the scene tree for the first time.
func _ready():
	emitting = true
	$AudioStreamPlayer2D.play()


# Called every frame. 'delta' is the elapsed time since the previous frame.
#func _process(delta):
#	pass


func _on_Timer_timeout():
	queue_free()
"

[node name="WalkGust" type="CPUParticles2D"]
amount = 1
lifetime = 0.5
gravity = Vector2( 0, -50 )
angular_velocity = 354.78
scale_amount = 5.0
scale_amount_curve = SubResource( 1 )
script = SubResource( 2 )

[node name="Timer" type="Timer" parent="."]
wait_time = 0.5
autostart = true

[node name="AudioStreamPlayer2D" type="AudioStreamPlayer2D" parent="."]
stream = ExtResource( 1 )
volume_db = 5.0

[connection signal="timeout" from="Timer" to="." method="_on_Timer_timeout"]
