%YAML 1.1
%TAG !u! tag:unity3d.com,2011:
--- !u!114 &538840477529749846
MonoBehaviour:
  m_ObjectHideFlags: 0
  m_CorrespondingSourceObject: {fileID: 0}
  m_PrefabInstance: {fileID: 0}
  m_PrefabAsset: {fileID: 0}
  m_GameObject: {fileID: 8365641152747043776}
  m_Enabled: 1
  m_EditorHideFlags: 0
  m_Script: {fileID: 11500000, guid: a1fd1bb804e2e1b48a1be6ea062edfa6, type: 3}
  m_Name: 
  m_EditorClassIdentifier: 
  nextDest: []
--- !u!1001 &1693800483969892164
PrefabInstance:
  m_ObjectHideFlags: 0
  serializedVersion: 2
  m_Modification:
    m_TransformParent: {fileID: 0}
    m_Modifications:
    - target: {fileID: 7176816816617456772, guid: 32e506fb2c9c69046b64c959d1b5e614,
        type: 3}
      propertyPath: m_Name
      value: node
      objectReference: {fileID: 0}
    - target: {fileID: 1044621603471692606, guid: 32e506fb2c9c69046b64c959d1b5e614,
        type: 3}
      propertyPath: m_LocalPosition.x
      value: 1.4982166
      objectReference: {fileID: 0}
    - target: {fileID: 1044621603471692606, guid: 32e506fb2c9c69046b64c959d1b5e614,
        type: 3}
      propertyPath: m_LocalPosition.y
      value: -1.3552548
      objectReference: {fileID: 0}
    - target: {fileID: 1044621603471692606, guid: 32e506fb2c9c69046b64c959d1b5e614,
        type: 3}
      propertyPath: m_LocalPosition.z
      value: 0
      objectReference: {fileID: 0}
    - target: {fileID: 1044621603471692606, guid: 32e506fb2c9c69046b64c959d1b5e614,
        type: 3}
      propertyPath: m_LocalRotation.x
      value: 0
      objectReference: {fileID: 0}
    - target: {fileID: 1044621603471692606, guid: 32e506fb2c9c69046b64c959d1b5e614,
        type: 3}
      propertyPath: m_LocalRotation.y
      value: 0
      objectReference: {fileID: 0}
    - target: {fileID: 1044621603471692606, guid: 32e506fb2c9c69046b64c959d1b5e614,
        type: 3}
      propertyPath: m_LocalRotation.z
      value: 0
      objectReference: {fileID: 0}
    - target: {fileID: 1044621603471692606, guid: 32e506fb2c9c69046b64c959d1b5e614,
        type: 3}
      propertyPath: m_LocalRotation.w
      value: 1
      objectReference: {fileID: 0}
    - target: {fileID: 1044621603471692606, guid: 32e506fb2c9c69046b64c959d1b5e614,
        type: 3}
      propertyPath: m_RootOrder
      value: 0
      objectReference: {fileID: 0}
    - target: {fileID: 1044621603471692606, guid: 32e506fb2c9c69046b64c959d1b5e614,
        type: 3}
      propertyPath: m_LocalEulerAnglesHint.x
      value: 0
      objectReference: {fileID: 0}
    - target: {fileID: 1044621603471692606, guid: 32e506fb2c9c69046b64c959d1b5e614,
        type: 3}
      propertyPath: m_LocalEulerAnglesHint.y
      value: 0
      objectReference: {fileID: 0}
    - target: {fileID: 1044621603471692606, guid: 32e506fb2c9c69046b64c959d1b5e614,
        type: 3}
      propertyPath: m_LocalEulerAnglesHint.z
      value: 0
      objectReference: {fileID: 0}
    m_RemovedComponents: []
  m_SourcePrefab: {fileID: 100100000, guid: 32e506fb2c9c69046b64c959d1b5e614, type: 3}
--- !u!1 &8365641152747043776 stripped
GameObject:
  m_CorrespondingSourceObject: {fileID: 7176816816617456772, guid: 32e506fb2c9c69046b64c959d1b5e614,
    type: 3}
  m_PrefabInstance: {fileID: 1693800483969892164}
  m_PrefabAsset: {fileID: 0}
