0 -493 493 0
44 -514 469 -1
89 -532 442 -1
133 -546 413 0
176 -557 381 0
218 -565 346 -1
258 -569 310 -1
297 -569 271 -1
335 -566 231 0
370 -560 190 0
403 -550 147 0
433 -537 103 -1
461 -520 59 0
486 -500 14 0
507 -478 -29 0
526 -452 -74 0
542 -423 -118 1
554 -392 -161 1
562 -358 -204 0
568 -322 -245 1
570 -284 -285 1
568 -245 -322 1
562 -204 -358 0
554 -161 -392 1
542 -118 -423 1
526 -74 -452 0
507 -29 -478 0
486 14 -500 0
461 59 -520 0
433 103 -537 -1
403 147 -550 0
370 190 -560 0
335 231 -566 0
297 271 -569 -1
258 310 -569 -1
218 346 -565 -1
176 381 -557 0
133 413 -546 0
89 442 -532 -1
44 469 -514 -1
0 493 -493 0
-44 514 -469 1
-89 532 -442 1
-133 546 -413 0
-176 557 -381 0
-218 565 -346 1
-258 569 -310 1
-297 569 -271 1
-335 566 -231 0
-370 560 -190 0
-403 550 -147 0
-433 537 -103 1
-461 520 -59 0
-486 500 -14 0
-507 478 29 0
-526 452 74 0
-542 423 118 -1
-554 392 161 -1
-562 358 204 0
-568 322 245 -1
-570 284 285 -1
-568 245 322 -1
-562 204 358 0
-554 161 392 -1
-542 118 423 -1
-526 74 452 0
-507 29 478 0
-486 -14 500 0
-461 -59 520 0
-433 -103 537 1
-403 -147 550 0
-370 -190 560 0
-335 -231 566 0
-297 -271 569 1
-258 -310 569 1
-218 -346 565 1
-176 -381 557 0
-133 -413 546 0
-89 -442 532 1
-44 -469 514 1
0 -493 493 0
44 -514 469 -1
89 -532 442 -1
133 -546 413 0
176 -557 381 0
218 -565 346 -1
258 -569 310 -1
297 -569 271 -1
335 -566 231 0
370 -560 190 0
403 -550 147 0
433 -537 103 -1
461 -520 59 0
486 -500 14 0
507 -478 -29 0
526 -452 -74 0
542 -423 -118 1
554 -392 -161 1
562 -358 -204 0
568 -322 -245 1
570 -284 -285 1
568 -245 -322 1
562 -204 -358 0
554 -161 -392 1
542 -118 -423 1
526 -74 -452 0
507 -29 -478 0
486 14 -500 0
461 59 -520 0
433 103 -537 -1
403 147 -550 0
370 190 -560 0
335 231 -566 0
297 271 -569 -1
258 310 -569 -1
218 346 -565 -1
176 381 -557 0
133 413 -546 0
89 442 -532 -1
44 469 -514 -1
0 493 -493 0
-44 514 -469 1
-89 532 -442 1
-133 546 -413 0
-176 557 -381 0
-218 565 -346 1
-258 569 -310 1
-297 569 -271 1
-335 566 -231 0
-370 560 -190 0
-403 550 -147 0
-433 537 -103 1
-461 520 -59 0
-486 500 -14 0
-507 478 29 0
-526 452 74 0
-542 423 118 -1
-554 392 161 -1
-562 358 204 0
-568 322 245 -1
-570 284 285 -1
-568 245 322 -1
-562 204 358 0
-554 161 392 -1
-542 118 423 -1
-526 74 452 0
-507 29 478 0
-486 -14 500 0
-461 -59 520 0
-433 -103 537 1
-403 -147 550 0
-370 -190 560 0
-335 -231 566 0
-297 -271 569 1
-258 -310 569 1
-218 -346 565 1
-176 -381 557 0
-133 -413 546 0
-89 -442 532 1
-44 -469 514 1
0 -493 493 0
44 -514 469 -1
89 -532 442 -1
133 -546 413 0
176 -557 381 0
218 -565 346 -1
258 -569 310 -1
297 -569 271 -1
335 -566 231 0
370 -560 190 0
403 -550 147 0
433 -537 103 -1
461 -520 59 0
486 -500 14 0
507 -478 -29 0
526 -452 -74 0
542 -423 -118 1
554 -392 -161 1
562 -358 -204 0
568 -322 -245 1
570 -284 -285 1
568 -245 -322 1
562 -204 -358 0
554 -161 -392 1
542 -118 -423 1
526 -74 -452 0
507 -29 -478 0
486 14 -500 0
461 59 -520 0
433 103 -537 -1
403 147 -550 0
370 190 -560 0
335 231 -566 0
297 271 -569 -1
258 310 -569 -1
218 346 -565 -1
176 381 -557 0
133 413 -546 0
89 442 -532 -1
44 469 -514 -1
0 493 -493 0
-44 514 -469 1
-89 532 -442 1
-133 546 -413 0
-176 557 -381 0
-218 565 -346 1
-258 569 -310 1
-297 569 -271 1
-335 566 -231 0
-370 560 -190 0
-403 550 -147 0
-433 537 -103 1
-461 520 -59 0
-486 500 -14 0
-507 478 29 0
-526 452 74 0
-542 423 118 -1
-554 392 161 -1
-562 358 204 0
-568 322 245 -1
-570 284 285 -1
-568 245 322 -1
-562 204 358 0
-554 161 392 -1
-542 118 423 -1
-526 74 452 0
-507 29 478 0
-486 -14 500 0
-461 -59 520 0
-433 -103 537 1
-403 -147 550 0
-370 -190 560 0
-335 -231 566 0
-297 -271 569 1
-258 -310 569 1
-218 -346 565 1
-176 -381 557 0
-133 -413 546 0
-89 -442 532 1
-44 -469 514 1
0 -493 493 0
44 -514 469 -1
89 -532 442 -1
133 -546 413 0
176 -557 381 0
218 -565 346 -1
258 -569 310 -1
297 -569 271 -1
335 -566 231 0
370 -560 190 0
403 -550 147 0
433 -537 103 -1
461 -520 59 0
486 -500 14 0
507 -478 -29 0
526 -452 -74 0
542 -423 -118 1
554 -392 -161 1
562 -358 -204 0
568 -322 -245 1
570 -284 -285 1
568 -245 -322 1
562 -204 -358 0
554 -161 -392 1
542 -118 -423 1
526 -74 -452 0
507 -29 -478 0
486 14 -500 0
461 59 -520 0
433 103 -537 -1
403 147 -550 0
370 190 -560 0
335 231 -566 0
297 271 -569 -1
258 310 -569 -1
218 346 -565 -1
176 381 -557 0
133 413 -546 0
89 442 -532 -1
44 469 -514 -1
0 493 -493 0
-44 514 -469 1
-89 532 -442 1
-133 546 -413 0
-176 557 -381 0
-218 565 -346 1
-258 569 -310 1
-297 569 -271 1
-335 566 -231 0
-370 560 -190 0
-403 550 -147 0
-433 537 -103 1
-461 520 -59 0
-486 500 -14 0
-507 478 29 0
-526 452 74 0
-542 423 118 -1
-554 392 161 -1
-562 358 204 0
-568 322 245 -1
-570 284 285 -1
-568 245 322 -1
-562 204 358 0
-554 161 392 -1
-542 118 423 -1
-526 74 452 0
-507 29 478 0
-486 -14 500 0
-461 -59 520 0
-433 -103 537 1
-403 -147 550 0
-370 -190 560 0
-335 -231 566 0
-297 -271 569 1
-258 -310 569 1
-218 -346 565 1
-176 -381 557 0
-133 -413 546 0
-89 -442 532 1
-44 -469 514 1
0 -493 493 0
44 -514 469 -1
89 -532 442 -1
133 -546 413 0
176 -557 381 0
218 -565 346 -1
258 -569 310 -1
297 -569 271 -1
335 -566 231 0
370 -560 190 0
403 -550 147 0
433 -537 103 -1
461 -520 59 0
486 -500 14 0
507 -478 -29 0
526 -452 -74 0
542 -423 -118 1
554 -392 -161 1
562 -358 -204 0
568 -322 -245 1
570 -284 -285 1
568 -245 -322 1
562 -204 -358 0
554 -161 -392 1
542 -118 -423 1
526 -74 -452 0
507 -29 -478 0
486 14 -500 0
461 59 -520 0
433 103 -537 -1
403 147 -550 0
370 190 -560 0
335 231 -566 0
297 271 -569 -1
258 310 -569 -1
218 346 -565 -1
176 381 -557 0
133 413 -546 0
89 442 -532 -1
44 469 -514 -1
0 493 -493 0
-44 514 -469 1
-89 532 -442 1
-133 546 -413 0
-176 557 -381 0
-218 565 -346 1
-258 569 -310 1
-297 569 -271 1
-335 566 -231 0
-370 560 -190 0
-403 550 -147 0
-433 537 -103 1
-461 520 -59 0
-486 500 -14 0
-507 478 29 0
-526 452 74 0
-542 423 118 -1
-554 392 161 -1
-562 358 204 0
-568 322 245 -1
-570 284 285 -1
-568 245 322 -1
-562 204 358 0
-554 161 392 -1
-542 118 423 -1
-526 74 452 0
-507 29 478 0
-486 -14 500 0
-461 -59 520 0
-433 -103 537 1
-403 -147 550 0
-370 -190 560 0
-335 -231 566 0
-297 -271 569 1
-258 -310 569 1
-218 -346 565 1
-176 -381 557 0
-133 -413 546 0
-89 -442 532 1
-44 -469 514 1
0 -493 493 0
44 -514 469 -1
89 -532 442 -1
133 -546 413 0
176 -557 381 0
218 -565 346 -1
258 -569 310 -1
297 -569 271 -1
335 -566 231 0
370 -560 190 0
403 -550 147 0
433 -537 103 -1
461 -520 59 0
486 -500 14 0
507 -478 -29 0
526 -452 -74 0
542 -423 -118 1
554 -392 -161 1
562 -358 -204 0
568 -322 -245 1
570 -284 -285 1
568 -245 -322 1
562 -204 -358 0
554 -161 -392 1
542 -118 -423 1
526 -74 -452 0
507 -29 -478 0
486 14 -500 0
461 59 -520 0
433 103 -537 -1
403 147 -550 0
370 190 -560 0
335 231 -566 0
297 271 -569 -1
258 310 -569 -1
218 346 -565 -1
176 381 -557 0
133 413 -546 0
89 442 -532 -1
44 469 -514 -1
0 493 -493 0
-44 514 -469 1
-89 532 -442 1
-133 546 -413 0
-176 557 -381 0
-218 565 -346 1
-258 569 -310 1
-297 569 -271 1
-335 566 -231 0
-370 560 -190 0
-403 550 -147 0
-433 537 -103 1
-461 520 -59 0
-486 500 -14 0
-507 478 29 0
-526 452 74 0
-542 423 118 -1
-554 392 161 -1
-562 358 204 0
-568 322 245 -1
-570 284 285 -1
-568 245 322 -1
-562 204 358 0
-554 161 392 -1
-542 118 423 -1
-526 74 452 0
-507 29 478 0
-486 -14 500 0
-461 -59 520 0
-433 -103 537 1
-403 -147 550 0
-370 -190 560 0
-335 -231 566 0
-297 -271 569 1
-258 -310 569 1
-218 -346 565 1
-176 -381 557 0
-133 -413 546 0
-89 -442 532 1
-44 -469 514 1
0 -493 493 0
44 -514 469 -1
89 -532 442 -1
133 -546 413 0
176 -557 381 0
218 -565 346 -1
258 -569 310 -1
297 -569 271 -1
335 -566 231 0
370 -560 190 0
403 -550 147 0
433 -537 103 -1
461 -520 59 0
486 -500 14 0
507 -478 -29 0
526 -452 -74 0
542 -423 -118 1
554 -392 -161 1
562 -358 -204 0
568 -322 -245 1
570 -284 -285 1
568 -245 -322 1
562 -204 -358 0
554 -161 -392 1
542 -118 -423 1
526 -74 -452 0
507 -29 -478 0
486 14 -500 0
461 59 -520 0
433 103 -537 -1
403 147 -550 0
370 190 -560 0
335 231 -566 0
297 271 -569 -1
258 310 -569 -1
218 346 -565 -1
176 381 -557 0
133 413 -546 0
89 442 -532 -1
44 469 -514 -1
0 493 -493 0
-44 514 -469 1
-89 532 -442 1
-133 546 -413 0
-176 557 -381 0
-218 565 -346 1
-258 569 -310 1
-297 569 -271 1
-335 566 -231 0
-370 560 -190 0
-403 550 -147 0
-433 537 -103 1
-461 520 -59 0
-486 500 -14 0
-507 478 29 0
-526 452 74 0
-542 423 118 -1
-554 392 161 -1
-562 358 204 0
-568 322 245 -1
-570 284 285 -1
-568 245 322 -1
-562 204 358 0
-554 161 392 -1
-542 118 423 -1
-526 74 452 0
-507 29 478 0
-486 -14 500 0
-461 -59 520 0
-433 -103 537 1
-403 -147 550 0
-370 -190 560 0
-335 -231 566 0
-297 -271 569 1
-258 -310 569 1
-218 -346 565 1
-176 -381 557 0
-133 -413 546 0
-89 -442 532 1
-44 -469 514 1
0 -493 493 0
44 -514 469 -1
89 -532 442 -1
133 -546 413 0
176 -557 381 0
218 -565 346 -1
258 -569 310 -1
297 -569 271 -1
335 -566 231 0
370 -560 190 0
403 -550 147 0
433 -537 103 -1
461 -520 59 0
486 -500 14 0
507 -478 -29 0
526 -452 -74 0
542 -423 -118 1
554 -392 -161 1
562 -358 -204 0
568 -322 -245 1
570 -284 -285 1
568 -245 -322 1
562 -204 -358 0
554 -161 -392 1
542 -118 -423 1
526 -74 -452 0
507 -29 -478 0
486 14 -500 0
461 59 -520 0
433 103 -537 -1
403 147 -550 0
370 190 -560 0
335 231 -566 0
297 271 -569 -1
258 310 -569 -1
218 346 -565 -1
176 381 -557 0
133 413 -546 0
89 442 -532 -1
44 469 -514 -1
0 493 -493 0
-44 514 -469 1
-89 532 -442 1
-133 546 -413 0
-176 557 -381 0
-218 565 -346 1
-258 569 -310 1
-297 569 -271 1
-335 566 -231 0
-370 560 -190 0
-403 550 -147 0
-433 537 -103 1
-461 520 -59 0
-486 500 -14 0
-507 478 29 0
-526 452 74 0
-542 423 118 -1
-554 392 161 -1
-562 358 204 0
-568 322 245 -1
-570 284 285 -1
-568 245 322 -1
-562 204 358 0
-554 161 392 -1
-542 118 423 -1
-526 74 452 0
-507 29 478 0
-486 -14 500 0
-461 -59 520 0
-433 -103 537 1
-403 -147 550 0
-370 -190 560 0
-335 -231 566 0
-297 -271 569 1
-258 -310 569 1
-218 -346 565 1
-176 -381 557 0
-133 -413 546 0
-89 -442 532 1
-44 -469 514 1
0 -493 493 0
44 -514 469 -1
89 -532 442 -1
133 -546 413 0
176 -557 381 0
218 -565 346 -1
258 -569 310 -1
297 -569 271 -1
335 -566 231 0
370 -560 190 0
403 -550 147 0
433 -537 103 -1
461 -520 59 0
486 -500 14 0
507 -478 -29 0
526 -452 -74 0
542 -423 -118 1
554 -392 -161 1
562 -358 -204 0
568 -322 -245 1
570 -284 -285 1
568 -245 -322 1
562 -204 -358 0
554 -161 -392 1
542 -118 -423 1
526 -74 -452 0
507 -29 -478 0
486 14 -500 0
461 59 -520 0
433 103 -537 -1
403 147 -550 0
370 190 -560 0
335 231 -566 0
297 271 -569 -1
258 310 -569 -1
218 346 -565 -1
176 381 -557 0
133 413 -546 0
89 442 -532 -1
44 469 -514 -1
0 493 -493 0
-44 514 -469 1
-89 532 -442 1
-133 546 -413 0
-176 557 -381 0
-218 565 -346 1
-258 569 -310 1
-297 569 -271 1
-335 566 -231 0
-370 560 -190 0
-403 550 -147 0
-433 537 -103 1
-461 520 -59 0
-486 500 -14 0
-507 478 29 0
-526 452 74 0
-542 423 118 -1
-554 392 161 -1
-562 358 204 0
-568 322 245 -1
-570 284 285 -1
-568 245 322 -1
-562 204 358 0
-554 161 392 -1
-542 118 423 -1
-526 74 452 0
-507 29 478 0
-486 -14 500 0
-461 -59 520 0
-433 -103 537 1
-403 -147 550 0
-370 -190 560 0
-335 -231 566 0
-297 -271 569 1
-258 -310 569 1
-218 -346 565 1
-176 -381 557 0
-133 -413 546 0
-89 -442 532 1
-44 -469 514 1
0 -493 493 0
44 -514 469 -1
89 -532 442 -1
133 -546 413 0
176 -557 381 0
218 -565 346 -1
258 -569 310 -1
297 -569 271 -1
335 -566 231 0
370 -560 190 0
403 -550 147 0
433 -537 103 -1
461 -520 59 0
486 -500 14 0
507 -478 -29 0
526 -452 -74 0
542 -423 -118 1
554 -392 -161 1
562 -358 -204 0
568 -322 -245 1
570 -284 -285 1
568 -245 -322 1
562 -204 -358 0
554 -161 -392 1
542 -118 -423 1
526 -74 -452 0
507 -29 -478 0
486 14 -500 0
461 59 -520 0
433 103 -537 -1
403 147 -550 0
370 190 -560 0
335 231 -566 0
297 271 -569 -1
258 310 -569 -1
218 346 -565 -1
176 381 -557 0
133 413 -546 0
89 442 -532 -1
44 469 -514 -1
0 493 -493 0
-44 514 -469 1
-89 532 -442 1
-133 546 -413 0
-176 557 -381 0
-218 565 -346 1
-258 569 -310 1
-297 569 -271 1
-335 566 -231 0
-370 560 -190 0
-403 550 -147 0
-433 537 -103 1
-461 520 -59 0
-486 500 -14 0
-507 478 29 0
-526 452 74 0
-542 423 118 -1
-554 392 161 -1
-562 358 204 0
-568 322 245 -1
-570 284 285 -1
-568 245 322 -1
-562 204 358 0
-554 161 392 -1
-542 118 423 -1
-526 74 452 0
-507 29 478 0
-486 -14 500 0
-461 -59 520 0
-433 -103 537 1
-403 -147 550 0
-370 -190 560 0
-335 -231 566 0
-297 -271 569 1
-258 -310 569 1
-218 -346 565 1
-176 -381 557 0
-133 -413 546 0
-89 -442 532 1
-44 -469 514 1
0 -493 493 0
44 -514 469 -1
89 -532 442 -1
133 -546 413 0
176 -557 381 0
218 -565 346 -1
258 -569 310 -1
297 -569 271 -1
335 -566 231 0
370 -560 190 0
403 -550 147 0
433 -537 103 -1
461 -520 59 0
486 -500 14 0
507 -478 -29 0
526 -452 -74 0
542 -423 -118 1
554 -392 -161 1
562 -358 -204 0
568 -322 -245 1
570 -284 -285 1
568 -245 -322 1
562 -204 -358 0
554 -161 -392 1
542 -118 -423 1
526 -74 -452 0
507 -29 -478 0
486 14 -500 0
461 59 -520 0
433 103 -537 -1
403 147 -550 0
370 190 -560 0
335 231 -566 0
297 271 -569 -1
258 310 -569 -1
218 346 -565 -1
176 381 -557 0
133 413 -546 0
89 442 -532 -1
44 469 -514 -1
0 493 -493 0
-44 514 -469 1
-89 532 -442 1
-133 546 -413 0
-176 557 -381 0
-218 565 -346 1
-258 569 -310 1
-297 569 -271 1
-335 566 -231 0
-370 560 -190 0
-403 550 -147 0
-433 537 -103 1
-461 520 -59 0
-486 500 -14 0
-507 478 29 0
-526 452 74 0
-542 423 118 -1
-554 392 161 -1
-562 358 204 0
-568 322 245 -1
-570 284 285 -1
-568 245 322 -1
-562 204 358 0
-554 161 392 -1
-542 118 423 -1
-526 74 452 0
-507 29 478 0
-486 -14 500 0
-461 -59 520 0
-433 -103 537 1
-403 -147 550 0
-370 -190 560 0
-335 -231 566 0
-297 -271 569 1
-258 -310 569 1
-218 -346 565 1
-176 -381 557 0
-133 -413 546 0
-89 -442 532 1
-44 -469 514 1
0 -493 493 0
44 -514 469 -1
89 -532 442 -1
133 -546 413 0
176 -557 381 0
218 -565 346 -1
258 -569 310 -1
297 -569 271 -1
335 -566 231 0
370 -560 190 0
403 -550 147 0
433 -537 103 -1
461 -520 59 0
486 -500 14 0
507 -478 -29 0
526 -452 -74 0
542 -423 -118 1
554 -392 -161 1
562 -358 -204 0
568 -322 -245 1
570 -284 -285 1
568 -245 -322 1
562 -204 -358 0
554 -161 -392 1
542 -118 -423 1
526 -74 -452 0
507 -29 -478 0
486 14 -500 0
461 59 -520 0
433 103 -537 -1
403 147 -550 0
370 190 -560 0
335 231 -566 0
297 271 -569 -1
258 310 -569 -1
218 346 -565 -1
176 381 -557 0
133 413 -546 0
89 442 -532 -1
44 469 -514 -1
0 493 -493 0
-44 514 -469 1
-89 532 -442 1
-133 546 -413 0
-176 557 -381 0
-218 565 -346 1
-258 569 -310 1
-297 569 -271 1
-335 566 -231 0
-370 560 -190 0
-403 550 -147 0
-433 537 -103 1
-461 520 -59 0
-486 500 -14 0
-507 478 29 0
-526 452 74 0
-542 423 118 -1
-554 392 161 -1
-562 358 204 0
-568 322 245 -1
-570 284 285 -1
-568 245 322 -1
-562 204 358 0
-554 161 392 -1
-542 118 423 -1
-526 74 452 0
-507 29 478 0
-486 -14 500 0
-461 -59 520 0
-433 -103 537 1
-403 -147 550 0
-370 -190 560 0
-335 -231 566 0
-297 -271 569 1
-258 -310 569 1
-218 -346 565 1
-176 -381 557 0
-133 -413 546 0
-89 -442 532 1
-44 -469 514 1
0 -493 493 0
44 -514 469 -1
89 -532 442 -1
133 -546 413 0
176 -557 381 0
218 -565 346 -1
258 -569 310 -1
297 -569 271 -1
335 -566 231 0
370 -560 190 0
403 -550 147 0
433 -537 103 -1
461 -520 59 0
486 -500 14 0
507 -478 -29 0
526 -452 -74 0
542 -423 -118 1
554 -392 -161 1
562 -358 -204 0
568 -322 -245 1
570 -284 -285 1
568 -245 -322 1
562 -204 -358 0
554 -161 -392 1
542 -118 -423 1
526 -74 -452 0
507 -29 -478 0
486 14 -500 0
461 59 -520 0
433 103 -537 -1
403 147 -550 0
370 190 -560 0
335 231 -566 0
297 271 -569 -1
258 310 -569 -1
218 346 -565 -1
176 381 -557 0
133 413 -546 0
89 442 -532 -1
44 469 -514 -1
0 493 -493 0
-44 514 -469 1
-89 532 -442 1
-133 546 -413 0
-176 557 -381 0
-218 565 -346 1
-258 569 -310 1
-297 569 -271 1
-335 566 -231 0
-370 560 -190 0
-403 550 -147 0
-433 537 -103 1
-461 520 -59 0
-486 500 -14 0
-507 478 29 0
-526 452 74 0
-542 423 118 -1
-554 392 161 -1
-562 358 204 0
-568 322 245 -1
-570 285 284 -1
-568 245 322 -1
-562 204 358 0
-554 161 392 -1
-542 118 423 -1
-526 74 452 0
-507 29 478 0
-486 -14 500 0
-461 -59 520 0
-433 -103 537 1
-403 -147 550 0
-370 -190 560 0
-335 -231 566 0
-297 -271 569 1
-258 -310 569 1
-218 -346 565 1
-176 -381 557 0
-133 -413 546 0
-89 -442 532 1
-44 -469 514 1
0 -493 493 0
44 -514 469 -1
89 -532 442 -1
133 -546 413 0
176 -557 381 0
218 -565 346 -1
258 -569 310 -1
297 -569 271 -1
335 -566 231 0
370 -560 190 0
403 -550 147 0
433 -537 103 -1
461 -520 59 0
486 -500 14 0
507 -478 -29 0
526 -452 -74 0
542 -423 -118 1
554 -392 -161 1
562 -358 -204 0
568 -322 -245 1
570 -285 -284 1
568 -245 -322 1
562 -204 -358 0
554 -161 -392 1
542 -118 -423 1
526 -74 -452 0
507 -29 -478 0
486 14 -500 0
461 59 -520 0
433 103 -537 -1
403 147 -550 0
370 190 -560 0
335 231 -566 0
297 271 -569 -1
258 310 -569 -1
218 346 -565 -1
176 381 -557 0
133 413 -546 0
89 442 -532 -1
44 469 -514 -1
0 493 -493 0
-44 514 -469 1
-89 532 -442 1
-133 546 -413 0
-176 557 -381 0
-218 565 -346 1
-258 569 -310 1
-297 569 -271 1
-335 566 -231 0
-370 560 -190 0
-403 550 -147 0
-433 537 -103 1
-461 520 -59 0
-486 500 -14 0
-507 478 29 0
-526 452 74 0
-542 423 118 -1
-554 392 161 -1
-562 358 204 0
-568 322 245 -1
-570 285 284 -1
-568 245 322 -1
-562 204 358 0
-554 161 392 -1
-542 118 423 -1
-526 74 452 0
-507 29 478 0
-486 -14 500 0
-461 -59 520 0
-433 -103 537 1
-403 -147 550 0
-370 -190 560 0
-335 -231 566 0
-297 -271 569 1
-258 -310 569 1
-218 -346 565 1
-176 -381 557 0
-133 -413 546 0
-89 -442 532 1
-44 -469 514 1
0 -493 493 0
44 -514 469 -1
89 -532 442 -1
133 -546 413 0
176 -557 381 0
218 -565 346 -1
258 -569 310 -1
297 -569 271 -1
335 -566 231 0
370 -560 190 0
403 -550 147 0
433 -537 103 -1
461 -520 59 0
486 -500 14 0
507 -478 -29 0
526 -452 -74 0
542 -423 -118 1
554 -392 -161 1
562 -358 -204 0
568 -322 -245 1
570 -285 -284 1
568 -245 -322 1
562 -204 -358 0
554 -161 -392 1
542 -118 -423 1
526 -74 -452 0
507 -29 -478 0
486 14 -500 0
461 59 -520 0
433 103 -537 -1
403 147 -550 0
370 190 -560 0
335 231 -566 0
297 271 -569 -1
258 310 -569 -1
218 346 -565 -1
176 381 -557 0
133 413 -546 0
89 442 -532 -1
44 469 -514 -1
0 493 -493 0
-44 514 -469 1
-89 532 -442 1
-133 546 -413 0
-176 557 -381 0
-218 565 -346 1
-258 569 -310 1
-297 569 -271 1
-335 566 -231 0
-370 560 -190 0
-403 550 -147 0
-433 537 -103 1
-461 520 -59 0
-486 500 -14 0
-507 478 29 0
-526 452 74 0
-542 423 118 -1
-554 392 161 -1
-562 358 204 0
-568 322 245 -1
-570 285 284 -1
-568 245 322 -1
-562 204 358 0
-554 161 392 -1
-542 118 423 -1
-526 74 452 0
-507 29 478 0
-486 -14 500 0
-461 -59 520 0
-433 -103 537 1
-403 -147 550 0
-370 -190 560 0
-335 -231 566 0
-297 -271 569 1
-258 -310 569 1
-218 -346 565 1
-176 -381 557 0
-133 -413 546 0
-89 -442 532 1
-44 -469 514 1
0 -493 493 0
44 -514 469 -1
89 -532 442 -1
133 -546 413 0
176 -557 381 0
218 -565 346 -1
258 -569 310 -1
297 -569 271 -1
335 -566 231 0
370 -560 190 0
403 -550 147 0
433 -537 103 -1
461 -520 59 0
486 -500 14 0
507 -478 -29 0
526 -452 -74 0
542 -423 -118 1
554 -392 -161 1
562 -358 -204 0
568 -322 -245 1
570 -285 -284 1
568 -245 -322 1
562 -204 -358 0
554 -161 -392 1
542 -118 -423 1
526 -74 -452 0
507 -29 -478 0
486 14 -500 0
461 59 -520 0
433 103 -537 -1
403 147 -550 0
370 190 -560 0
335 231 -566 0
297 271 -569 -1
258 310 -569 -1
218 346 -565 -1
176 381 -557 0
133 413 -546 0
89 442 -532 -1
44 469 -514 -1
0 493 -493 0
-44 514 -469 1
-89 532 -442 1
-133 546 -413 0
-176 557 -381 0
-218 565 -346 1
-258 569 -310 1
-297 569 -271 1
-335 566 -231 0
-370 560 -190 0
-403 550 -147 0
-433 537 -103 1
-461 520 -59 0
-486 500 -14 0
-507 478 29 0
-526 452 74 0
-542 423 118 -1
-554 392 161 -1
-562 358 204 0
-568 322 245 -1
-570 285 284 -1
-568 245 322 -1
-562 204 358 0
-554 161 392 -1
-542 118 423 -1
-526 74 452 0
-507 29 478 0
-486 -14 500 0
-461 -59 520 0
-433 -103 537 1
-403 -147 550 0
-370 -190 560 0
-335 -231 566 0
-297 -271 569 1
-258 -310 569 1
-218 -346 565 1
-176 -381 557 0
-133 -413 546 0
-89 -442 532 1
-44 -469 514 1
0 -493 493 0
44 -514 469 -1
89 -532 442 -1
133 -546 413 0
176 -557 381 0
218 -565 346 -1
258 -569 310 -1
297 -569 271 -1
335 -566 231 0
370 -560 190 0
403 -550 147 0
433 -537 103 -1
461 -520 59 0
486 -500 14 0
507 -478 -29 0
526 -452 -74 0
542 -423 -118 1
554 -392 -161 1
562 -358 -204 0
568 -322 -245 1
570 -285 -284 1
568 -245 -322 1
562 -204 -358 0
554 -161 -392 1
542 -118 -423 1
526 -74 -452 0
507 -29 -478 0
486 14 -500 0
461 59 -520 0
433 103 -537 -1
403 147 -550 0
370 190 -560 0
335 231 -566 0
297 271 -569 -1
258 310 -569 -1
218 346 -565 -1
176 381 -557 0
133 413 -546 0
89 442 -532 -1
44 469 -514 -1
0 493 -493 0
-44 514 -469 1
-89 532 -442 1
-133 546 -413 0
-176 557 -381 0
-218 565 -346 1
-258 569 -310 1
-297 569 -271 1
-335 566 -231 0
-370 560 -190 0
-403 550 -147 0
-433 537 -103 1
-461 520 -59 0
-486 500 -14 0
-507 478 29 0
-526 452 74 0
-542 423 118 -1
-554 392 161 -1
-562 358 204 0
-568 322 245 -1
-570 285 284 -1
-568 245 322 -1
-562 204 358 0
-554 161 392 -1
-542 118 423 -1
-526 74 452 0
-507 29 478 0
-486 -14 500 0
-461 -59 520 0
-433 -103 537 1
-403 -147 550 0
-370 -190 560 0
-335 -231 566 0
-297 -271 569 1
-258 -310 569 1
-218 -346 565 1
-176 -381 557 0
-133 -413 546 0
-89 -442 532 1
-44 -469 514 1
0 -493 493 0
44 -514 469 -1
89 -532 442 -1
133 -546 413 0
176 -557 381 0
218 -565 346 -1
258 -569 310 -1
297 -569 271 -1
335 -566 231 0
370 -560 190 0
403 -550 147 0
433 -537 103 -1
461 -520 59 0
486 -500 14 0
507 -478 -29 0
526 -452 -74 0
542 -423 -118 1
554 -392 -161 1
562 -358 -204 0
568 -322 -245 1
570 -285 -284 1
568 -245 -322 1
562 -204 -358 0
554 -161 -392 1
542 -118 -423 1
526 -74 -452 0
507 -29 -478 0
486 14 -500 0
461 59 -520 0
433 103 -537 -1
403 147 -550 0
370 190 -560 0
335 231 -566 0
297 271 -569 -1
258 310 -569 -1
218 346 -565 -1
176 381 -557 0
133 413 -546 0
89 442 -532 -1
44 469 -514 -1
0 493 -493 0
-44 514 -469 1
-89 532 -442 1
-133 546 -413 0
-176 557 -381 0
-218 565 -346 1
-258 569 -310 1
-297 569 -271 1
-335 566 -231 0
-370 560 -190 0
-403 550 -147 0
-433 537 -103 1
-461 520 -59 0
-486 500 -14 0
-507 478 29 0
-526 452 74 0
-542 423 118 -1
-554 392 161 -1
-562 358 204 0
-568 322 245 -1
-570 285 284 -1
-568 245 322 -1
-562 204 358 0
-554 161 392 -1
-542 118 423 -1
-526 74 452 0
-507 29 478 0
-486 -14 500 0
-461 -59 520 0
-433 -103 537 1
-403 -147 550 0
-370 -190 560 0
-335 -231 566 0
-297 -271 569 1
-258 -310 569 1
-218 -346 565 1
-176 -381 557 0
-133 -413 546 0
-89 -442 532 1
-44 -469 514 1
0 -493 493 0
44 -514 469 -1
89 -532 442 -1
133 -546 413 0
176 -557 381 0
218 -565 346 -1
258 -569 310 -1
297 -569 271 -1
335 -566 231 0
370 -560 190 0
403 -550 147 0
433 -537 103 -1
461 -520 59 0
486 -500 14 0
507 -478 -29 0
526 -452 -74 0
542 -423 -118 1
554 -392 -161 1
562 -358 -204 0
568 -322 -245 1
570 -285 -284 1
568 -245 -322 1
562 -204 -358 0
554 -161 -392 1
542 -118 -423 1
526 -74 -452 0
507 -29 -478 0
486 14 -500 0
461 59 -520 0
433 103 -537 -1
403 147 -550 0
370 190 -560 0
335 231 -566 0
297 271 -569 -1
258 310 -569 -1
218 346 -565 -1
176 381 -557 0
133 413 -546 0
89 442 -532 -1
44 469 -514 -1
0 493 -493 0
-44 514 -469 1
-89 532 -442 1
-133 546 -413 0
-176 557 -381 0
-218 565 -346 1
-258 569 -310 1
-297 569 -271 1
-335 566 -231 0
-370 560 -190 0
-403 550 -147 0
-433 537 -103 1
-461 520 -59 0
-486 500 -14 0
-507 478 29 0
-526 452 74 0
-542 423 118 -1
-554 392 161 -1
-562 358 204 0
-568 322 245 -1
-570 285 284 -1
-568 245 322 -1
-562 204 358 0
-554 161 392 -1
-542 118 423 -1
-526 74 452 0
-507 29 478 0
-486 -14 500 0
-461 -59 520 0
-433 -103 537 1
-403 -147 550 0
-370 -190 560 0
-335 -231 566 0
-297 -271 569 1
-258 -310 569 1
-218 -346 565 1
-176 -381 557 0
-133 -413 546 0
-89 -442 532 1
-44 -469 514 1
0 -493 493 0
44 -514 469 -1
89 -532 442 -1
133 -546 413 0
176 -557 381 0
218 -565 346 -1
258 -569 310 -1
297 -569 271 -1
335 -566 231 0
370 -560 190 0
403 -550 147 0
433 -537 103 -1
461 -520 59 0
486 -500 14 0
507 -478 -29 0
526 -452 -74 0
542 -423 -118 1
554 -392 -161 1
562 -358 -204 0
568 -322 -245 1
570 -285 -284 1
568 -245 -322 1
562 -204 -358 0
554 -161 -392 1
542 -118 -423 1
526 -74 -452 0
507 -29 -478 0
486 14 -500 0
461 59 -520 0
433 103 -537 -1
403 147 -550 0
370 190 -560 0
335 231 -566 0
297 271 -569 -1
258 310 -569 -1
218 346 -565 -1
176 381 -557 0
133 413 -546 0
89 442 -532 -1
44 469 -514 -1
0 493 -493 0
-44 514 -469 1
-89 532 -442 1
-133 546 -413 0
-176 557 -381 0
-218 565 -346 1
-258 569 -310 1
-297 569 -271 1
-335 566 -231 0
-370 560 -190 0
-403 550 -147 0
-433 537 -103 1
-461 520 -59 0
-486 500 -14 0
-507 478 29 0
-526 452 74 0
-542 423 118 -1
-554 392 161 -1
-562 358 204 0
-568 322 245 -1
-570 285 284 -1
-568 245 322 -1
-562 204 358 0
-554 161 392 -1
-542 118 423 -1
-526 74 452 0
-507 29 478 0
-486 -14 500 0
-461 -59 520 0
-433 -103 537 1
-403 -147 550 0
-370 -190 560 0
-335 -231 566 0
-297 -271 569 1
-258 -310 569 1
-218 -346 565 1
-176 -381 557 0
-133 -413 546 0
-89 -442 532 1
-44 -469 514 1
0 -493 493 0
44 -514 469 -1
89 -532 442 -1
133 -546 413 0
176 -557 381 0
218 -565 346 -1
258 -569 310 -1
297 -569 271 -1
335 -566 231 0
370 -560 190 0
403 -550 147 0
433 -537 103 -1
461 -520 59 0
486 -500 14 0
507 -478 -29 0
526 -452 -74 0
542 -423 -118 1
554 -392 -161 1
562 -358 -204 0
568 -322 -245 1
570 -285 -284 1
568 -245 -322 1
562 -204 -358 0
554 -161 -392 1
542 -118 -423 1
526 -74 -452 0
507 -29 -478 0
486 14 -500 0
461 59 -520 0
433 103 -537 -1
403 147 -550 0
370 190 -560 0
335 231 -566 0
297 271 -569 -1
258 310 -569 -1
218 346 -565 -1
176 381 -557 0
133 413 -546 0
89 442 -532 -1
44 469 -514 -1
0 493 -493 0
-44 514 -469 1
-89 532 -442 1
-133 546 -413 0
-176 557 -381 0
-218 565 -346 1
-258 569 -310 1
-297 569 -271 1
-335 566 -231 0
-370 560 -190 0
-403 550 -147 0
-433 537 -103 1
-461 520 -59 0
-486 500 -14 0
-507 478 29 0
-526 452 74 0
-542 423 118 -1
-554 392 161 -1
-562 358 204 0
-568 322 245 -1
-570 285 284 -1
-568 245 322 -1
-562 204 358 0
-554 161 392 -1
-542 118 423 -1
-526 74 452 0
-507 29 478 0
-486 -14 500 0
-461 -59 520 0
-433 -103 537 1
-403 -147 550 0
-370 -190 560 0
-335 -231 566 0
-297 -271 569 1
-258 -310 569 1
-218 -346 565 1
-176 -381 557 0
-133 -413 546 0
-89 -442 532 1
-44 -469 514 1
0 -493 493 0
44 -514 469 -1
89 -532 442 -1
133 -546 413 0
176 -557 381 0
218 -565 346 -1
258 -569 310 -1
297 -569 271 -1
335 -566 231 0
370 -560 190 0
403 -550 147 0
433 -537 103 -1
461 -520 59 0
486 -500 14 0
507 -478 -29 0
526 -452 -74 0
542 -423 -118 1
554 -392 -161 1
562 -358 -204 0
568 -322 -245 1
570 -285 -284 1
568 -245 -322 1
562 -204 -358 0
554 -161 -392 1
542 -118 -423 1
526 -74 -452 0
507 -29 -478 0
486 14 -500 0
461 59 -520 0
433 103 -537 -1
403 147 -550 0
370 190 -560 0
335 231 -566 0
297 271 -569 -1
258 310 -569 -1
218 346 -565 -1
176 381 -557 0
133 413 -546 0
89 442 -532 -1
44 469 -514 -1
0 493 -493 0
-44 514 -469 1
-89 532 -442 1
-133 546 -413 0
-176 557 -381 0
-218 565 -346 1
-258 569 -310 1
-297 569 -271 1
-335 566 -231 0
-370 560 -190 0
-403 550 -147 0
-433 537 -103 1
-461 520 -59 0
-486 500 -14 0
-507 478 29 0
-526 452 74 0
-542 423 118 -1
-554 392 161 -1
-562 358 204 0
-568 322 245 -1
-570 285 284 -1
-568 245 322 -1
-562 204 358 0
-554 161 392 -1
-542 118 423 -1
-526 74 452 0
-507 29 478 0
-486 -14 500 0
-461 -59 520 0
-433 -103 537 1
-403 -147 550 0
-370 -190 560 0
-335 -231 566 0
-297 -271 569 1
-258 -310 569 1
-218 -346 565 1
-176 -381 557 0
-133 -413 546 0
-89 -442 532 1
-44 -469 514 1
0 -493 493 0
44 -514 469 -1
89 -532 442 -1
133 -546 413 0
176 -557 381 0
218 -565 346 -1
258 -569 310 -1
297 -569 271 -1
335 -566 231 0
370 -560 190 0
403 -550 147 0
433 -537 103 -1
461 -520 59 0
486 -500 14 0
507 -478 -29 0
526 -452 -74 0
542 -423 -118 1
554 -392 -161 1
562 -358 -204 0
568 -322 -245 1
570 -285 -284 1
568 -245 -322 1
562 -204 -358 0
554 -161 -392 1
542 -118 -423 1
526 -74 -452 0
507 -29 -478 0
486 14 -500 0
461 59 -520 0
433 103 -537 -1
403 147 -550 0
370 190 -560 0
335 231 -566 0
297 271 -569 -1
258 310 -569 -1
218 346 -565 -1
176 381 -557 0
133 413 -546 0
89 442 -532 -1
44 469 -514 -1
0 493 -493 0
-44 514 -469 1
-89 532 -442 1
-133 546 -413 0
-176 557 -381 0
-218 565 -346 1
-258 569 -310 1
-297 569 -271 1
-335 566 -231 0
-370 560 -190 0
-403 550 -147 0
-433 537 -103 1
-461 520 -59 0
-486 500 -14 0
-507 478 29 0
-526 452 74 0
-542 423 118 -1
-554 392 161 -1
-562 358 204 0
-568 322 245 -1
-570 285 284 -1
-568 245 322 -1
-562 204 358 0
-554 161 392 -1
-542 118 423 -1
-526 74 452 0
-507 29 478 0
-486 -14 500 0
-461 -59 520 0
-433 -103 537 1
-403 -147 550 0
-370 -190 560 0
-335 -231 566 0
-297 -271 569 1
-258 -310 569 1
-218 -346 565 1
-176 -381 557 0
-133 -413 546 0
-89 -442 532 1
-44 -469 514 1
0 -493 493 0
44 -514 469 -1
89 -532 442 -1
133 -546 413 0
176 -557 381 0
218 -565 346 -1
258 -569 310 -1
297 -569 271 -1
335 -566 231 0
370 -560 190 0
403 -550 147 0
433 -537 103 -1
461 -520 59 0
486 -500 14 0
507 -478 -29 0
526 -452 -74 0
542 -423 -118 1
554 -392 -161 1
562 -358 -204 0
568 -322 -245 1
570 -285 -284 1
568 -245 -322 1
562 -204 -358 0
554 -161 -392 1
542 -118 -423 1
526 -74 -452 0
507 -29 -478 0
486 14 -500 0
461 59 -520 0
433 103 -537 -1
403 147 -550 0
370 190 -560 0
335 231 -566 0
297 271 -569 -1
258 310 -569 -1
218 346 -565 -1
176 381 -557 0
133 413 -546 0
89 442 -532 -1
44 469 -514 -1
0 493 -493 0
-44 514 -469 1
-89 532 -442 1
-133 546 -413 0
-176 557 -381 0
-218 565 -346 1
-258 569 -310 1
-297 569 -271 1
-335 566 -231 0
-370 560 -190 0
-403 550 -147 0
-433 537 -103 1
-461 520 -59 0
-486 500 -14 0
-507 478 29 0
-526 452 74 0
-542 423 118 -1
-554 392 161 -1
-562 358 204 0
-568 322 245 -1
-570 285 284 -1
-568 245 322 -1
-562 204 358 0
-554 161 392 -1
-542 118 423 -1
-526 74 452 0
-507 29 478 0
-486 -14 500 0
-461 -59 520 0
-433 -103 537 1
-403 -147 550 0
-370 -190 560 0
-335 -231 566 0
-297 -271 569 1
-258 -310 569 1
-218 -346 565 1
-176 -381 557 0
-133 -413 546 0
-89 -442 532 1
-44 -469 514 1
0 -493 493 0
44 -514 469 -1
89 -532 442 -1
133 -546 413 0
176 -557 381 0
218 -565 346 -1
258 -569 310 -1
297 -569 271 -1
335 -566 231 0
370 -560 190 0
403 -550 147 0
433 -537 103 -1
461 -520 59 0
486 -500 14 0
507 -478 -29 0
526 -452 -74 0
542 -423 -118 1
554 -392 -161 1
562 -358 -204 0
568 -322 -245 1
570 -285 -284 1
568 -245 -322 1
562 -204 -358 0
554 -161 -392 1
542 -118 -423 1
526 -74 -452 0
507 -29 -478 0
486 14 -500 0
461 59 -520 0
433 103 -537 -1
403 147 -550 0
370 190 -560 0
335 231 -566 0
297 271 -569 -1
258 310 -569 -1
218 346 -565 -1
176 381 -557 0
133 413 -546 0
89 442 -532 -1
44 469 -514 -1
0 493 -493 0
-44 514 -469 1
-89 532 -442 1
-133 546 -413 0
-176 557 -381 0
-218 565 -346 1
-258 569 -310 1
-297 569 -271 1
-335 566 -231 0
-370 560 -190 0
-403 550 -147 0
-433 537 -103 1
-461 520 -59 0
-486 500 -14 0
-507 478 29 0
-526 452 74 0
-542 423 118 -1
-554 392 161 -1
-562 358 204 0
-568 322 245 -1
-570 285 284 -1
-568 245 322 -1
-562 204 358 0
-554 161 392 -1
-542 118 423 -1
-526 74 452 0
-507 29 478 0
-486 -14 500 0
-461 -59 520 0
-433 -103 537 1
-403 -147 550 0
-370 -190 560 0
-335 -231 566 0
-297 -271 569 1
-258 -310 569 1
-218 -346 565 1
-176 -381 557 0
-133 -413 546 0
-89 -442 532 1
-44 -469 514 1
0 -493 493 0
44 -514 469 -1
89 -532 442 -1
133 -546 413 0
176 -557 381 0
218 -565 346 -1
258 -569 310 -1
297 -569 271 -1
335 -566 231 0
370 -560 190 0
403 -550 147 0
433 -537 103 -1
461 -520 59 0
486 -500 14 0
507 -478 -29 0
526 -452 -74 0
542 -423 -118 1
554 -392 -161 1
562 -358 -204 0
568 -322 -245 1
570 -285 -284 1
568 -245 -322 1
562 -204 -358 0
554 -161 -392 1
542 -118 -423 1
526 -74 -452 0
507 -29 -478 0
486 14 -500 0
461 59 -520 0
433 103 -537 -1
403 147 -550 0
370 190 -560 0
335 231 -566 0
297 271 -569 -1
258 310 -569 -1
218 346 -565 -1
176 381 -557 0
133 413 -546 0
89 442 -532 -1
44 469 -514 -1
0 493 -493 0
-44 514 -469 1
-89 532 -442 1
-133 546 -413 0
-176 557 -381 0
-218 565 -346 1
-258 569 -310 1
-297 569 -271 1
-335 566 -231 0
-370 560 -190 0
-403 550 -147 0
-433 537 -103 1
-461 520 -59 0
-486 500 -14 0
-507 478 29 0
-526 452 74 0
-542 423 118 -1
-554 392 161 -1
-562 358 204 0
-568 322 245 -1
-570 285 284 -1
-568 245 322 -1
-562 204 358 0
-554 161 392 -1
-542 118 423 -1
-526 74 452 0
-507 29 478 0
-486 -14 500 0
-461 -59 520 0
-433 -103 537 1
-403 -147 550 0
-370 -190 560 0
-335 -231 566 0
-297 -271 569 1
-258 -310 569 1
-218 -346 565 1
-176 -381 557 0
-133 -413 546 0
-89 -442 532 1
-44 -469 514 1
0 -493 493 0
44 -514 469 -1
89 -532 442 -1
133 -546 413 0
176 -557 381 0
218 -565 346 -1
258 -569 310 -1
297 -569 271 -1
335 -566 231 0
370 -560 190 0
403 -550 147 0
433 -537 103 -1
461 -520 59 0
486 -500 14 0
507 -478 -29 0
526 -452 -74 0
542 -423 -118 1
554 -392 -161 1
562 -358 -204 0
568 -322 -245 1
570 -285 -284 1
568 -245 -322 1
562 -204 -358 0
554 -161 -392 1
542 -118 -423 1
526 -74 -452 0
507 -29 -478 0
486 14 -500 0
461 59 -520 0
433 103 -537 -1
403 147 -550 0
370 190 -560 0
335 231 -566 0
297 271 -569 -1
258 310 -569 -1
218 346 -565 -1
176 381 -557 0
133 413 -546 0
89 442 -532 -1
44 469 -514 -1
0 493 -493 0
-44 514 -469 1
-89 532 -442 1
-133 546 -413 0
-176 557 -381 0
-218 565 -346 1
-258 569 -310 1
-297 569 -271 1
-335 566 -231 0
-370 560 -190 0
-403 550 -147 0
-433 537 -103 1
-461 520 -59 0
-486 500 -14 0
-507 478 29 0
-526 452 74 0
-542 423 118 -1
-554 392 161 -1
-562 358 204 0
-568 322 245 -1
-570 285 284 -1
-568 245 322 -1
-562 204 358 0
-554 161 392 -1
-542 118 423 -1
-526 74 452 0
-507 29 478 0
-486 -14 500 0
-461 -59 520 0
-433 -103 537 1
-403 -147 550 0
-370 -190 560 0
-335 -231 566 0
-297 -271 569 1
-258 -310 569 1
-218 -346 565 1
-176 -381 557 0
-133 -413 546 0
-89 -442 532 1
-44 -469 514 1
0 -493 493 0
44 -514 469 -1
89 -532 442 -1
133 -546 413 0
176 -557 381 0
218 -565 346 -1
258 -569 310 -1
297 -569 271 -1
335 -566 231 0
370 -560 190 0
403 -550 147 0
433 -537 103 -1
461 -520 59 0
486 -500 14 0
507 -478 -29 0
526 -452 -74 0
542 -423 -118 1
554 -392 -161 1
562 -358 -204 0
568 -322 -245 1
570 -285 -284 1
568 -245 -322 1
562 -204 -358 0
554 -161 -392 1
542 -118 -423 1
526 -74 -452 0
507 -29 -478 0
486 14 -500 0
461 59 -520 0
433 103 -537 -1
403 147 -550 0
370 190 -560 0
335 231 -566 0
297 271 -569 -1
258 310 -569 -1
218 346 -565 -1
176 381 -557 0
133 413 -546 0
89 442 -532 -1
44 469 -514 -1
0 493 -493 0
-44 514 -469 1
-89 532 -442 1
-133 546 -413 0
-176 557 -381 0
-218 565 -346 1
-258 569 -310 1
-297 569 -271 1
-335 566 -231 0
-370 560 -190 0
-403 550 -147 0
-433 537 -103 1
-461 520 -59 0
-486 500 -14 0
-507 478 29 0
-526 452 74 0
-542 423 118 -1
-554 392 161 -1
-562 358 204 0
-568 322 245 -1
-570 285 284 -1
-568 245 322 -1
-562 204 358 0
-554 161 392 -1
-542 118 423 -1
-526 74 452 0
-507 29 478 0
-486 -14 500 0
-461 -59 520 0
-433 -103 537 1
-403 -147 550 0
-370 -190 560 0
-335 -231 566 0
-297 -271 569 1
-258 -310 569 1
-218 -346 565 1
-176 -381 557 0
-133 -413 546 0
-89 -442 532 1
-44 -469 514 1
0 -493 493 0
44 -514 469 -1
89 -532 442 -1
133 -546 413 0
176 -557 381 0
218 -565 346 -1
258 -569 310 -1
297 -569 271 -1
335 -566 231 0
370 -560 190 0
403 -550 147 0
433 -537 103 -1
461 -520 59 0
486 -500 14 0
507 -478 -29 0
526 -452 -74 0
542 -423 -118 1
554 -392 -161 1
562 -358 -204 0
568 -322 -245 1
570 -285 -284 1
568 -245 -322 1
562 -204 -358 0
554 -161 -392 1
542 -118 -423 1
526 -74 -452 0
507 -29 -478 0
486 14 -500 0
461 59 -520 0
433 103 -537 -1
403 147 -550 0
370 190 -560 0
335 231 -566 0
297 271 -569 -1
258 310 -569 -1
218 346 -565 -1
176 381 -557 0
133 413 -546 0
89 442 -532 -1
44 469 -514 -1
0 493 -493 0
-44 514 -469 1
-89 532 -442 1
-133 546 -413 0
-176 557 -381 0
-218 565 -346 1
-258 569 -310 1
-297 569 -271 1
-335 566 -231 0
-370 560 -190 0
-403 550 -147 0
-433 537 -103 1
-461 520 -59 0
-486 500 -14 0
-507 478 29 0
-526 452 74 0
-542 423 118 -1
-554 392 161 -1
-562 358 204 0
-568 322 245 -1
-570 285 284 -1
-568 245 322 -1
-562 204 358 0
-554 161 392 -1
-542 118 423 -1
-526 74 452 0
-507 29 478 0
-486 -14 500 0
-461 -59 520 0
-433 -103 537 1
-403 -147 550 0
-370 -190 560 0
-335 -231 566 0
-297 -271 569 1
-258 -310 569 1
-218 -346 565 1
-176 -381 557 0
-133 -413 546 0
-89 -442 532 1
-44 -469 514 1
0 -493 493 0
44 -514 469 -1
89 -532 442 -1
133 -546 413 0
176 -557 381 0
218 -565 346 -1
258 -569 310 -1
297 -569 271 -1
335 -566 231 0
370 -560 190 0
403 -550 147 0
433 -537 103 -1
461 -520 59 0
486 -500 14 0
507 -478 -29 0
526 -452 -74 0
542 -423 -118 1
554 -392 -161 1
562 -358 -204 0
568 -322 -245 1
570 -285 -284 1
568 -245 -322 1
562 -204 -358 0
554 -161 -392 1
542 -118 -423 1
526 -74 -452 0
507 -29 -478 0
486 14 -500 0
461 59 -520 0
433 103 -537 -1
403 147 -550 0
370 190 -560 0
335 231 -566 0
297 271 -569 -1
258 310 -569 -1
218 346 -565 -1
176 381 -557 0
133 413 -546 0
89 442 -532 -1
44 469 -514 -1
0 493 -493 0
-44 514 -469 1
-89 532 -442 1
-133 546 -413 0
-176 557 -381 0
-218 565 -346 1
-258 569 -310 1
-297 569 -271 1
-335 566 -231 0
-370 560 -190 0
-403 550 -147 0
-433 537 -103 1
-461 520 -59 0
-486 500 -14 0
-507 478 29 0
-526 452 74 0
-542 423 118 -1
-554 392 161 -1
-562 358 204 0
-568 322 245 -1
-570 285 284 -1
-568 245 322 -1
-562 204 358 0
-554 161 392 -1
-542 118 423 -1
-526 74 452 0
-507 29 478 0
-486 -14 500 0
-461 -59 520 0
-433 -103 537 1
-403 -147 550 0
-370 -190 560 0
-335 -231 566 0
-297 -271 569 1
-258 -310 569 1
-218 -346 565 1
-176 -381 557 0
-133 -413 546 0
-89 -442 532 1
-44 -469 514 1
0 -493 493 0
44 -514 469 -1
89 -532 442 -1
133 -546 413 0
176 -557 381 0
218 -565 346 -1
258 -569 310 -1
297 -569 271 -1
335 -566 231 0
370 -560 190 0
403 -550 147 0
433 -537 103 -1
461 -520 59 0
486 -500 14 0
507 -478 -29 0
526 -452 -74 0
542 -423 -118 1
554 -392 -161 1
562 -358 -204 0
568 -322 -245 1
570 -285 -284 1
568 -245 -322 1
562 -204 -358 0
554 -161 -392 1
542 -118 -423 1
526 -74 -452 0
507 -29 -478 0
486 14 -500 0
461 59 -520 0
433 103 -537 -1
403 147 -550 0
370 190 -560 0
335 231 -566 0
297 271 -569 -1
258 310 -569 -1
218 346 -565 -1
176 381 -557 0
133 413 -546 0
89 442 -532 -1
44 469 -514 -1
0 493 -493 0
-44 514 -469 1
-89 532 -442 1
-133 546 -413 0
-176 557 -381 0
-218 565 -346 1
-258 569 -310 1
-297 569 -271 1
-335 566 -231 0
-370 560 -190 0
-403 550 -147 0
-433 537 -103 1
-461 520 -59 0
-486 500 -14 0
-507 478 29 0
-526 452 74 0
-542 423 118 -1
-554 392 161 -1
-562 358 204 0
-568 322 245 -1
-570 285 284 -1
-568 245 322 -1
-562 204 358 0
-554 161 392 -1
-542 118 423 -1
-526 74 452 0
-507 29 478 0
-486 -14 500 0
-461 -59 520 0
-433 -103 537 1
-403 -147 550 0
-370 -190 560 0
-335 -231 566 0
-297 -271 569 1
-258 -310 569 1
-218 -346 565 1
-176 -381 557 0
-133 -413 546 0
-89 -442 532 1
-44 -469 514 1
0 -493 493 0
44 -514 469 -1
89 -532 442 -1
133 -546 413 0
176 -557 381 0
218 -565 346 -1
258 -569 310 -1
297 -569 271 -1
335 -566 231 0
370 -560 190 0
403 -550 147 0
433 -537 103 -1
461 -520 59 0
486 -500 14 0
507 -478 -29 0
526 -452 -74 0
542 -423 -118 1
554 -392 -161 1
562 -358 -204 0
568 -322 -245 1
570 -285 -284 1
568 -245 -322 1
562 -204 -358 0
554 -161 -392 1
542 -118 -423 1
526 -74 -452 0
507 -29 -478 0
486 14 -500 0
461 59 -520 0
433 103 -537 -1
403 147 -550 0
370 190 -560 0
335 231 -566 0
297 271 -569 -1
258 310 -569 -1
218 346 -565 -1
176 381 -557 0
133 413 -546 0
89 442 -532 -1
44 469 -514 -1
0 493 -493 0
-44 514 -469 1
-89 532 -442 1
-133 546 -413 0
-176 557 -381 0
-218 565 -346 1
-258 569 -310 1
-297 569 -271 1
-335 566 -231 0
-370 560 -190 0
-403 550 -147 0
-433 537 -103 1
-461 520 -59 0
-486 500 -14 0
-507 478 29 0
-526 452 74 0
-542 423 118 -1
-554 392 161 -1
-562 358 204 0
-568 322 245 -1
-570 285 284 -1
-568 245 322 -1
-562 204 358 0
-554 161 392 -1
-542 118 423 -1
-526 74 452 0
-507 29 478 0
-486 -14 500 0
-461 -59 520 0
-433 -103 537 1
-403 -147 550 0
-370 -190 560 0
-335 -231 566 0
-297 -271 569 1
-258 -310 569 1
-218 -346 565 1
-176 -381 557 0
-133 -413 546 0
-89 -442 532 1
-44 -469 514 1
0 -493 493 0
44 -514 469 -1
89 -532 442 -1
133 -546 413 0
176 -557 381 0
218 -565 346 -1
258 -569 310 -1
297 -569 271 -1
335 -566 231 0
370 -560 190 0
403 -550 147 0
433 -537 103 -1
461 -520 59 0
486 -500 14 0
507 -478 -29 0
526 -452 -74 0
542 -423 -118 1
554 -392 -161 1
562 -358 -204 0
568 -322 -245 1
570 -285 -284 1
568 -245 -322 1
562 -204 -358 0
554 -161 -392 1
542 -118 -423 1
526 -74 -452 0
507 -29 -478 0
486 14 -500 0
461 59 -520 0
433 103 -537 -1
403 147 -550 0
370 190 -560 0
335 231 -566 0
297 271 -569 -1
258 310 -569 -1
218 346 -565 -1
176 381 -557 0
133 413 -546 0
89 442 -532 -1
44 469 -514 -1
0 493 -493 0
-44 514 -469 1
-89 532 -442 1
-133 546 -413 0
-176 557 -381 0
-218 565 -346 1
-258 569 -310 1
-297 569 -271 1
-335 566 -231 0
-370 560 -190 0
-403 550 -147 0
-433 537 -103 1
-461 520 -59 0
-486 500 -14 0
-507 478 29 0
-526 452 74 0
-542 423 118 -1
-554 392 161 -1
-562 358 204 0
-568 322 245 -1
-570 285 284 -1
-568 245 322 -1
-562 204 358 0
-554 161 392 -1
-542 118 423 -1
-526 74 452 0
-507 29 478 0
-486 -14 500 0
-461 -59 520 0
-433 -103 537 1
-403 -147 550 0
-370 -190 560 0
-335 -231 566 0
-297 -271 569 1
-258 -310 569 1
-218 -346 565 1
-176 -381 557 0
-133 -413 546 0
-89 -442 532 1
-44 -469 514 1
0 -493 493 0
44 -514 469 -1
89 -532 442 -1
133 -546 413 0
176 -557 381 0
218 -565 346 -1
258 -569 310 -1
297 -569 271 -1
335 -566 231 0
370 -560 190 0
403 -550 147 0
433 -537 103 -1
461 -520 59 0
486 -500 14 0
507 -478 -29 0
526 -452 -74 0
542 -423 -118 1
554 -392 -161 1
562 -358 -204 0
568 -322 -245 1
570 -285 -284 1
568 -245 -322 1
562 -204 -358 0
554 -161 -392 1
542 -118 -423 1
526 -74 -452 0
507 -29 -478 0
486 14 -500 0
461 59 -520 0
433 103 -537 -1
403 147 -550 0
370 190 -560 0
335 231 -566 0
297 271 -569 -1
258 310 -569 -1
218 346 -565 -1
176 381 -557 0
133 413 -546 0
89 442 -532 -1
44 469 -514 -1
0 493 -493 0
-44 514 -469 1
-89 532 -442 1
-133 546 -413 0
-176 557 -381 0
-218 565 -346 1
-258 569 -310 1
-297 569 -271 1
-335 566 -231 0
-370 560 -190 0
-403 550 -147 0
-433 537 -103 1
-461 520 -59 0
-486 500 -14 0
-507 478 29 0
-526 452 74 0
-542 423 118 -1
-554 392 161 -1
-562 358 204 0
-568 322 245 -1
-570 285 284 -1
-568 245 322 -1
-562 204 358 0
-554 161 392 -1
-542 118 423 -1
-526 74 452 0
-507 29 478 0
-486 -14 500 0
-461 -59 520 0
-433 -103 537 1
-403 -147 550 0
-370 -190 560 0
-335 -231 566 0
-297 -271 569 1
-258 -310 569 1
-218 -346 565 1
-176 -381 557 0
-133 -413 546 0
-89 -442 532 1
-44 -469 514 1
0 -493 493 0
44 -514 469 -1
89 -532 442 -1
133 -546 413 0
176 -557 381 0
218 -565 346 -1
258 -569 310 -1
297 -569 271 -1
335 -566 231 0
370 -560 190 0
403 -550 147 0
433 -537 103 -1
461 -520 59 0
486 -500 14 0
507 -478 -29 0
526 -452 -74 0
542 -423 -118 1
554 -392 -161 1
562 -358 -204 0
568 -322 -245 1
570 -285 -284 1
568 -245 -322 1
562 -204 -358 0
554 -161 -392 1
542 -118 -423 1
526 -74 -452 0
507 -29 -478 0
486 14 -500 0
461 59 -520 0
433 103 -537 -1
403 147 -550 0
370 190 -560 0
335 231 -566 0
297 271 -569 -1
258 310 -569 -1
218 346 -565 -1
176 381 -557 0
133 413 -546 0
89 442 -532 -1
44 469 -514 -1
0 493 -493 0
-44 514 -469 1
-89 532 -442 1
-133 546 -413 0
-176 557 -381 0
-218 565 -346 1
-258 569 -310 1
-297 569 -271 1
-335 566 -231 0
-370 560 -190 0
-403 550 -147 0
-433 537 -103 1
-461 520 -59 0
-486 500 -14 0
-507 478 29 0
-526 452 74 0
-542 423 118 -1
-554 392 161 -1
-562 358 204 0
-568 322 245 -1
-570 285 284 -1
-568 245 322 -1
-562 204 358 0
-554 161 392 -1
-542 118 423 -1
-526 74 452 0
-507 29 478 0
-486 -14 500 0
-461 -59 520 0
-433 -103 537 1
-403 -147 550 0
-370 -190 560 0
-335 -231 566 0
-297 -271 569 1
-258 -310 569 1
-218 -346 565 1
-176 -381 557 0
-133 -413 546 0
-89 -442 532 1
-44 -469 514 1
0 -493 493 0
44 -514 469 -1
89 -532 442 -1
133 -546 413 0
176 -557 381 0
218 -565 346 -1
258 -569 310 -1
297 -569 271 -1
335 -566 231 0
370 -560 190 0
403 -550 147 0
433 -537 103 -1
461 -520 59 0
486 -500 14 0
507 -478 -29 0
526 -452 -74 0
542 -423 -118 1
554 -392 -161 1
562 -358 -204 0
568 -322 -245 1
570 -285 -284 1
568 -245 -322 1
562 -204 -358 0
554 -161 -392 1
542 -118 -423 1
526 -74 -452 0
507 -29 -478 0
486 14 -500 0
461 59 -520 0
433 103 -537 -1
403 147 -550 0
370 190 -560 0
335 231 -566 0
297 271 -569 -1
258 310 -569 -1
218 346 -565 -1
176 381 -557 0
133 413 -546 0
89 442 -532 -1
44 469 -514 -1
0 493 -493 0
-44 514 -469 1
-89 532 -442 1
-133 546 -413 0
-176 557 -381 0
-218 565 -346 1
-258 569 -310 1
-297 569 -271 1
-335 566 -231 0
-370 560 -190 0
-403 550 -147 0
-433 537 -103 1
-461 520 -59 0
-486 500 -14 0
-507 478 29 0
-526 452 74 0
-542 423 118 -1
-554 392 161 -1
-562 358 204 0
-568 322 245 -1
-570 285 284 -1
-568 245 322 -1
-562 204 358 0
-554 161 392 -1
-542 118 423 -1
-526 74 452 0
-507 29 478 0
-486 -14 500 0
-461 -59 520 0
-433 -103 537 1
-403 -147 550 0
-370 -190 560 0
-335 -231 566 0
-297 -271 569 1
-258 -310 569 1
-218 -346 565 1
-176 -381 557 0
-133 -413 546 0
-89 -442 532 1
-44 -469 514 1
0 -493 493 0
44 -514 469 -1
89 -532 442 -1
133 -546 413 0
176 -557 381 0
218 -565 346 -1
258 -569 310 -1
297 -569 271 -1
335 -566 231 0
370 -560 190 0
403 -550 147 0
433 -537 103 -1
461 -520 59 0
486 -500 14 0
507 -478 -29 0
526 -452 -74 0
542 -423 -118 1
554 -392 -161 1
562 -358 -204 0
568 -322 -245 1
570 -285 -284 1
568 -245 -322 1
562 -204 -358 0
554 -161 -392 1
542 -118 -423 1
526 -74 -452 0
507 -29 -478 0
486 14 -500 0
461 59 -520 0
433 103 -537 -1
403 147 -550 0
370 190 -560 0
335 231 -566 0
297 271 -569 -1
258 310 -569 -1
218 346 -565 -1
176 381 -557 0
133 413 -546 0
89 442 -532 -1
44 469 -514 -1
0 493 -493 0
-44 514 -469 1
-89 532 -442 1
-133 546 -413 0
-176 557 -381 0
-218 565 -346 1
-258 569 -310 1
-297 569 -271 1
-335 566 -231 0
-370 560 -190 0
-403 550 -147 0
-433 537 -103 1
-461 520 -59 0
-486 500 -14 0
-507 478 29 0
-526 452 74 0
-542 423 118 -1
-554 392 161 -1
-562 358 204 0
-568 322 245 -1
-570 285 284 -1
-568 245 322 -1
-562 204 358 0
-554 161 392 -1
-542 118 423 -1
-526 74 452 0
-507 29 478 0
-486 -14 500 0
-461 -59 520 0
-433 -103 537 1
-403 -147 550 0
-370 -190 560 0
-335 -231 566 0
-297 -271 569 1
-258 -310 569 1
-218 -346 565 1
-176 -381 557 0
-133 -413 546 0
-89 -442 532 1
-44 -469 514 1
0 -493 493 0
44 -514 469 -1
89 -532 442 -1
133 -546 413 0
176 -557 381 0
218 -565 346 -1
258 -569 310 -1
297 -569 271 -1
335 -566 231 0
370 -560 190 0
403 -550 147 0
433 -537 103 -1
461 -520 59 0
486 -500 14 0
507 -478 -29 0
526 -452 -74 0
542 -423 -118 1
554 -392 -161 1
562 -358 -204 0
568 -322 -245 1
570 -285 -284 1
568 -245 -322 1
562 -204 -358 0
554 -161 -392 1
542 -118 -423 1
526 -74 -452 0
507 -29 -478 0
486 14 -500 0
461 59 -520 0
433 103 -537 -1
403 147 -550 0
370 190 -560 0
335 231 -566 0
297 271 -569 -1
258 310 -569 -1
218 346 -565 -1
176 381 -557 0
133 413 -546 0
89 442 -532 -1
44 469 -514 -1
0 493 -493 0
-44 514 -469 1
-89 532 -442 1
-133 546 -413 0
-176 557 -381 0
-218 565 -346 1
-258 569 -310 1
-297 569 -271 1
-335 566 -231 0
-370 560 -190 0
-403 550 -147 0
-433 537 -103 1
-461 520 -59 0
-486 500 -14 0
-507 478 29 0
-526 452 74 0
-542 423 118 -1
-554 392 161 -1
-562 358 204 0
-568 322 245 -1
-570 285 284 -1
-568 245 322 -1
-562 204 358 0
-554 161 392 -1
-542 118 423 -1
-526 74 452 0
-507 29 478 0
-486 -14 500 0
-461 -59 520 0
-433 -103 537 1
-403 -147 550 0
-370 -190 560 0
-335 -231 566 0
-297 -271 569 1
-258 -310 569 1
-218 -346 565 1
-176 -381 557 0
-133 -413 546 0
-89 -442 532 1
-44 -469 514 1
0 -493 493 0
44 -514 469 -1
89 -532 442 -1
133 -546 413 0
176 -557 381 0
218 -565 346 -1
258 -569 310 -1
297 -569 271 -1
335 -566 231 0
370 -560 190 0
403 -550 147 0
433 -537 103 -1
461 -520 59 0
486 -500 14 0
507 -478 -29 0
526 -452 -74 0
542 -423 -118 1
554 -392 -161 1
562 -358 -204 0
568 -322 -245 1
570 -285 -284 1
568 -245 -322 1
562 -204 -358 0
554 -161 -392 1
542 -118 -423 1
526 -74 -452 0
507 -29 -478 0
486 14 -500 0
461 59 -520 0
433 103 -537 -1
403 147 -550 0
370 190 -560 0
335 231 -566 0
297 271 -569 -1
258 310 -569 -1
218 346 -565 -1
176 381 -557 0
133 413 -546 0
89 442 -532 -1
44 469 -514 -1
0 493 -493 0
-44 514 -469 1
-89 532 -442 1
-133 546 -413 0
-176 557 -381 0
-218 565 -346 1
-258 569 -310 1
-297 569 -271 1
-335 566 -231 0
-370 560 -190 0
-403 550 -147 0
-433 537 -103 1
-461 520 -59 0
-486 500 -14 0
-507 478 29 0
-526 452 74 0
-542 423 118 -1
-554 392 161 -1
-562 358 204 0
-568 322 245 -1
-570 285 284 -1
-568 245 322 -1
-562 204 358 0
-554 161 392 -1
-542 118 423 -1
-526 74 452 0
-507 29 478 0
-486 -14 500 0
-461 -59 520 0
-433 -103 537 1
-403 -147 550 0
-370 -190 560 0
-335 -231 566 0
-297 -271 569 1
-258 -310 569 1
-218 -346 565 1
-176 -381 557 0
-133 -413 546 0
-89 -442 532 1
-44 -469 514 1
0 -493 493 0
44 -514 469 -1
89 -532 442 -1
133 -546 413 0
176 -557 381 0
218 -565 346 -1
258 -569 310 -1
297 -569 271 -1
335 -566 231 0
370 -560 190 0
403 -550 147 0
433 -537 103 -1
461 -520 59 0
486 -500 14 0
507 -478 -29 0
526 -452 -74 0
542 -423 -118 1
554 -392 -161 1
562 -358 -204 0
568 -322 -245 1
570 -285 -284 1
568 -245 -322 1
562 -204 -358 0
554 -161 -392 1
542 -118 -423 1
526 -74 -452 0
507 -29 -478 0
486 14 -500 0
461 59 -520 0
433 103 -537 -1
403 147 -550 0
370 190 -560 0
335 231 -566 0
297 271 -569 -1
258 310 -569 -1
218 346 -565 -1
176 381 -557 0
133 413 -546 0
89 442 -532 -1
44 469 -514 -1
0 493 -493 0
-44 514 -469 1
-89 532 -442 1
-133 546 -413 0
-176 557 -381 0
-218 565 -346 1
-258 569 -310 1
-297 569 -271 1
-335 566 -231 0
-370 560 -190 0
-403 550 -147 0
-433 537 -103 1
-461 520 -59 0
-486 500 -14 0
-507 478 29 0
-526 452 74 0
-542 423 118 -1
-554 392 161 -1
-562 358 204 0
-568 322 245 -1
-570 285 284 -1
-568 245 322 -1
-562 204 358 0
-554 161 392 -1
-542 118 423 -1
-526 74 452 0
-507 29 478 0
-486 -14 500 0
-461 -59 520 0
-433 -103 537 1
-403 -147 550 0
-370 -190 560 0
-335 -231 566 0
-297 -271 569 1
-258 -310 569 1
-218 -346 565 1
-176 -381 557 0
-133 -413 546 0
-89 -442 532 1
-44 -469 514 1
0 -493 493 0
44 -514 469 -1
89 -532 442 -1
133 -546 413 0
176 -557 381 0
218 -565 346 -1
258 -569 310 -1
297 -569 271 -1
335 -566 231 0
370 -560 190 0
403 -550 147 0
433 -537 103 -1
461 -520 59 0
486 -500 14 0
507 -478 -29 0
526 -452 -74 0
542 -423 -118 1
554 -392 -161 1
562 -358 -204 0
568 -322 -245 1
570 -285 -284 1
568 -245 -322 1
562 -204 -358 0
554 -161 -392 1
542 -118 -423 1
526 -74 -452 0
507 -29 -478 0
486 14 -500 0
461 59 -520 0
433 103 -537 -1
403 147 -550 0
370 190 -560 0
335 231 -566 0
297 271 -569 -1
258 310 -569 -1
218 346 -565 -1
176 381 -557 0
133 413 -546 0
89 442 -532 -1
44 469 -514 -1
0 493 -493 0
-44 514 -469 1
-89 532 -442 1
-133 546 -413 0
-176 557 -381 0
-218 565 -346 1
-258 569 -310 1
-297 569 -271 1
-335 566 -231 0
-370 560 -190 0
-403 550 -147 0
-433 537 -103 1
-461 520 -59 0
-486 500 -14 0
-507 478 29 0
-526 452 74 0
-542 423 118 -1
-554 392 161 -1
-562 358 204 0
-568 322 245 -1
-570 285 284 -1
-568 245 322 -1
-562 204 358 0
-554 161 392 -1
-542 118 423 -1
-526 74 452 0
-507 29 478 0
-486 -14 500 0
-461 -59 520 0
-433 -103 537 1
-403 -147 550 0
-370 -190 560 0
-335 -231 566 0
-297 -271 569 1
-258 -310 569 1
-218 -346 565 1
-176 -381 557 0
-133 -413 546 0
-89 -442 532 1
-44 -469 514 1
0 -493 493 0
44 -514 469 -1
89 -532 442 -1
133 -546 413 0
176 -557 381 0
218 -565 346 -1
258 -569 310 -1
297 -569 271 -1
335 -566 231 0
370 -560 190 0
403 -550 147 0
433 -537 103 -1
461 -520 59 0
486 -500 14 0
507 -478 -29 0
526 -452 -74 0
542 -423 -118 1
554 -392 -161 1
562 -358 -204 0
568 -322 -245 1
570 -285 -284 1
568 -245 -322 1
562 -204 -358 0
554 -161 -392 1
542 -118 -423 1
526 -74 -452 0
507 -29 -478 0
486 14 -500 0
461 59 -520 0
433 103 -537 -1
403 147 -550 0
370 190 -560 0
335 231 -566 0
297 271 -569 -1
258 310 -569 -1
218 346 -565 -1
176 381 -557 0
133 413 -546 0
89 442 -532 -1
44 469 -514 -1
0 493 -493 0
-44 514 -469 1
-89 532 -442 1
-133 546 -413 0
-176 557 -381 0
-218 565 -346 1
-258 569 -310 1
-297 569 -271 1
-335 566 -231 0
-370 560 -190 0
-403 550 -147 0
-433 537 -103 1
-461 520 -59 0
-486 500 -14 0
-507 478 29 0
-526 452 74 0
-542 423 118 -1
-554 392 161 -1
-562 358 204 0
-568 322 245 -1
-570 285 284 -1
-568 245 322 -1
-562 204 358 0
-554 161 392 -1
-542 118 423 -1
-526 74 452 0
-507 29 478 0
-486 -14 500 0
-461 -59 520 0
-433 -103 537 1
-403 -147 550 0
-370 -190 560 0
-335 -231 566 0
-297 -271 569 1
-258 -310 569 1
-218 -346 565 1
-176 -381 557 0
-133 -413 546 0
-89 -442 532 1
-44 -469 514 1
0 -493 493 0
44 -514 469 -1
89 -532 442 -1
133 -546 413 0
176 -557 381 0
218 -565 346 -1
258 -569 310 -1
297 -569 271 -1
335 -566 231 0
370 -560 190 0
403 -550 147 0
433 -537 103 -1
461 -520 59 0
486 -500 14 0
507 -478 -29 0
526 -452 -74 0
542 -423 -118 1
554 -392 -161 1
562 -358 -204 0
568 -322 -245 1
570 -285 -284 1
568 -245 -322 1
562 -204 -358 0
554 -161 -392 1
542 -118 -423 1
526 -74 -452 0
507 -29 -478 0
486 14 -500 0
461 59 -520 0
433 103 -537 -1
403 147 -550 0
370 190 -560 0
335 231 -566 0
297 271 -569 -1
258 310 -569 -1
218 346 -565 -1
176 381 -557 0
133 413 -546 0
89 442 -532 -1
44 469 -514 -1
0 493 -493 0
-44 514 -469 1
-89 532 -442 1
-133 546 -413 0
-176 557 -381 0
-218 565 -346 1
-258 569 -310 1
-297 569 -271 1
-335 566 -231 0
-370 560 -190 0
-403 550 -147 0
-433 537 -103 1
-461 520 -59 0
-486 500 -14 0
-507 478 29 0
-526 452 74 0
-542 423 118 -1
-554 392 161 -1
-562 358 204 0
-568 322 245 -1
-570 285 284 -1
-568 245 322 -1
-562 204 358 0
-554 161 392 -1
-542 118 423 -1
-526 74 452 0
-507 29 478 0
-486 -14 500 0
-461 -59 520 0
-433 -103 537 1
-403 -147 550 0
-370 -190 560 0
-335 -231 566 0
-297 -271 569 1
-258 -310 569 1
-218 -346 565 1
-176 -381 557 0
-133 -413 546 0
-89 -442 532 1
-44 -469 514 1
0 -493 493 0
44 -514 469 -1
89 -532 442 -1
133 -546 413 0
176 -557 381 0
218 -565 346 -1
258 -569 310 -1
297 -569 271 -1
335 -566 231 0
370 -560 190 0
403 -550 147 0
433 -537 103 -1
461 -520 59 0
486 -500 14 0
507 -478 -29 0
526 -452 -74 0
542 -423 -118 1
554 -392 -161 1
562 -358 -204 0
568 -322 -245 1
570 -285 -284 1
568 -245 -322 1
562 -204 -358 0
554 -161 -392 1
542 -118 -423 1
526 -74 -452 0
507 -29 -478 0
486 14 -500 0
461 59 -520 0
433 103 -537 -1
403 147 -550 0
370 190 -560 0
335 231 -566 0
297 271 -569 -1
258 310 -569 -1
218 346 -565 -1
176 381 -557 0
133 413 -546 0
89 442 -532 -1
44 469 -514 -1
0 493 -493 0
-44 514 -469 1
-89 532 -442 1
-133 546 -413 0
-176 557 -381 0
-218 565 -346 1
-258 569 -310 1
-297 569 -271 1
-335 566 -231 0
-370 560 -190 0
-403 550 -147 0
-433 537 -103 1
-461 520 -59 0
-486 500 -14 0
-507 478 29 0
-526 452 74 0
-542 423 118 -1
-554 392 161 -1
-562 358 204 0
-568 322 245 -1
-570 285 284 -1
-568 245 322 -1
-562 204 358 0
-554 161 392 -1
-542 118 423 -1
-526 74 452 0
-507 29 478 0
-486 -14 500 0
-461 -59 520 0
-433 -103 537 1
-403 -147 550 0
-370 -190 560 0
-335 -231 566 0
-297 -271 569 1
-258 -310 569 1
-218 -346 565 1
-176 -381 557 0
-133 -413 546 0
-89 -442 532 1
-44 -469 514 1
0 -493 493 0
44 -514 469 -1
89 -532 442 -1
133 -546 413 0
176 -557 381 0
218 -565 346 -1
258 -569 310 -1
297 -569 271 -1
335 -566 231 0
370 -560 190 0
403 -550 147 0
433 -537 103 -1
461 -520 59 0
486 -500 14 0
507 -478 -29 0
526 -452 -74 0
542 -423 -118 1
554 -392 -161 1
562 -358 -204 0
568 -322 -245 1
570 -285 -284 1
568 -245 -322 1
562 -204 -358 0
554 -161 -392 1
542 -118 -423 1
526 -74 -452 0
507 -29 -478 0
486 14 -500 0
461 59 -520 0
433 103 -537 -1
403 147 -550 0
370 190 -560 0
335 231 -566 0
297 271 -569 -1
258 310 -569 -1
218 346 -565 -1
176 381 -557 0
133 413 -546 0
89 442 -532 -1
44 469 -514 -1
0 493 -493 0
-44 514 -469 1
-89 532 -442 1
-133 546 -413 0
-176 557 -381 0
-218 565 -346 1
-258 569 -310 1
-297 569 -271 1
-335 566 -231 0
-370 560 -190 0
-403 550 -147 0
-433 537 -103 1
-461 520 -59 0
-486 500 -14 0
-507 478 29 0
-526 452 74 0
-542 423 118 -1
-554 392 161 -1
-562 358 204 0
-568 322 245 -1
-570 285 284 -1
-568 245 322 -1
-562 204 358 0
-554 161 392 -1
-542 118 423 -1
-526 74 452 0
-507 29 478 0
-486 -14 500 0
-461 -59 520 0
-433 -103 537 1
-403 -147 550 0
-370 -190 560 0
-335 -231 566 0
-297 -271 569 1
-258 -310 569 1
-218 -346 565 1
-176 -381 557 0
-133 -413 546 0
-89 -442 532 1
-44 -469 514 1
0 -493 493 0
44 -514 469 -1
89 -532 442 -1
133 -546 413 0
176 -557 381 0
218 -565 346 -1
258 -569 310 -1
297 -569 271 -1
335 -566 231 0
370 -560 190 0
403 -550 147 0
433 -537 103 -1
461 -520 59 0
486 -500 14 0
507 -478 -29 0
526 -452 -74 0
542 -423 -118 1
554 -392 -161 1
562 -358 -204 0
568 -322 -245 1
570 -285 -284 1
568 -245 -322 1
562 -204 -358 0
554 -161 -392 1
542 -118 -423 1
526 -74 -452 0
507 -29 -478 0
486 14 -500 0
461 59 -520 0
433 103 -537 -1
403 147 -550 0
370 190 -560 0
335 231 -566 0
297 271 -569 -1
258 310 -569 -1
218 346 -565 -1
176 381 -557 0
133 413 -546 0
89 442 -532 -1
44 469 -514 -1
0 493 -493 0
-44 514 -469 1
-89 532 -442 1
-133 546 -413 0
-176 557 -381 0
-218 565 -346 1
-258 569 -310 1
-297 569 -271 1
-335 566 -231 0
-370 560 -190 0
-403 550 -147 0
-433 537 -103 1
-461 520 -59 0
-486 500 -14 0
-507 478 29 0
-526 452 74 0
-542 423 118 -1
-554 392 161 -1
-562 358 204 0
-568 322 245 -1
-570 285 284 -1
-568 245 322 -1
-562 204 358 0
-554 161 392 -1
-542 118 423 -1
-526 74 452 0
-507 29 478 0
-486 -14 500 0
-461 -59 520 0
-433 -103 537 1
-403 -147 550 0
-370 -190 560 0
-335 -231 566 0
-297 -271 569 1
-258 -310 569 1
-218 -346 565 1
-176 -381 557 0
-133 -413 546 0
-89 -442 532 1
-44 -469 514 1
0 -493 493 0
44 -514 469 -1
89 -532 442 -1
133 -546 413 0
176 -557 381 0
218 -565 346 -1
258 -569 310 -1
297 -569 271 -1
335 -566 231 0
370 -560 190 0
403 -550 147 0
433 -537 103 -1
461 -520 59 0
486 -500 14 0
507 -478 -29 0
526 -452 -74 0
542 -423 -118 1
554 -392 -161 1
562 -358 -204 0
568 -322 -245 1
570 -285 -284 1
568 -245 -322 1
562 -204 -358 0
554 -161 -392 1
542 -118 -423 1
526 -74 -452 0
507 -29 -478 0
486 14 -500 0
461 59 -520 0
433 103 -537 -1
403 147 -550 0
370 190 -560 0
335 231 -566 0
297 271 -569 -1
258 310 -569 -1
218 346 -565 -1
176 381 -557 0
133 413 -546 0
89 442 -532 -1
44 469 -514 -1
0 493 -493 0
-44 514 -469 1
-89 532 -442 1
-133 546 -413 0
-176 557 -381 0
-218 565 -346 1
-258 569 -310 1
-297 569 -271 1
-335 566 -231 0
-370 560 -190 0
-403 550 -147 0
-433 537 -103 1
-461 520 -59 0
-486 500 -14 0
-507 478 29 0
-526 452 74 0
-542 423 118 -1
-554 392 161 -1
-562 358 204 0
-568 322 245 -1
-570 285 284 -1
-568 245 322 -1
-562 204 358 0
-554 161 392 -1
-542 118 423 -1
-526 74 452 0
-507 29 478 0
-486 -14 500 0
-461 -59 520 0
-433 -103 537 1
-403 -147 550 0
-370 -190 560 0
-335 -231 566 0
-297 -271 569 1
-258 -310 569 1
-218 -346 565 1
-176 -381 557 0
-133 -413 546 0
-89 -442 532 1
-44 -469 514 1
0 -493 493 0
44 -514 469 -1
89 -532 442 -1
133 -546 413 0
176 -557 381 0
218 -565 346 -1
258 -569 310 -1
297 -569 271 -1
335 -566 231 0
370 -560 190 0
403 -550 147 0
433 -537 103 -1
461 -520 59 0
486 -500 14 0
507 -478 -29 0
526 -452 -74 0
542 -423 -118 1
554 -392 -161 1
562 -358 -204 0
568 -322 -245 1
570 -285 -284 1
568 -245 -322 1
562 -204 -358 0
554 -161 -392 1
542 -118 -423 1
526 -74 -452 0
507 -29 -478 0
486 14 -500 0
461 59 -520 0
433 103 -537 -1
403 147 -550 0
370 190 -560 0
335 231 -566 0
297 271 -569 -1
258 310 -569 -1
218 346 -565 -1
176 381 -557 0
133 413 -546 0
89 442 -532 -1
44 469 -514 -1
0 493 -493 0
-44 514 -469 1
-89 532 -442 1
-133 546 -413 0
-176 557 -381 0
-218 565 -346 1
-258 569 -310 1
-297 569 -271 1
-335 566 -231 0
-370 560 -190 0
-403 550 -147 0
-433 537 -103 1
-461 520 -59 0
-486 500 -14 0
-507 478 29 0
-526 452 74 0
-542 423 118 -1
-554 392 161 -1
-562 358 204 0
-568 322 245 -1
-570 285 284 -1
-568 245 322 -1
-562 204 358 0
-554 161 392 -1
-542 118 423 -1
-526 74 452 0
-507 29 478 0
-486 -14 500 0
-461 -59 520 0
-433 -103 537 1
-403 -147 550 0
-370 -190 560 0
-335 -231 566 0
-297 -271 569 1
-258 -310 569 1
-218 -346 565 1
-176 -381 557 0
-133 -413 546 0
-89 -442 532 1
-44 -469 514 1
0 -493 493 0
44 -514 469 -1
89 -532 442 -1
133 -546 413 0
176 -557 381 0
218 -565 346 -1
258 -569 310 -1
297 -569 271 -1
335 -566 231 0
370 -560 190 0
403 -550 147 0
433 -537 103 -1
461 -520 59 0
486 -500 14 0
507 -478 -29 0
526 -452 -74 0
542 -423 -118 1
554 -392 -161 1
562 -358 -204 0
568 -322 -245 1
570 -285 -284 1
568 -245 -322 1
562 -204 -358 0
554 -161 -392 1
542 -118 -423 1
526 -74 -452 0
507 -29 -478 0
486 14 -500 0
461 59 -520 0
433 103 -537 -1
403 147 -550 0
370 190 -560 0
335 231 -566 0
297 271 -569 -1
258 310 -569 -1
218 346 -565 -1
176 381 -557 0
133 413 -546 0
89 442 -532 -1
44 469 -514 -1
0 493 -493 0
-44 514 -469 1
-89 532 -442 1
-133 546 -413 0
-176 557 -381 0
-218 565 -346 1
-258 569 -310 1
-297 569 -271 1
-335 566 -231 0
-370 560 -190 0
-403 550 -147 0
-433 537 -103 1
-461 520 -59 0
-486 500 -14 0
-507 478 29 0
-526 452 74 0
-542 423 118 -1
-554 392 161 -1
-562 358 204 0
-568 322 245 -1
-570 285 284 -1
-568 245 322 -1
-562 204 358 0
-554 161 392 -1
-542 118 423 -1
-526 74 452 0
-507 29 478 0
-486 -14 500 0
-461 -59 520 0
-433 -103 537 1
-403 -147 550 0
-370 -190 560 0
-335 -231 566 0
-297 -271 569 1
-258 -310 569 1
-218 -346 565 1
-176 -381 557 0
-133 -413 546 0
-89 -442 532 1
-44 -469 514 1
0 -493 493 0
44 -514 469 -1
89 -532 442 -1
133 -546 413 0
176 -557 381 0
218 -565 346 -1
258 -569 310 -1
297 -569 271 -1
335 -566 231 0
370 -560 190 0
403 -550 147 0
433 -537 103 -1
461 -520 59 0
486 -500 14 0
507 -478 -29 0
526 -452 -74 0
542 -423 -118 1
554 -392 -161 1
562 -358 -204 0
568 -322 -245 1
570 -285 -284 1
568 -245 -322 1
562 -204 -358 0
554 -161 -392 1
542 -118 -423 1
526 -74 -452 0
507 -29 -478 0
486 14 -500 0
461 59 -520 0
433 103 -537 -1
403 147 -550 0
370 190 -560 0
335 231 -566 0
297 271 -569 -1
258 310 -569 -1
218 346 -565 -1
176 381 -557 0
133 413 -546 0
89 442 -532 -1
44 469 -514 -1
0 493 -493 0
-44 514 -469 1
-89 532 -442 1
-133 546 -413 0
-176 557 -381 0
-218 565 -346 1
-258 569 -310 1
-297 569 -271 1
-335 566 -231 0
-370 560 -190 0
-403 550 -147 0
-433 537 -103 1
-461 520 -59 0
-486 500 -14 0
-507 478 29 0
-526 452 74 0
-542 423 118 -1
-554 392 161 -1
-562 358 204 0
-568 322 245 -1
-570 285 284 -1
-568 245 322 -1
-562 204 358 0
-554 161 392 -1
-542 118 423 -1
-526 74 452 0
-507 29 478 0
-486 -14 500 0
-461 -59 520 0
-433 -103 537 1
-403 -147 550 0
-370 -190 560 0
-335 -231 566 0
-297 -271 569 1
-258 -310 569 1
-218 -346 565 1
-176 -381 557 0
-133 -413 546 0
-89 -442 532 1
-44 -469 514 1
