<svg xmlns="http://www.w3.org/2000/svg" width="44.852" height="42.001" viewBox="0 0 44.852 42.001">
  <g id="Interpretation_Icon" data-name="Interpretation Icon" transform="translate(944 -3443.817)">
    <circle id="Ellipse_10" data-name="Ellipse 10" cx="4.971" cy="4.971" r="4.971" transform="translate(-926.558 3464.706)" fill="rgba(0,0,0,0)" stroke="#f03223" stroke-linecap="round" stroke-linejoin="round" stroke-width="2"/>
    <path id="Path_16638" data-name="Path 16638" d="M22.426,852.819a8.641,8.641,0,0,0-8.57,8.57v1.429H31v-1.429A8.64,8.64,0,0,0,22.426,852.819Z" transform="translate(-944 2622)" fill="rgba(0,0,0,0)" stroke="#f03223" stroke-linecap="round" stroke-linejoin="round" stroke-width="2"/>
    <path id="Path_16639" data-name="Path 16639" d="M36.753,822.822a4.211,4.211,0,1,1-4.4,4.206A4.307,4.307,0,0,1,36.753,822.822Z" transform="translate(-944 2622)" fill="rgba(0,0,0,0)" stroke="#f03223" stroke-linecap="round" stroke-linejoin="round" stroke-width="2"/>
    <path id="Path_16640" data-name="Path 16640" d="M43.852,839.964c0-5.357-3.216-8.57-7.142-8.57s-7.142,3.213-7.142,8.57Z" transform="translate(-944 2622)" fill="rgba(0,0,0,0)" stroke="#f03223" stroke-linecap="round" stroke-linejoin="round" stroke-width="2"/>
    <path id="Path_16641" data-name="Path 16641" d="M8.074,822.822a4.211,4.211,0,1,1,.382,8.413c-.127.006-.255.006-.382,0a4.211,4.211,0,1,1-.382-8.413C7.819,822.816,7.947,822.816,8.074,822.822Z" transform="translate(-944 2622)" fill="rgba(0,0,0,0)" stroke="#f03223" stroke-linecap="round" stroke-linejoin="round" stroke-width="2"/>
    <path id="Path_16642" data-name="Path 16642" d="M15.284,839.964c0-5.357-3.216-8.57-7.142-8.57S1,834.607,1,839.964Z" transform="translate(-944 2622)" fill="rgba(0,0,0,0)" stroke="#f03223" stroke-linecap="round" stroke-linejoin="round" stroke-width="2"/>
    <path id="Path_16643" data-name="Path 16643" d="M8.143,844.25l5.713,5.712m22.855-5.714L31,849.96m-14.284-20H28.138" transform="translate(-944 2622)" fill="rgba(0,0,0,0)" stroke="#f03223" stroke-linecap="round" stroke-linejoin="round" stroke-width="2"/>
  </g>
</svg>
