<svg xmlns="http://www.w3.org/2000/svg" xmlns:xlink="http://www.w3.org/1999/xlink" width="410.6" height="361" viewBox="0 0 410.6 361">
  <defs>
    <linearGradient id="linear-gradient" x1="0.5" x2="0.5" y2="1" gradientUnits="objectBoundingBox">
      <stop offset="0" stop-color="#03170f"/>
      <stop offset="1" stop-color="#0a462d"/>
    </linearGradient>
  </defs>
  <rect id="Green_Gradient_Card" data-name="Green Gradient Card" width="409.6" height="360" transform="translate(410.1 360.5) rotate(180)" stroke="#eddcd0" stroke-width="1" fill="url(#linear-gradient)"/>
</svg>
