<svg xmlns="http://www.w3.org/2000/svg" width="42.182" height="42.001" viewBox="0 0 42.182 42.001">
  <g id="Certified_Translation_Icon" data-name="Certified Translation Icon" transform="translate(944 -3238.396)">
    <path id="Path_16628" data-name="Path 16628" d="M33,646.726V622.732a5.334,5.334,0,0,0-5.334-5.333H5.8c2.934,0,4.534,2.4,4.534,5.333v29.33a5.334,5.334,0,0,0,5.333,5.334" transform="translate(-944 2622)" fill="rgba(0,0,0,0)" stroke="#f03223" stroke-linecap="round" stroke-linejoin="round" stroke-width="2"/>
    <path id="Path_16629" data-name="Path 16629" d="M35.662,646.726H15.667a5.337,5.337,0,1,1,.365,10.667c-.122,0-.244,0-.365,0H35.662a5.337,5.337,0,1,0,.364-10.667C35.9,646.722,35.783,646.722,35.662,646.726ZM5.8,617.4c-2.933,0-4.8,2.4-4.8,5.334h9.333" transform="translate(-944 2622)" fill="rgba(0,0,0,0)" stroke="#f03223" stroke-linecap="round" stroke-linejoin="round" stroke-width="2"/>
    <path id="Path_16630" data-name="Path 16630" d="M17,625.4h9.334M17,632.066h9.334M17,638.728h9.334" transform="translate(-944 2622)" fill="rgba(0,0,0,0)" stroke="#f03223" stroke-linecap="round" stroke-linejoin="round" stroke-width="2"/>
  </g>
</svg>
