<svg xmlns="http://www.w3.org/2000/svg" width="284.057" height="80.451" viewBox="0 0 284.057 80.451">
  <g id="Group_4013" data-name="Group 4013" transform="translate(151.73 75.438) rotate(-90)">
    <path id="Path_5349" data-name="Path 5349" d="M.011,0V36.128s-.626,22.036,7.61,22.814,67.752,0,67.752,0" transform="translate(0 68.001)" fill="none" stroke="#87b5d6" stroke-width="10"/>
    <path id="Path_5351" data-name="Path 5351" d="M0,203.418V0" transform="translate(0 -151.73)" fill="none" stroke="#87b5d6" stroke-width="10"/>
  </g>
</svg>
