<svg xmlns="http://www.w3.org/2000/svg" xmlns:xlink="http://www.w3.org/1999/xlink" width="20" height="20" viewBox="0 0 20 20">
  <defs>
    <clipPath id="clip-path">
      <rect id="Rectangle_2381" data-name="Rectangle 2381" width="20" height="20" transform="translate(122.133 472.34)" fill="none" stroke="#707070" stroke-width="1"/>
    </clipPath>
  </defs>
  <g id="Mask_Group_23" data-name="Mask Group 23" transform="translate(-122.133 -472.34)" clip-path="url(#clip-path)">
    <path id="Icon_material-email" data-name="Icon material-email" d="M17.834,6H4.648a1.646,1.646,0,0,0-1.64,1.648L3,17.538a1.653,1.653,0,0,0,1.648,1.648H17.834a1.653,1.653,0,0,0,1.648-1.648V7.648A1.653,1.653,0,0,0,17.834,6Zm0,3.3-6.593,4.121L4.648,9.3V7.648l6.593,4.121,6.593-4.121Z" transform="translate(121.133 469.34)" fill="#148ac8"/>
  </g>
</svg>
