<svg xmlns="http://www.w3.org/2000/svg" width="132.251" height="301.533" viewBox="0 0 132.251 301.533">
  <g id="Group_4014" data-name="Group 4014" transform="translate(0 296.487) rotate(-90)">
    <path id="Path_5349" data-name="Path 5349" d="M.037,0V36.128S-2.115,58.164,26.219,58.942s270.257,0,270.257,0" transform="translate(0 68.001)" fill="none" stroke="#034d8a" stroke-width="10"/>
    <path id="Path_5351" data-name="Path 5351" d="M0,51.687V0" transform="translate(0 0)" fill="none" stroke="#034d8a" stroke-width="10"/>
  </g>
</svg>
