"id","id_pinjaman","jasa","lama","waktu"
"1","1","0.5","1","MONTH"
"2","2","0.5","1","MONTH"
"3","4","1","1","MONTH"
"4","5","1","1","MONTH"
"5","6","1","1","MONTH"
"6","7","1","1","MONTH"
"7","8","1.5","1","MONTH"
"8","9","2","1","MONTH"
"9","10","15.34","1","YEAR"
"10","10","15.55","2","YEAR"
"11","10","15.4","3","YEAR"
"12","11","21.46","1","YEAR"
"13","11","21.57","2","YEAR"
"14","11","21.19","3","YEAR"
"15","11","20.75","4","YEAR"
"16","11","20.31","5","YEAR"
"17","12","21.46","1","YEAR"
"18","12","21.57","2","YEAR"
"19","12","21.19","3","YEAR"
"20","12","20.75","4","YEAR"
"21","12","20.31","5","YEAR"
