idbank,kdbank,namabank,status
1,002,PT BANK RAKYAT INDONESIA (PERSERO) Tbk,1
2,008,PT BANK MANDIRI (PERSERO) Tbk,1
3,009,PT BANK NEGARA INDONESIA (PERSERO) Tbk,1
4,200,PT BANK TABUNGAN NEGARA (PERSERO) Tbk,1
5,011,PT BANK DANAMON INDONESIA Tbk,1
6,013,PT BANK PERMATA Tbk,1
7,014,PT BANK CENTRAL ASIA Tbk,1
8,016,PT BANK MAYBANK  INDONESIA Tbk,1
9,019,PT PAN INDONESIA BANK Tbk,1
10,022,PT BANK CIMB NIAGA Tbk,1
11,023,PT BANK UOB INDONESIA,1
12,028,PT BANK OCBC NISP Tbk,1
13,037,PT BANK ARTHA GRAHA INTERNASIONAL Tbk,1
14,076,PT BANK BUMI ARTA Tbk,1
15,087,PT BANK HSBC INDONESIA,1
16,095,PT BANK JTRUST INDONESIA Tbk,1
17,097,PT BANK MAYAPADA INTERNATIONAL Tbk,1
18,146,PT BANK OF INDIA INDONESIA Tbk,1
19,147,PT BANK MUAMALAT INDONESIA Tbk,1
20,151,PT BANK MESTIKA DHARMA Tbk,1
21,152,PT BANK SHINHAN INDONESIA,1
22,153,PT BANK SINARMAS Tbk,1
23,157,PT BANK MASPION INDONESIA Tbk,1
24,161,PT BANK GANESHA Tbk,1
25,164,PT BANK ICBC INDONESIA,1
26,167,PT BANK QNB INDONESIA Tbk,1
27,212,PT BANK WOORI SAUDARA INDONESIA 1906 Tbk,1
28,426,PT BANK MEGA Tbk,1
29,441,PT BANK KB BUKOPIN Tbk,1
30,451,PT BANK SYARIAH INDONESIA Tbk *),1
31,484,PT BANK KEB HANA INDONESIA,1
32,485,PT BANK MNC INTERNASIONAL Tbk,1
33,494,PT BANK RAYA INDONESIA Tbk,1
34,498,PT BANK SBI INDONESIA,1
35,506,PT BANK MEGA SYARIAH,1
36,555,PT BANK INDEX SELINDO,1
37,553,PT BANK MAYORA,1
38,036,PT BANK CHINA CONSTRUCTION BANK INDONESIA Tbk,1
39,046,PT BANK DBS INDONESIA,1
40,047,PT BANK RESONA PERDANIA,1
41,048,PT BANK MIZUHO INDONESIA,1
42,054,PT BANK CAPITAL INDONESIA Tbk,1
43,057,PT BANK BNP PARIBAS INDONESIA,1
44,061,PT BANK ANZ INDONESIA,1
45,945,PT BANK IBK INDONESIA Tbk,1
46,947,PT BANK ALADIN SYARIAH Tbk **),1
47,949,PT BANK CTBC INDONESIA,1
48,950,PT BANK COMMONWEALTH,1
49,213,PT BANK BTPN Tbk,1
50,405,PT BANK VICTORIA SYARIAH,1
51,425,PT BANK JABAR BANTEN SYARIAH,1
52,459,PT BANK BISNIS INTERNASIONAL,1
53,472,PT BANK JASA JAKARTA,1
54,490,PT BANK NEO COMMERCE Tbk,1
55,501,PT BANK DIGITAL BCA,1
56,503,PT BANK NATIONALNOBU Tbk,1
57,513,PT BANK INA PERDANA Tbk,1
58,517,PT BANK PANIN DUBAI SYARIAH Tbk,1
59,520,PT PRIMA MASTER BANK,1
60,521,PT BANK KB BUKOPIN SYARIAH ****),1
61,523,PT BANK SAHABAT SAMPOERNA,1
62,526,PT BANK OKE INDONESIA Tbk,1
63,531,PT BANK AMAR INDONESIA,1
64,535,PT BANK SEABANK INDONESIA,1
65,536,PT BANK BCA SYARIAH,1
66,542,PT BANK JAGO TBK,1
67,547,PT BANK BTPN SYARIAH Tbk,1
68,548,PT BANK MULTIARTA SENTOSA Tbk,1
69,562,PT BANK FAMA INTERNASIONAL,1
70,564,PT BANK MANDIRI TASPEN,1
71,566,PT BANK VICTORIA INTERNATIONAL Tbk,1
72,567,PT ALLO BANK INDONESIA ***),1
73,110,PT BPD JAWA BARAT DAN BANTEN Tbk,1
74,111,PT BPD DKI,1
75,112,PT BPD DAERAH ISTIMEWA YOGYAKARTA,1
76,113,PT BPD JAWA TENGAH,1
77,114,PT BPD JAWA TIMUR Tbk,1
78,115,PT BPD JAMBI,1
79,116,PT BANK ACEH SYARIAH,1
80,117,PT BPD SUMATERA UTARA,1
81,118,PT BANK NAGARI,1
82,119,PT BPD RIAU KEPRI,1
83,120,PT BPD SUMATERA SELATAN DAN BANGKA BELITUNG,1
84,121,PT BPD LAMPUNG,1
85,122,PT BPD KALIMANTAN SELATAN,1
86,123,PT BPD KALIMANTAN BARAT,1
87,124,PT BPD KALIMANTAN TIMUR DAN KALIMANTAN UTARA,1
88,125,PT BPD KALIMANTAN TENGAH,1
89,126,PT BPD SULAWESI SELATAN DAN SULAWESI BARAT,1
90,127,PT BPD SULAWESI UTARA DAN  GORONTALO,1
91,128,PT BANK NTB SYARIAH,1
92,129,PT BPD BALI,1
93,130,PT BPD NUSA TENGGARA TIMUR,1
94,131,PT BPD MALUKU DAN MALUKU UTARA,1
95,132,PT BPD PAPUA,1
96,133,PT BPD BENGKULU,1
97,134,PT BPD SULAWESI TENGAH,1
98,135,PT BPD SULAWESI TENGGARA,1
99,137,PT BPD BANTEN Tbk,1
100,031,CITIBANK N.A.,1
101,032,JP MORGAN CHASE BANK NA,1
102,033,BANK OF AMERICA N.A,1
103,040,BANGKOK BANK PCL,1
104,042,MUFG BANK LTD,1
105,050,STANDARD CHARTERED BANK,1
106,067,DEUTSCHE BANK AG,1
107,069,BANK OF CHINA (HONG KONG) LIMITED CABANG JAKARTA,1
109,951,BANK INDONESIA,1
