"id","jenis","awal_buka","jumlah","satuan_simpanan","biaya_admin","waktu_simpan","waktu_tarik","kode","keterangan"
"1","SIMPANAN POKOK","10000","10000","Rp","0","awal keanggotaan","resign keanggotaan","PKK",
"2","SIMPANAN WAJIB","200000","200000","Rp","0","awal keanggotaan","resign keanggotaan","WJB",
"3","SIMPANAN HARI TUA/ SHT","10","10","%","0","setiap tahun setelah RAT","resign keanggotaan","SHT",
"4","TABUNGAN SISUKA/ SIMPANAN SUKARELA","50000","0","Rp","0","setiap hari kerja","setiap hari kerja","SSK",
"5","SIMPANAN BERJANGKA/ SIJAKA","5000000","5000000","Rp","0","setiap hari kerja","pada saat jatuh tempo & pada hari kerja","SJK",
