"id","jenis","kode","pola","max_pinjaman","max_angsuran","keterangan_angsuran","provisi","bayar_tagihan1","bayar_admin","bayar_asuransi","bayar_provisi"
"1","SERBAGUNA","SBG","1","2000000","1","tahun",,"0","0","0","0"
"2","PENDIDIKAN","DDK","1","5000000","1","tahun",,"0","0","0","0"
"3","EMERGENCY","EMG","1","5000000","1","tahun",,"0","0","0","0"
"4","JASA","JSA","1","10000000","2","tahun",,"0","0","0","0"
"5","BAZAR","BZR","1","10000000","2","tahun",,"0","0","0","0"
"6","SIM","SIM","1","2000000","1","tahun",,"0","0","0","0"
"7","LAIN-LAIN","DLL","1","5000000","1","tahun",,"0","0","0","0"
"8","KENDARAAN","KDR","1","50000000","5","tahun",,"0","0","0","0"
"9","SIKILAT","SKT","1","0","1","bulan",,"0","0","0","0"
"10","SWADAYA","SWD","2","1000000","3","tahun",,"1","1","1","0"
"11","MULTIGUNA","MLG","2","0","5","tahun","1","1","1","1","1"
"12","BANK DANAMON SYARIAH","BDS","2","0","5","tahun","1","1","1","1","1"
