Enable disabled test that was disabled due to bug #23551

See: https://bugs.torproject.org/23551
2 jobs for bugs/23551 in 9 minutes and 27 seconds (queued for 3 seconds)
latest
Status Job ID Name Coverage
  Test
failed #34387336
build

00:09:27

failed #34387337
update

00:01:36

 
Name Stage Failure
failed
update Test There is an unknown failure, please try again
Building dependency tree...
Reading state information...
openssh-client is already the newest version.
git is already the newest version.
0 upgraded, 0 newly installed, 0 to remove and 0 not upgraded.
$ eval $(ssh-agent -s)
Agent pid 991
$ ssh-add <(echo "$DEPLOY_KEY")
Enter passphrase for /dev/fd/63:
ERROR: Job failed: exit code 1
failed
build Test There is an unknown failure, please try again
make[2]: *** [test-suite.log] Error 1
Makefile:10802: recipe for target 'test-suite.log' failed
make[2]: Leaving directory '/builds/ahf/tor'
Makefile:10908: recipe for target 'check-TESTS' failed
make[1]: *** [check-TESTS] Error 2
make[1]: Leaving directory '/builds/ahf/tor'
Makefile:11247: recipe for target 'check-am' failed
make: *** [check-am] Error 2
ERROR: Job failed: exit code 1