{
	"info": {
		"_postman_id": "4c09b562-f022-4752-9f36-1b32946fe979",
		"name": "postman",
		"schema": "https://schema.getpostman.com/json/collection/v2.1.0/collection.json"
	},
	"item": [
		{
			"name": "PublishMessageToRabbitMQ",
			"request": {
				"method": "POST",
				"header": [],
				"body": {
					"mode": "raw",
					"raw": "{\n    \"offers\": [\n        {\n            \"cm_offer_id\": \"8f6995366e854c9faf1d9f3d233702b8\",\n            \"hotel\": {\n                \"hotel_id\": \"BH~46456\",\n                \"name\": \"Hawthorn Suites by Wyndham Eagle CO\",\n                \"country\": \"US\",\n                \"address\": \"0315 Chambers Avenue, 81631\",\n                \"latitude\": 39.660193,\n                \"longitude\": -106.824123,\n                \"telephone\": \"+1-970-3283000\",\n                \"amenities\": [\n                    \"Business Centre\",\n                    \"Fitness Room/Gym\",\n                    \"Pet Friendly\",\n                    \"Disabled Access\",\n                    \"Air Conditioned\",\n                    \"Free WIFI\",\n                    \"Elevator / Lift\",\n                    \"Parking\"\n                ],\n                \"description\": \"Stay a while in beautiful mountain country at this Hawthorn Suites by Wyndham Eagle CO hotel, just off Interstate 70, only 6 miles from the Vail/Eagle Airport and close to skiing, golfing, Eagle River and great restaurants. Pets are welcome at this h\",\n                \"room_count\": 1,\n                \"currency\": \"USD\"\n            },\n            \"room\": {\n                \"hotel_id\": \"BH~46456\",\n                \"room_id\": \"S2Q\",\n                \"description\": \"JUNIOR SUITES WITH 2 QUEEN BEDS\",\n                \"name\": \"JUNIOR SUITES WITH 2 QUEEN BEDS\",\n                \"capacity\": {\n                    \"max_adults\": 2,\n                    \"extra_children\": 2\n                }\n            },\n            \"rate_plan\": {\n                \"hotel_id\": \"BH~46456\",\n                \"rate_plan_id\": \"BAR\",\n                \"cancellation_policy\": [\n                    {\n                        \"type\": \"Free cancellation\",\n                        \"expires_days_before\": 2\n                    }\n                ],\n                \"name\": \"BEST AVAILABLE RATE\",\n                \"other_conditions\": [\n                    \"CXL BY 2 DAYS PRIOR TO ARRIVAL-FEE 1 NIGHT 2 DAYS PRIOR TO ARRIVAL\",\n                    \"BEST AVAILABLE RATE\"\n                ],\n                \"meal_plan\": \"Room only\"\n            },\n            \"original_data\": {\n                \"GuaranteePolicy\": {\n                    \"Required\": true\n                }\n            },\n            \"capacity\": {\n                \"max_adults\": 2,\n                \"extra_children\": 2\n            },\n            \"number\": 1,\n            \"price\": 1520,\n            \"currency\": \"USD\",\n            \"check_in\": \"2020-11-18\",\n            \"check_out\": \"2020-11-20\",\n            \"fees\": [\n                {\n                    \"type\": \"CountyTax\",\n                    \"description\": \"COUNTY TAX PER STAY\",\n                    \"included\": true,\n                    \"percent\": 17.5\n                }\n            ]\n        }\n    ]\n}",
					"options": {
						"raw": {
							"language": "json"
						}
					}
				},
				"url": {
					"raw": "http://localhost:5000/publish",
					"protocol": "http",
					"host": [
						"localhost"
					],
					"port": "5000",
					"path": [
						"publish"
					]
				}
			},
			"response": []
		}
	],
	"protocolProfileBehavior": {}
}