<?xml version="1.0" encoding="utf-8"?>
<svg version="1.1" id="Layer_1" xmlns="http://www.w3.org/2000/svg" xmlns:xlink="http://www.w3.org/1999/xlink" x="0px" y="0px"
	 viewBox="0 0 24 24" style="enable-background:new 0 0 24 24;" xml:space="preserve">
<path d="M2,12c0-1.1,0.9-2,2-2s2,0.9,2,2s-0.9,2-2,2S2,13.1,2,12 M22,13H11l4.5,4.5l-1.4,1.4L7.2,12l6.9-6.9l1.4,1.4L11,11h11V13z"
	/>
</svg>
