{
	"name": "LitMan Container Size",
	"description": "[quote]Latest Update. Dev Kit Version 314055.30574.[/quote]\n\n[b]Containers Size increased 10 times.[/b]\n\nDoes not work with \"LitMan Item Stack\" and \"LitMan Item Stack & Container Size\". \n\nIf you want bigger stacks and containers at the same time use \"LitMan Item Stack & Container Size\".\n\nSupport Channel on Discord: https://discord.gg/WhRXFGE\n\nI released all my Source files on Gitlab https://gitlab.com/kasperaitis/conan-exiles-mods if anyone wants to keep updated those Mods or release own ones.\n\nIf you need a previous version it also could be found on Gitlab https://gitlab.com/kasperaitis/conan-exiles-mods/tree/master/Compiled\n\nMod ID: 1125403124",
	"changeNote": "Dev Kit Version 314055.30574\n\nUpdated to match the live game version.",
	"author": "LitMan",
	"authorUrl": "",
	"versionMajor": 1,
	"versionMinor": 33,
	"versionBuild": 0,
	"bRequiresLoadOnStartup": false,
	"steamPublishedFileId": "1125403124",
	"steamVisibility": 0,
	"folderName": "LitManContainerSize",
	"revisionNumber": 314055,
	"snapshotId": 30574
}