(module "NanoPI Air" (layer F.Cu) (tedit 5BED3024)
  (fp_text reference REF** (at -0.08 13.54) (layer F.SilkS)
    (effects (font (size 1 1) (thickness 0.15)))
  )
  (fp_text value "NanoPI Air" (at -0.02 -15.9) (layer F.Fab)
    (effects (font (size 1 1) (thickness 0.15)))
  )
  (fp_line (start 0 -20) (end 20 -20) (layer F.SilkS) (width 0.15))
  (fp_line (start 20 -20) (end 20 20) (layer F.SilkS) (width 0.15))
  (fp_line (start 20 20) (end -20 20) (layer F.SilkS) (width 0.15))
  (fp_line (start -20 20) (end -20 -20) (layer F.SilkS) (width 0.15))
  (fp_line (start -20 -20) (end 0 -20) (layer F.SilkS) (width 0.15))
  (pad "" thru_hole circle (at 17.7 -17.7) (size 4.5 4.5) (drill 3) (layers *.Cu *.Mask))
  (pad "" thru_hole circle (at -17.7 -17.7) (size 4.5 4.5) (drill 3) (layers *.Cu *.Mask))
  (pad "" thru_hole circle (at -17.7 17.7) (size 4.5 4.5) (drill 3) (layers *.Cu *.Mask))
  (pad "" thru_hole circle (at 17.7 17.7) (size 4.5 4.5) (drill 3) (layers *.Cu *.Mask))
  (pad GND thru_hole circle (at 18.73 8.89) (size 1.6 1.6) (drill 0.7) (layers *.Cu *.Mask))
  (pad Vcc thru_hole circle (at 18.73 11.43) (size 1.6 1.6) (drill 0.7) (layers *.Cu *.Mask))
  (pad DM thru_hole circle (at -18.73 8.89) (size 1.6 1.6) (drill 0.7) (layers *.Cu *.Mask))
  (pad DP thru_hole circle (at -18.73 11.43) (size 1.6 1.6) (drill 0.7) (layers *.Cu *.Mask))
)
