<?xml version="1.0" encoding="UTF-8" standalone="no"?>
<svg
   xmlns:dc="http://purl.org/dc/elements/1.1/"
   xmlns:cc="http://creativecommons.org/ns#"
   xmlns:rdf="http://www.w3.org/1999/02/22-rdf-syntax-ns#"
   xmlns:svg="http://www.w3.org/2000/svg"
   xmlns="http://www.w3.org/2000/svg"
   id="svg4261"
   version="1.1"
   viewBox="0 0 374.31425 41.531001"
   height="41.531002mm"
   width="374.31424mm">
  <defs
     id="defs4255" />
  <metadata
     id="metadata4258">
    <rdf:RDF>
      <cc:Work
         rdf:about="">
        <dc:format>image/svg+xml</dc:format>
        <dc:type
           rdf:resource="http://purl.org/dc/dcmitype/StillImage" />
        <dc:title></dc:title>
      </cc:Work>
    </rdf:RDF>
  </metadata>
  <g
     transform="translate(12.989133,68.643353)"
     id="layer1">
    <path
       style="fill:#ffffff;fill-opacity:1;fill-rule:nonzero;stroke:none;stroke-width:0.35277528"
       d="m 50.791538,-68.64335 c -0.179142,0 -0.351395,0.0028 -0.515383,0.0041 l -0.05099,0.0014 c -0.108862,0.0028 -0.217729,0.0041 -0.323836,0.0041 h -0.0937 c -0.05788,-0.0014 -0.117133,-0.0014 -0.176388,-0.0014 -3.202543,-0.0014 -5.695394,1.462087 -7.22087,2.688533 -0.864026,0.694527 -2.228273,1.966447 -4.052782,3.778554 l -0.238401,0.237021 0.225997,0.249423 c 0.965998,1.063838 1.885143,2.191066 2.811178,3.445071 l 1.525479,2.06842 0.242531,0.32935 0.289386,-0.289386 c 1.751474,-1.748719 3.042687,-2.965517 3.733078,-3.520863 0.609087,-0.4892 1.580598,-1.072107 2.751924,-1.072107 h 0.03996 c 0.05099,0 0.107486,0.0014 0.163988,0.0014 0.147448,0 0.294897,-0.0027 0.443723,-0.0055 l 0.04548,-0.0014 h 0.03168 c 0.111622,-0.0014 0.242534,-0.0041 0.367935,-0.0041 0.206705,0 0.307298,0.0069 0.355529,0.01102 1.220935,0.425811 2.287529,1.030766 3.166709,1.799706 1.679817,1.466222 3.238368,3.186002 4.765225,5.254421 l 5.892446,8.400464 3.881911,5.630623 0.175006,0.253557 1.599893,2.320601 0.01101,0.01654 0.01378,0.01516 2.807045,3.21494 1.036276,1.174083 0.01378,0.01378 0.270097,0.274225 0.01378,0.01378 c 1.5806,1.460706 3.37066,3.117098 5.885563,4.20712 1.559926,0.675233 3.13639,1.018364 4.686673,1.018364 1.944395,0 3.881902,-0.537434 5.758778,-1.59576 2.095985,-1.182346 3.735834,-2.335756 5.914498,-4.736283 l 0.192929,-0.213594 -0.169499,-0.231509 -4.19472,-5.753269 -0.259068,-0.354152 -0.290768,0.32797 c -1.608159,1.818998 -3.064739,3.045443 -4.721127,3.979746 -0.800629,0.450616 -1.511694,0.661455 -2.23378,0.661455 -0.580148,0 -1.180969,-0.139181 -1.839666,-0.424434 -1.35598,-0.587039 -2.484587,-1.628833 -3.680717,-2.73401 l -1.681193,-1.90443 -1.513078,-1.710135 c -0.18741,-0.323838 -0.392736,-0.666969 -0.611841,-1.018366 -1.209911,-1.949909 -2.904886,-4.35319 -5.035317,-7.143701 -1.212666,-1.920971 -2.556242,-3.778553 -3.748238,-5.422543 l 0.03305,-0.02756 -0.197056,-0.267339 -2.091849,-2.83736 c -1.868565,-2.532768 -3.800565,-4.659066 -5.908946,-6.500112 -1.631586,-1.42626 -3.555312,-2.52317 -5.714683,-3.259038 -0.952218,-0.323836 -1.839667,-0.366555 -2.582427,-0.366555"
       id="path4058" />
    <path
       style="fill:#e8701c;fill-opacity:1;fill-rule:nonzero;stroke:none;stroke-width:0.35277528"
       d="m 44.243148,-49.662386 h -8.611301 l 1.291213,1.839669 h 8.502434 c -0.435454,-0.669723 -0.715196,-1.164433 -1.182346,-1.839669"
       id="path4084" />
    <path
       style="fill:#e8701c;fill-opacity:1;fill-rule:nonzero;stroke:none;stroke-width:0.35277528"
       d="m 34.875308,-50.740005 h 8.827652 c -0.410652,-0.624246 -0.828196,-1.241603 -1.248494,-1.841045 h -8.868992 z m 0,0"
       id="path4086" />
    <path
       style="fill:#e8701c;fill-opacity:1;fill-rule:nonzero;stroke:none;stroke-width:0.35277528"
       d="m 46.295032,-46.743722 h -0.361045 c 0.38585,0.553967 0.756539,1.092778 1.094155,1.601269 -0.337616,-0.508491 -0.708305,-1.047302 -1.094155,-1.601269 h -8.254391 l 0.902609,1.331176 0.340374,0.508491 h 8.614058 c -0.381715,-0.582905 -0.795126,-1.196128 -1.241605,-1.839667"
       id="path4088" />
    <path
       style="fill:#ffffff;fill-opacity:1;fill-rule:nonzero;stroke:none;stroke-width:0.35277528"
       d="m 25.027917,-67.28048 c 0.02617,0 0.05099,-0.0014 0.07855,-0.0014 0.02617,0 0.05236,0.0014 0.07855,0.0014 -0.05237,-0.0014 -0.106109,0 -0.157096,0 m -0.766186,6.859826 c -0.05236,0 -0.104726,0 -0.155714,-0.0014 0.201191,0.0041 0.407897,0 0.614602,-0.0041 -0.154338,0.0027 -0.307304,0.0055 -0.458888,0.0055 m -0.468528,-6.847414 c 0.07028,-0.0014 0.13918,-0.0055 0.210839,-0.0055 0.05374,0 0.107483,0 0.162604,0.0014 -0.126777,-0.0027 -0.249423,0.0014 -0.373443,0.0041 m -6.126718,11.310858 -0.724842,-0.982534 z m 15.147291,2.298551 h 8.875882 c -0.334861,-0.467151 -0.66421,-0.923279 -0.981158,-1.361492 l 0.03168,-0.02618 -0.169499,-0.228753 -1.988496,-2.696801 c -1.773504,-2.404662 -3.610416,-4.424852 -5.611316,-6.172192 -1.547521,-1.353224 -3.372035,-2.393635 -5.42116,-3.092296 -0.899853,-0.305922 -1.740454,-0.347263 -2.443246,-0.347263 -0.169497,0 -0.332105,0.0027 -0.486443,0.0055 l -0.05099,0.0014 c -0.104732,0.0014 -0.208085,0.0027 -0.310058,0.0027 h -0.08957 c -0.05375,-0.0014 -0.110243,-0.0014 -0.165364,-0.0014 -3.035797,0 -5.396361,1.386296 -6.84329,2.547975 -0.821303,0.66008 -2.116649,1.868612 -3.848833,3.58977 l -0.205325,0.203947 0.194301,0.212217 c 0.917767,1.011472 1.792814,2.083579 2.673378,3.276951 l 1.449684,1.966446 0.208083,0.281118 0.248046,-0.246667 c 1.664656,-1.66328 2.89248,-2.820824 3.549798,-3.349986 0.582905,-0.46853 1.514455,-1.026632 2.637547,-1.026632 h 0.03859 c 0.04823,0.0014 0.101973,0.0014 0.155714,0.0014 0.139186,0 0.278366,-0.0027 0.418923,-0.0055 h 0.07579 c 0.106108,-0.0028 0.23013,-0.0041 0.35002,-0.0041 0.202569,0 0.29903,0.0055 0.345882,0.01102 1.165814,0.40514 2.184178,0.982535 3.024774,1.718401 1.525476,1.332553 2.947604,2.888347 4.336657,4.740418"
       id="path4090" />
    <path
       style="fill:#ffffff;fill-opacity:1;fill-rule:nonzero;stroke:none;stroke-width:0.35277528"
       d="m 63.280608,-29.948313 c -0.162603,0.09233 -0.326591,0.180522 -0.490576,0.263206 0.163985,-0.08268 0.327973,-0.170878 0.490576,-0.263206 0.265961,-0.148824 0.522274,-0.297654 0.76894,-0.446478 -0.246666,0.148824 -0.502979,0.297654 -0.76894,0.446478 m -3.300378,1.266412 c -0.666965,0.137799 -1.336687,0.206703 -2.009166,0.206703 0.672479,0 1.342201,-0.06891 2.009166,-0.206703 0.443727,-0.09233 0.887451,-0.214976 1.328421,-0.369314 -0.44097,0.154338 -0.884694,0.276986 -1.328421,0.369314 m -6.075724,-8.483146 c 0.2632,0.217729 0.526405,0.424434 0.793745,0.613222 -0.26734,-0.188788 -0.530545,-0.395493 -0.793745,-0.613222 m -3.033043,-3.08816 -1.459333,-1.652258 c -0.09095,-0.155715 -0.186033,-0.316944 -0.285251,-0.482308 0.09922,0.165364 0.194304,0.326593 0.285251,0.482308 l 1.459333,1.652258 1.610917,1.823132 z m -2.724361,6.898408 c 0.37069,0.343131 0.75378,0.697286 1.156166,1.051437 -0.402386,-0.354151 -0.785476,-0.708306 -1.156166,-1.051437 m 20.915717,-1.20715 -3.988017,-5.468018 -0.220485,-0.303166 -0.249423,0.281118 c -1.530987,1.730802 -2.918664,2.899372 -4.495128,3.789579 -0.767561,0.432699 -1.448308,0.632514 -2.141456,0.632514 -0.555346,0 -1.131361,-0.13229 -1.762496,-0.40514 -1.29397,-0.56086 -2.37021,-1.554416 -3.508463,-2.607231 l -1.59989,-1.810729 -1.440038,-1.628829 c -0.177766,-0.30868 -0.374824,-0.633894 -0.582909,-0.970134 -0.154339,-0.249423 -0.319702,-0.508491 -0.491956,-0.773072 h -8.874503 l 2.594827,3.764771 0.165364,0.239781 1.521343,2.206222 0.0096,0.01378 0.01241,0.01241 2.666483,3.056469 0.986669,1.116203 0.0055,0.0055 0.0055,0.0069 0.256313,0.259068 0.0055,0.0055 0.0069,0.0083 c 1.500671,1.386298 3.199781,2.957249 5.585147,3.992149 1.478624,0.639404 2.972409,0.964617 4.441386,0.964617 1.842423,0 3.679336,-0.508488 5.45837,-1.511694 1.989873,-1.121717 3.545667,-2.217248 5.61271,-4.496509 l 0.165363,-0.181897 z m 0,0"
       id="path4092" />
    <path
       style="fill:#ffffff;fill-opacity:1;fill-rule:nonzero;stroke:none;stroke-width:0.35277528;stroke-opacity:1"
       d="m -0.98925866,-67.583646 c -0.16949784,0 -0.33210664,0.0027 -0.48644554,0.0055 l -0.05099,0.0014 c -0.1033522,0.0014 -0.2067045,0.0027 -0.3086788,0.0027 h -0.089569 c -0.05512,-0.0014 -0.1116212,-0.0014 -0.1667428,-0.0014 -3.0357968,0 -5.3963608,1.386296 -6.8432898,2.547975 -0.8213002,0.66008 -2.1166484,1.868612 -3.8488284,3.58977 l -0.20533,0.202569 0.194306,0.213595 c 0.919142,1.011472 1.79419,2.083579 2.673373,3.276951 l 1.4510638,1.966446 0.2067051,0.281118 0.2480436,-0.246667 c 1.6646583,-1.66328 2.8924819,-2.820824 3.5498011,-3.348608 0.5829081,-0.469908 1.5144537,-1.02801 2.6375491,-1.02801 h 0.03858 c 0.04823,0.0014 0.1019733,0.0014 0.1557189,0.0014 0.13918,0 0.278361,-0.0027 0.420296,-0.0041 l 0.0441,-0.0014 h 0.0303 c 0.1061082,-0.0027 0.2301334,-0.0041 0.35002054,-0.0041 0.20257056,0 0.30040886,0.0055 0.34588554,0.01103 1.1658127,0.40514 2.18417242,0.983912 3.02477242,1.718402 1.5985136,1.395942 3.0812701,3.030284 4.5337127,4.999486 l 5.6016872,7.987054 3.690357,5.352263 0.166744,0.239777 1.519963,2.206226 0.01101,0.01378 0.01101,0.01241 2.666488,3.05647 0.986667,1.116203 0.01101,0.01101 0.25631,0.260447 0.01241,0.01241 c 1.500675,1.387674 3.19978,2.958628 5.585149,3.993526 1.478626,0.639407 2.973786,0.964619 4.442764,0.964619 1.841045,0 3.677957,-0.508491 5.456992,-1.511697 1.988496,-1.121714 3.545667,-2.217248 5.612712,-4.495127 l 0.165363,-0.183279 -0.144694,-0.198435 -3.988016,-5.468019 -0.220485,-0.303163 -0.249421,0.281115 c -1.53099,1.730805 -2.918661,2.899372 -4.495128,3.789579 -0.767564,0.431321 -1.448308,0.632517 -2.141459,0.632517 -0.553965,0 -1.131361,-0.13229 -1.762496,-0.406521 -1.29397,-0.559481 -2.370211,-1.553038 -3.507085,-2.605853 l -1.601268,-1.810729 -1.440038,-1.628829 c -0.179143,-0.310056 -0.374824,-0.635273 -0.582905,-0.970133 -1.149277,-1.852071 -2.760193,-4.136842 -4.784516,-6.789546 -1.158922,-1.835534 -2.444621,-3.609056 -3.581496,-5.178631 l 0.03171,-0.02618 -0.168121,-0.228753 -1.989872,-2.696801 c -1.773517,-2.404628 -3.6090491,-4.423441 -5.6113239,-6.173536 -1.547527,-1.351847 -3.372038,-2.392257 -5.4211654,-3.08954 -0.89985155,-0.3073 -1.74044857,-0.348642 -2.44324356,-0.348642"
       id="path4140" />
    <path
       style="fill:#ffffff;fill-opacity:1;stroke:#ffffff;stroke-width:1.03584719;stroke-linecap:butt;stroke-linejoin:miter;stroke-miterlimit:10;stroke-opacity:1"
       d="m 112.69315,-38.555224 c 1.61853,1.553772 3.88039,2.330656 6.78966,2.330656 3.96536,0 7.20644,-1.43643 9.71107,-4.317379 2.50465,-2.8769 3.759,-6.437626 3.759,-10.678125 0,-2.836448 -0.80116,-5.021436 -2.40753,-6.563066 -1.60235,-1.53759 -3.88849,-2.310426 -6.85441,-2.310426 -3.88038,0 -7.0891,1.432381 -9.62206,4.297152 -2.53702,2.864759 -3.80349,6.372884 -3.80349,10.528411 0,2.921411 0.80927,5.159008 2.42776,6.712777 z m 5.14688,-14.093186 c 1.32311,-2.039326 3.08325,-3.058993 5.27229,-3.058993 2.82025,0 4.23242,1.54568 4.23242,4.637042 0,2.836441 -0.65147,5.292528 -1.95435,7.360184 -1.3029,2.071693 -3.07112,3.103488 -5.30467,3.103488 -2.8243,0 -4.23242,-1.638741 -4.23242,-4.916223 0,-2.711008 0.65955,-5.082126 1.98673,-7.125498 z m 0,0"
       id="path4020" />
    <path
       style="fill:#ffffff;fill-opacity:1;stroke:#ffffff;stroke-width:1.03584719;stroke-linecap:butt;stroke-linejoin:miter;stroke-miterlimit:10;stroke-opacity:1"
       d="m 144.87726,-36.220527 c 4.13933,0 7.46943,-1.400009 9.99024,-4.19194 2.52084,-2.791928 3.78329,-6.372884 3.78329,-10.742864 0,-5.95612 -3.07518,-8.934184 -9.21742,-8.934184 -1.96245,0 -3.94108,0.736417 -5.93186,2.209269 -0.12949,-0.914457 -0.29128,-1.646843 -0.49365,-2.189038 l -5.2399,0.942777 c 0.25487,1.274578 0.38439,2.545109 0.38439,3.803508 0,0.930644 -0.0849,1.857243 -0.25487,2.7717 l -4.64514,24.921022 h 5.37348 l 1.71968,-9.646326 c 1.37167,0.704053 2.88499,1.056076 4.53182,1.056076 z m -1.54568,-16.99437 c 0.47342,-0.558382 1.18153,-1.072257 2.13643,-1.537578 0.95088,-0.465324 1.78037,-0.700007 2.48037,-0.700007 1.57804,0 2.8162,0.441043 3.71854,1.323131 0.90231,0.882085 1.35144,2.051465 1.35144,3.512175 0,3.152051 -0.74451,5.583859 -2.24568,7.29544 -1.49714,1.711572 -3.65379,2.565339 -6.47404,2.565339 -1.37572,0 -2.41563,-0.364164 -3.11563,-1.096549 z m 0,0"
       id="path4022" />
    <path
       style="fill:#ffffff;fill-opacity:1;stroke:#ffffff;stroke-width:1.03584719;stroke-linecap:butt;stroke-linejoin:miter;stroke-miterlimit:10;stroke-opacity:1"
       d="m 172.20582,-45.846614 c 3.27749,0 6.04109,-0.736426 8.28272,-2.213315 2.23761,-1.476891 3.36246,-3.508125 3.36246,-6.101794 0,-1.905791 -0.75259,-3.370541 -2.25781,-4.39426 -1.50521,-1.023706 -3.46361,-1.533532 -5.88735,-1.533532 -4.11099,0 -7.43704,1.31099 -9.97811,3.941069 -2.54512,2.626038 -3.81564,5.919711 -3.81564,9.872917 0,3.119682 0.88208,5.575781 2.64222,7.368274 1.76417,1.788461 4.06246,2.686728 6.89889,2.686728 2.62199,0 4.83937,-0.412712 6.66017,-1.226018 l 0.62313,-5.652649 c -0.67572,0.619084 -1.59826,1.173417 -2.77168,1.667061 -1.17342,0.493653 -2.21332,0.740475 -3.11563,0.740475 -1.69135,0 -3.01043,-0.428903 -3.96131,-1.290768 -0.95493,-0.857808 -1.4324,-2.087875 -1.4324,-3.694247 0,-0.271104 0.0176,-0.594804 0.0446,-0.967065 1.53355,0.530062 3.09946,0.797124 4.70583,0.797124 z m -1.05608,-8.367709 c 1.12083,-0.938734 2.21332,-1.408098 3.28961,-1.408098 2.71912,0 4.08272,0.623124 4.08272,1.869372 0,1.116777 -0.67575,1.970545 -2.01909,2.565349 -1.34742,0.594792 -2.99425,0.894226 -4.94052,0.894226 -1.0925,0 -2.10001,-0.137593 -3.03066,-0.408675 0.63121,-1.404057 1.50116,-2.573437 2.61794,-3.512174 z m 0,0"
       id="path4024" />
    <path
       style="fill:#ffffff;fill-opacity:1;stroke:#ffffff;stroke-width:1.03584719;stroke-linecap:butt;stroke-linejoin:miter;stroke-miterlimit:10;stroke-opacity:1"
       d="m 207.35585,-50.661687 c 0.19819,-1.072269 0.29941,-2.002914 0.29941,-2.791931 0,-4.426628 -2.36302,-6.635897 -7.08907,-6.635897 -2.85264,0 -5.22376,0.821387 -7.11336,2.468229 l -0.49364,-2.577478 -5.26422,0.967057 c 0.41678,1.444519 0.62314,2.808118 0.62314,4.082699 0,0.530062 -0.0294,0.942774 -0.0849,1.246248 l -3.24513,17.24929 h 5.39368 l 3.07112,-16.541184 c 1.53355,-1.618514 3.25725,-2.427767 5.17924,-2.427767 2.24973,0 3.37056,0.950866 3.37056,2.856669 0,0.728325 -0.1013,1.630652 -0.29941,2.706959 l -2.51276,13.405323 h 5.56365 z m 0,0"
       id="path4026" />
    <path
       style="fill:#e8701c;fill-opacity:1;stroke:#e8701c;stroke-width:1.03584719;stroke-linecap:butt;stroke-linejoin:miter;stroke-miterlimit:10;stroke-opacity:1"
       d="m 235.95088,-66.345066 v -1.780363 h -19.94006 l -0.90231,4.896004 h 12.93593 l -17.03885,24.791543 v 1.784412 h 20.38918 l 0.92254,-4.896005 h -12.8267 z m 0,0"
       id="path4032" />
    <path
       style="fill:#ffffff;fill-opacity:1;stroke:#ffffff;stroke-width:1.03584719;stroke-linecap:butt;stroke-linejoin:miter;stroke-miterlimit:10;stroke-opacity:1"
       d="m 271.69975,-53.81779 c 0,-4.183847 -2.2983,-6.275774 -6.89487,-6.275774 -2.7636,0 -5.05782,0.825436 -6.87866,2.472278 -1.25839,-1.646842 -3.40697,-2.472278 -6.44168,-2.472278 -2.59366,0 -4.75436,0.675725 -6.49022,2.023136 -0.12949,-0.659537 -0.28717,-1.355501 -0.47341,-2.087874 l -5.26017,0.926595 c 0.39655,1.347409 0.59886,2.727189 0.59886,4.147437 0,0.813297 -0.0364,1.416191 -0.10923,1.804635 l -3.11159,16.626165 h 5.47865 l 3.07112,-16.456215 c 0.51388,-0.659545 1.20581,-1.242208 2.07171,-1.752042 0.8659,-0.505783 1.64278,-0.760694 2.33066,-0.760694 2.27804,0 3.4191,0.744515 3.4191,2.233545 0,0.186129 -0.0176,0.356071 -0.0446,0.517924 l -3.05089,16.217482 h 5.49888 l 3.07113,-16.520953 c 0.43295,-0.598856 1.08442,-1.161291 1.95839,-1.675163 0.87401,-0.517924 1.68324,-0.772835 2.42779,-0.772835 2.10404,0 3.1561,0.995377 3.1561,2.986149 0,0.513875 -0.0405,1.003479 -0.12949,1.460701 l -2.7272,14.522101 h 5.49888 l 2.8162,-15.080486 c 0.14153,-0.772835 0.21434,-1.468799 0.21434,-2.083834 z m 0,0"
       id="path4046" />
    <path
       style="fill:#ffffff;fill-opacity:1;stroke:#ffffff;stroke-width:1.03584719;stroke-linecap:butt;stroke-linejoin:miter;stroke-miterlimit:10;stroke-opacity:1"
       d="m 284.63165,-45.846614 c 3.28154,0 6.04109,-0.736426 8.28275,-2.213315 2.24163,-1.476891 3.36246,-3.508125 3.36246,-6.101794 0,-1.905791 -0.75262,-3.370541 -2.25784,-4.39426 -1.50116,-1.023706 -3.46361,-1.533532 -5.88329,-1.533532 -4.11103,0 -7.43705,1.31099 -9.98217,3.941069 -2.54107,2.626038 -3.81159,5.919711 -3.81159,9.872917 0,3.119682 0.88208,5.575781 2.64222,7.368274 1.76012,1.788461 4.05841,2.686728 6.89487,2.686728 2.62199,0 4.84339,-0.412712 6.66014,-1.226018 l 0.62719,-5.652649 c -0.67572,0.619084 -1.59827,1.173417 -2.77168,1.667061 -1.17747,0.493653 -2.21738,0.740475 -3.11969,0.740475 -1.68729,0 -3.01043,-0.428903 -3.96131,-1.290768 -0.95493,-0.857808 -1.42834,-2.087875 -1.42834,-3.694247 0,-0.271104 0.0117,-0.594804 0.0405,-0.967065 1.53355,0.530062 3.10351,0.797124 4.70582,0.797124 z m -1.05203,-8.367709 c 1.11678,-0.938734 2.21332,-1.408098 3.28559,-1.408098 2.72314,0 4.08269,0.623124 4.08269,1.869372 0,1.116777 -0.67167,1.970545 -2.01909,2.565349 -1.34337,0.594792 -2.99425,0.894226 -4.94052,0.894226 -1.08844,0 -2.09596,-0.137593 -3.03066,-0.408675 0.63124,-1.404057 1.50521,-2.573437 2.62199,-3.512174 z m 0,0"
       id="path4048" />
    <path
       style="fill:#ffffff;fill-opacity:1;stroke:#ffffff;stroke-width:1.03584719;stroke-linecap:butt;stroke-linejoin:miter;stroke-miterlimit:10;stroke-opacity:1"
       d="m 315.82847,-59.660609 h -6.29601 l 1.61447,-6.939369 -6.14633,2.233546 -0.90231,4.705823 h -2.66245 l -0.9266,4.317379 h 2.66246 l -2.59771,11.535942 c -0.12949,0.558383 -0.19409,1.124855 -0.19409,1.699431 0,1.743941 0.53008,3.164192 1.59019,4.252637 1.06014,1.088448 2.4642,1.630652 4.21218,1.630652 2.66246,0 4.77057,-0.263001 6.31625,-0.793075 v -4.835303 c -1.78848,0.744515 -3.07923,1.116777 -3.86826,1.116777 -1.77632,0 -2.66245,-0.784974 -2.66245,-2.363025 0,-0.542204 0.0931,-1.221981 0.27924,-2.039324 l 2.31853,-10.204712 h 6.3405 z m 0,0"
       id="path4050" />
    <path
       style="fill:#ffffff;fill-opacity:1;stroke:#ffffff;stroke-width:1.03584719;stroke-linecap:butt;stroke-linejoin:miter;stroke-miterlimit:10;stroke-opacity:1"
       d="m 328.18176,-45.846614 c 3.27748,0 6.04109,-0.736426 8.28272,-2.213315 2.24163,-1.476891 3.36246,-3.508125 3.36246,-6.101794 0,-1.905791 -0.7526,-3.370541 -2.25781,-4.39426 -1.50119,-1.023706 -3.46361,-1.533532 -5.8833,-1.533532 -4.11508,0 -7.4411,1.31099 -9.98217,3.941069 -2.54106,2.626038 -3.81161,5.919711 -3.81161,9.872917 0,3.119682 0.87806,5.575781 2.64222,7.368274 1.76014,1.788461 4.05844,2.686728 6.89487,2.686728 2.62199,0 4.83933,-0.412712 6.66017,-1.226018 l 0.62313,-5.652649 c -0.67167,0.619084 -1.59424,1.173417 -2.77171,1.667061 -1.17342,0.493653 -2.21332,0.740475 -3.11564,0.740475 -1.69131,0 -3.01043,-0.428903 -3.96131,-1.290768 -0.9549,-0.857808 -1.43236,-2.087875 -1.43236,-3.694247 0,-0.271104 0.0176,-0.594804 0.0446,-0.967065 1.53355,0.530062 3.09946,0.797124 4.70583,0.797124 z m -1.05203,-8.367709 c 1.11677,-0.938734 2.21329,-1.408098 3.28555,-1.408098 2.72315,0 4.0827,0.623124 4.0827,1.869372 0,1.116777 -0.67167,1.970545 -2.01909,2.565349 -1.34739,0.594792 -2.99423,0.894226 -4.9405,0.894226 -1.08844,0 -2.10001,-0.137593 -3.03066,-0.408675 0.63121,-1.404057 1.50522,-2.573437 2.622,-3.512174 z m 0,0"
       id="path4052" />
    <path
       style="fill:#ffffff;fill-opacity:1;stroke:#ffffff;stroke-width:1.03584719;stroke-linecap:butt;stroke-linejoin:miter;stroke-miterlimit:10;stroke-opacity:1"
       d="m 360.66528,-59.684889 c -1.51735,-0.271105 -2.56941,-0.408675 -3.1561,-0.408675 -2.3064,0 -4.41449,0.809257 -6.31625,2.427767 l 0.36416,-1.994812 h -5.39368 l -4.29715,23.007139 h 5.3937 l 2.42776,-12.996652 c 0.29944,-1.561858 1.02775,-2.945688 2.18093,-4.155527 1.15319,-1.213879 2.42374,-1.816772 3.81159,-1.816772 0.97516,0 2.10004,0.473413 3.37462,1.416187 z m 0,0"
       id="path4054" />
  </g>
</svg>
