<?xml version="1.0" encoding="UTF-8" standalone="no"?>
<svg
   xmlns:dc="http://purl.org/dc/elements/1.1/"
   xmlns:cc="http://creativecommons.org/ns#"
   xmlns:rdf="http://www.w3.org/1999/02/22-rdf-syntax-ns#"
   xmlns:svg="http://www.w3.org/2000/svg"
   xmlns="http://www.w3.org/2000/svg"
   id="svg4261"
   version="1.1"
   viewBox="0 0 110.22237 59.094414"
   height="59.094414mm"
   width="110.22237mm">
  <defs
     id="defs4255" />
  <metadata
     id="metadata4258">
    <rdf:RDF>
      <cc:Work
         rdf:about="">
        <dc:format>image/svg+xml</dc:format>
        <dc:type
           rdf:resource="http://purl.org/dc/dcmitype/StillImage" />
        <dc:title></dc:title>
      </cc:Work>
    </rdf:RDF>
  </metadata>
  <g
     transform="translate(12.777852,43.243636)"
     id="layer1">
    <path
       style="fill:#2b2e2e;fill-opacity:1;stroke:#2b2e2e;stroke-width:0.35277778;stroke-linecap:butt;stroke-linejoin:miter;stroke-miterlimit:10;stroke-opacity:1"
       d="m 2.5927893,11.953686 c 0.551216,0.529167 1.321538,0.79375 2.312346,0.79375 1.350479,0 2.454289,-0.489204 3.307292,-1.470366 0.853006,-0.979784 1.280199,-2.1924565 1.280199,-3.6366425 0,-0.966007 -0.272853,-1.710145 -0.819934,-2.235178 -0.545701,-0.523656 -1.324292,-0.786861 -2.334397,-0.786861 -1.321538,0 -2.414323,0.487826 -3.276974,1.46348 -0.864031,0.975648 -1.295354,2.170408 -1.295354,3.585654 0,0.9949415 0.275607,1.7569965 0.826822,2.2861635 z m 1.752865,-4.7997055 c 0.450617,-0.694531 1.050064,-1.041799 1.795583,-1.041799 0.960494,0 1.441428,0.526412 1.441428,1.579234 0,0.966005 -0.221865,1.802472 -0.665592,2.5066515 -0.443728,0.705557 -1.04593,1.056955 -1.806607,1.056955 -0.961874,0 -1.441429,-0.558107 -1.441429,-1.6743145 0,-0.923287 0.224621,-1.730817 0.676617,-2.426727 z m 0,0"
       id="path4020" />
    <path
       style="fill:#2b2e2e;fill-opacity:1;stroke:#2b2e2e;stroke-width:0.35277778;stroke-linecap:butt;stroke-linejoin:miter;stroke-miterlimit:10;stroke-opacity:1"
       d="m 13.553705,12.748812 c 1.409733,0 2.543859,-0.4768 3.402376,-1.427644 0.858518,-0.950846 1.288465,-2.1704085 1.288465,-3.6586895 0,-2.028473 -1.04731,-3.042709 -3.13917,-3.042709 -0.668348,0 -1.34221,0.250799 -2.020206,0.752407 -0.0441,-0.311436 -0.09922,-0.560864 -0.16812,-0.745517 l -1.784558,0.32108 c 0.08682,0.434083 0.130912,0.866786 0.130912,1.295358 0,0.316949 -0.02893,0.632521 -0.08682,0.943956 L 9.5945953,15.674389 H 11.42463 l 0.585667,-3.285244 c 0.467155,0.239779 0.982543,0.359667 1.543403,0.359667 z M 13.027293,6.9610515 c 0.161231,-0.190166 0.402389,-0.365177 0.727605,-0.523652 0.323839,-0.158475 0.606338,-0.2384 0.844738,-0.2384 0.537435,0 0.959114,0.150206 1.266417,0.450617 0.307303,0.300413 0.460264,0.698666 0.460264,1.196139 0,1.073494 -0.25356,1.901692 -0.76481,2.4846035 -0.509875,0.582909 -1.244369,0.873675 -2.20486,0.873675 -0.468535,0 -0.822692,-0.124023 -1.061092,-0.373451 z m 0,0"
       id="path4022" />
    <path
       style="fill:#2b2e2e;fill-opacity:1;stroke:#2b2e2e;stroke-width:0.35277778;stroke-linecap:butt;stroke-linejoin:miter;stroke-miterlimit:10;stroke-opacity:1"
       d="m 22.860975,9.4704635 c 1.116209,0 2.057411,-0.250804 2.820845,-0.753787 0.762053,-0.502984 1.145148,-1.194761 1.145148,-2.078083 0,-0.649054 -0.256312,-1.147905 -0.768945,-1.496552 -0.512628,-0.348641 -1.1796,-0.522272 -2.005044,-0.522272 -1.400088,0 -2.532835,0.446482 -3.398242,1.342205 -0.866789,0.89435 -1.299491,2.016072 -1.299491,3.362415 0,1.0624655 0.300411,1.8989385 0.899859,2.5094055 0.600826,0.609095 1.383551,0.915017 2.349555,0.915017 0.892969,0 1.648132,-0.140557 2.268252,-0.417544 l 0.212217,-1.925119 c -0.230132,0.210841 -0.544325,0.399632 -0.943957,0.567751 -0.399629,0.168124 -0.753787,0.252182 -1.061087,0.252182 -0.576022,0 -1.025261,-0.146071 -1.3491,-0.439595 -0.325218,-0.292142 -0.487828,-0.711067 -0.487828,-1.2581455 0,-0.09233 0.0055,-0.202573 0.01516,-0.329354 0.522277,0.180523 1.055579,0.271476 1.602661,0.271476 z m -0.359669,-2.849785 c 0.381717,-0.319704 0.753787,-0.479554 1.120346,-0.479554 0.926042,0 1.390441,0.212217 1.390441,0.636651 0,0.380338 -0.230134,0.671105 -0.687641,0.873678 -0.458886,0.202567 -1.019749,0.304546 -1.682583,0.304546 -0.372073,0 -0.715206,-0.04686 -1.032151,-0.139182 0.214972,-0.478179 0.511252,-0.876435 0.891588,-1.196139 z m 0,0"
       id="path4024" />
    <path
       style="fill:#2b2e2e;fill-opacity:1;stroke:#2b2e2e;stroke-width:0.35277778;stroke-linecap:butt;stroke-linejoin:miter;stroke-miterlimit:10;stroke-opacity:1"
       d="m 34.831995,7.8305975 c 0.06752,-0.365181 0.101973,-0.682131 0.101973,-0.950847 0,-1.507574 -0.804772,-2.259981 -2.414323,-2.259981 -0.971518,0 -1.779047,0.279739 -2.422591,0.840603 l -0.168121,-0.877811 -1.792827,0.329351 c 0.141938,0.491958 0.212217,0.956357 0.212217,1.390441 0,0.180522 -0.0096,0.32108 -0.02893,0.424434 l -1.105186,5.8745775 h 1.836925 l 1.04593,-5.6334175 c 0.522277,-0.551218 1.109318,-0.826823 1.76389,-0.826823 0.766191,0 1.147905,0.323834 1.147905,0.972894 0,0.248044 -0.03447,0.55535 -0.101973,0.921906 l -0.855766,4.5654405 h 1.894806 z m 0,0"
       id="path4026" />
    <path
       style="fill:#e8701c;fill-opacity:1;stroke:#e8701c;stroke-width:0.35277778;stroke-linecap:butt;stroke-linejoin:miter;stroke-miterlimit:10;stroke-opacity:1"
       d="m 44.570588,2.4893185 v -0.606335 h -6.790973 l -0.3073,1.667428 h 4.405587 l -5.802918,8.4432375 v 0.607716 h 6.943937 l 0.31419,-1.667428 h -4.36838 z m 0,0"
       id="path4032" />
    <path
       style="fill:#2b2e2e;fill-opacity:1;stroke:#2b2e2e;stroke-width:0.35277778;stroke-linecap:butt;stroke-linejoin:miter;stroke-miterlimit:10;stroke-opacity:1"
       d="m 56.745557,6.7557245 c 0,-1.424889 -0.782725,-2.137336 -2.348177,-2.137336 -0.9412,0 -1.722546,0.28112 -2.342663,0.841984 -0.428572,-0.560864 -1.160307,-0.841984 -2.193838,-0.841984 -0.883322,0 -1.619197,0.230132 -2.210374,0.689018 -0.0441,-0.224616 -0.09784,-0.46164 -0.161232,-0.711065 l -1.791446,0.315571 c 0.135046,0.458885 0.203946,0.928796 0.203946,1.412488 0,0.276985 -0.01241,0.482312 -0.03721,0.614604 l -1.059709,5.6623605 h 1.865863 l 1.04593,-5.6044805 c 0.175011,-0.224621 0.410657,-0.423058 0.705553,-0.596691 0.294902,-0.172254 0.559486,-0.259069 0.793753,-0.259069 0.775835,0 1.164442,0.253558 1.164442,0.760677 0,0.06339 -0.0055,0.121266 -0.01516,0.176387 l -1.03904,5.5231765 h 1.872758 l 1.04593,-5.6265285 c 0.14745,-0.203951 0.369311,-0.395499 0.666967,-0.57051 0.297656,-0.176387 0.573265,-0.263202 0.826823,-0.263202 0.716581,0 1.074872,0.338994 1.074872,1.016989 0,0.175011 -0.01378,0.341755 -0.0441,0.49747 l -0.928796,4.9457815 h 1.872753 l 0.959114,-5.1359485 c 0.04823,-0.263205 0.07304,-0.500229 0.07304,-0.709692 z m 0,0"
       id="path4046" />
    <path
       style="fill:#2b2e2e;fill-opacity:1;stroke:#2b2e2e;stroke-width:0.35277778;stroke-linecap:butt;stroke-linejoin:miter;stroke-miterlimit:10;stroke-opacity:1"
       d="m 61.149769,9.4704635 c 1.117589,0 2.05741,-0.250804 2.820842,-0.753787 0.763434,-0.502984 1.145153,-1.194761 1.145153,-2.078083 0,-0.649054 -0.256317,-1.147905 -0.768948,-1.496552 -0.511251,-0.348641 -1.179599,-0.522272 -2.003668,-0.522272 -1.400085,0 -2.532835,0.446482 -3.399621,1.342205 -0.865404,0.89435 -1.298112,2.016072 -1.298112,3.362415 0,1.0624655 0.300416,1.8989385 0.899862,2.5094055 0.599445,0.609095 1.38217,0.915017 2.348177,0.915017 0.892968,0 1.649513,-0.140557 2.268249,-0.417544 l 0.213595,-1.925119 c -0.230129,0.210841 -0.544324,0.399632 -0.943954,0.567751 -0.40101,0.168124 -0.755163,0.252182 -1.062469,0.252182 -0.57464,0 -1.02526,-0.146071 -1.349099,-0.439595 -0.325216,-0.292142 -0.486445,-0.711067 -0.486445,-1.2581455 0,-0.09233 0.0041,-0.202573 0.01378,-0.329354 0.522277,0.180523 1.056955,0.271476 1.602658,0.271476 z m -0.358291,-2.849785 c 0.380338,-0.319704 0.753787,-0.479554 1.118968,-0.479554 0.927417,0 1.390438,0.212217 1.390438,0.636651 0,0.380338 -0.228751,0.671105 -0.687639,0.873678 -0.457509,0.202567 -1.019749,0.304546 -1.682586,0.304546 -0.370691,0 -0.713822,-0.04686 -1.03215,-0.139182 0.214974,-0.478179 0.51263,-0.876435 0.892969,-1.196139 z m 0,0"
       id="path4048" />
    <path
       style="fill:#2b2e2e;fill-opacity:1;stroke:#2b2e2e;stroke-width:0.35277778;stroke-linecap:butt;stroke-linejoin:miter;stroke-miterlimit:10;stroke-opacity:1"
       d="m 71.774446,4.7658415 h -2.144231 l 0.549836,-2.363338 -2.093238,0.760677 -0.3073,1.602661 h -0.906754 l -0.315571,1.470366 h 0.906754 l -0.884704,3.9287865 c -0.0441,0.19017 -0.06615,0.383093 -0.06615,0.578774 0,0.593934 0.180522,1.077626 0.54157,1.448318 0.361048,0.370692 0.839226,0.55535 1.434539,0.55535 0.906748,0 1.624703,-0.08957 2.151115,-0.270097 v -1.646756 c -0.609092,0.253561 -1.048684,0.380341 -1.317402,0.380341 -0.604962,0 -0.906751,-0.267338 -0.906751,-0.804775 0,-0.184658 0.03168,-0.4161685 0.09509,-0.6945315 l 0.789617,-3.47541 h 2.159384 z m 0,0"
       id="path4050" />
    <path
       style="fill:#2b2e2e;fill-opacity:1;stroke:#2b2e2e;stroke-width:0.35277778;stroke-linecap:butt;stroke-linejoin:miter;stroke-miterlimit:10;stroke-opacity:1"
       d="m 75.981596,9.4704635 c 1.116208,0 2.057411,-0.250804 2.820842,-0.753787 0.763431,-0.502984 1.145148,-1.194761 1.145148,-2.078083 0,-0.649054 -0.256315,-1.147905 -0.768942,-1.496552 -0.511252,-0.348641 -1.1796,-0.522272 -2.003669,-0.522272 -1.401466,0 -2.534211,0.446482 -3.39962,1.342205 -0.865407,0.89435 -1.298112,2.016072 -1.298112,3.362415 0,1.0624655 0.299034,1.8989385 0.899858,2.5094055 0.599445,0.609095 1.382173,0.915017 2.348177,0.915017 0.892969,0 1.648135,-0.140557 2.268252,-0.417544 l 0.212217,-1.925119 c -0.228753,0.210841 -0.542946,0.399632 -0.943957,0.567751 -0.399629,0.168124 -0.753787,0.252182 -1.061087,0.252182 -0.576019,0 -1.025261,-0.146071 -1.3491,-0.439595 -0.325215,-0.292142 -0.487826,-0.711067 -0.487826,-1.2581455 0,-0.09233 0.0055,-0.202573 0.01516,-0.329354 0.522277,0.180523 1.055579,0.271476 1.602661,0.271476 z m -0.358293,-2.849785 c 0.380341,-0.319704 0.753787,-0.479554 1.11897,-0.479554 0.927418,0 1.390438,0.212217 1.390438,0.636651 0,0.380338 -0.228753,0.671105 -0.687641,0.873678 -0.458888,0.202567 -1.019747,0.304546 -1.682586,0.304546 -0.370692,0 -0.715201,-0.04686 -1.03215,-0.139182 0.214976,-0.478179 0.512633,-0.876435 0.892969,-1.196139 z m 0,0"
       id="path4052" />
    <path
       style="fill:#2b2e2e;fill-opacity:1;stroke:#2b2e2e;stroke-width:0.35277778;stroke-linecap:butt;stroke-linejoin:miter;stroke-miterlimit:10;stroke-opacity:1"
       d="m 87.044484,4.7575705 c -0.516763,-0.09233 -0.875054,-0.139182 -1.074867,-0.139182 -0.785485,0 -1.503439,0.275609 -2.151121,0.826823 l 0.124024,-0.67937 h -1.836926 l -1.463476,7.8355235 h 1.836928 l 0.826823,-4.4262595 c 0.101973,-0.531921 0.35002,-1.003212 0.742759,-1.415245 0.392745,-0.413409 0.825447,-0.618736 1.298115,-0.618736 0.332107,0 0.715203,0.161229 1.149281,0.482309 z m 0,0"
       id="path4054" />
    <path
       style="fill:#2b2e2e;fill-opacity:1;fill-rule:nonzero;stroke:none;stroke-width:0.35277778"
       d="m 51.003273,-43.243636 c -0.179144,0 -0.351398,0.0028 -0.515387,0.0041 l -0.05099,0.0014 c -0.108863,0.0028 -0.217731,0.0041 -0.323839,0.0041 h -0.0937 c -0.05788,-0.0014 -0.117134,-0.0014 -0.17639,-0.0014 -3.202565,-0.0014 -5.695434,1.462098 -7.220921,2.688552 -0.864032,0.694532 -2.228289,1.966461 -4.052811,3.778581 l -0.238403,0.237023 0.225999,0.249425 c 0.966005,1.063845 1.885156,2.191081 2.811198,3.445095 l 1.52549,2.068435 0.242533,0.329352 0.289388,-0.289388 c 1.751486,-1.748731 3.042708,-2.965538 3.733104,-3.520888 0.609092,-0.489203 1.58061,-1.072114 2.751944,-1.072114 h 0.03996 c 0.05099,0 0.107487,0.0014 0.163989,0.0014 0.147449,0 0.294899,-0.0027 0.443727,-0.0055 l 0.04548,-0.0014 h 0.03168 c 0.111623,-0.0014 0.242536,-0.0041 0.367938,-0.0041 0.206706,0 0.3073,0.0069 0.355531,0.01102 1.220944,0.425814 2.287545,1.030773 3.166732,1.799718 1.679829,1.466233 3.238391,3.186025 4.765259,5.254459 l 5.892488,8.400524 3.881938,5.630663 0.175008,0.253558 1.599904,2.320618 0.01101,0.01654 0.01378,0.01516 2.807065,3.2149635 1.036283,1.174091 0.01378,0.01378 0.270098,0.274227 0.01378,0.01378 c 1.580611,1.460717 3.370684,3.11712 5.885604,4.20715 1.559938,0.675238 3.136413,1.018371 4.686707,1.018371 1.944409,0 3.881929,-0.537438 5.758819,-1.595771 2.096,-1.182354 3.73586,-2.335773 5.91454,-4.736317 l 0.19293,-0.213595 -0.1695,-0.231511 -4.19475,-5.7533095 -0.25907,-0.354155 -0.29077,0.327972 c -1.60817,1.819011 -3.06476,3.045465 -4.72116,3.979775 -0.800635,0.4506185 -1.511705,0.6614595 -2.233796,0.6614595 -0.580152,0 -1.180978,-0.139182 -1.839679,-0.4244375 -1.35599,-0.587043 -2.484605,-1.628844 -3.680743,-2.734029 l -1.681205,-1.904444 -1.513089,-1.710147 c -0.187412,-0.32384 -0.392739,-0.666974 -0.611846,-1.018373 -1.209919,-1.949923 -2.904906,-4.353221 -5.035352,-7.143752 -1.212675,-1.920985 -2.556261,-3.77858 -3.748265,-5.422581 l 0.03305,-0.02756 -0.197057,-0.267341 -2.091864,-2.83738 c -1.868578,-2.532786 -3.800592,-4.659099 -5.908988,-6.500158 -1.631598,-1.42627 -3.555338,-2.523188 -5.714724,-3.259061 -0.952225,-0.323839 -1.83968,-0.366558 -2.582445,-0.366558"
       id="path4058" />
    <path
       style="fill:#e8701c;fill-opacity:1;fill-rule:nonzero;stroke:none;stroke-width:0.35277778"
       d="m 44.454836,-24.262537 h -8.611362 l 1.291222,1.839682 h 8.502494 c -0.435457,-0.669727 -0.715201,-1.164441 -1.182354,-1.839682"
       id="path4084" />
    <path
       style="fill:#e8701c;fill-opacity:1;fill-rule:nonzero;stroke:none;stroke-width:0.35277778"
       d="m 35.086929,-25.340163 h 8.827715 c -0.410655,-0.624251 -0.828202,-1.241612 -1.248503,-1.841059 h -8.869055 z m 0,0"
       id="path4086" />
    <path
       style="fill:#e8701c;fill-opacity:1;fill-rule:nonzero;stroke:none;stroke-width:0.35277778"
       d="m 46.506735,-21.343852 h -0.361048 c 0.385853,0.553971 0.756544,1.092786 1.094163,1.60128 -0.337619,-0.508494 -0.70831,-1.047309 -1.094163,-1.60128 h -8.25445 l 0.902616,1.331186 0.340376,0.508494 h 8.614119 c -0.381717,-0.582909 -0.795131,-1.196136 -1.241613,-1.83968"
       id="path4088" />
    <path
       style="fill:#2b2e2e;fill-opacity:1;fill-rule:nonzero;stroke:none;stroke-width:0.35277778"
       d="m 25.239468,-41.880756 c 0.02617,0 0.05099,-0.0014 0.07855,-0.0014 0.02617,0 0.05236,0.0014 0.07855,0.0014 -0.05237,-0.0014 -0.106109,0 -0.157097,0 m -0.766191,6.859875 c -0.05236,0 -0.104727,0 -0.155715,-0.0014 0.201192,0.0041 0.4079,0 0.614606,-0.0041 -0.154339,0.0027 -0.307306,0.0055 -0.458891,0.0055 m -0.468532,-6.847463 c 0.07028,-0.0014 0.139181,-0.0055 0.210841,-0.0055 0.05374,0 0.107484,0 0.162605,0.0014 -0.126778,-0.0027 -0.249425,0.0014 -0.373446,0.0041 m -6.126761,11.310938 -0.724847,-0.982541 z m 15.147399,2.298568 h 8.875945 c -0.334864,-0.467155 -0.664215,-0.923286 -0.981165,-1.361502 l 0.03168,-0.02618 -0.1695,-0.228755 -1.98851,-2.69682 c -1.773517,-2.404679 -3.610442,-4.424883 -5.611356,-6.172236 -1.547532,-1.353233 -3.372059,-2.393652 -5.421199,-3.092318 -0.899859,-0.305924 -1.740466,-0.347265 -2.443263,-0.347265 -0.169498,0 -0.332108,0.0027 -0.486447,0.0055 l -0.05099,0.0014 c -0.104733,0.0014 -0.208087,0.0027 -0.31006,0.0027 h -0.08957 c -0.05375,-0.0014 -0.110244,-0.0014 -0.165365,-0.0014 -3.035819,0 -5.396399,1.386306 -6.843339,2.547993 -0.821309,0.660085 -2.116664,1.868625 -3.84886,3.589795 l -0.205327,0.203949 0.194303,0.212218 c 0.917773,1.01148 1.792827,2.083594 2.673397,3.276975 l 1.449694,1.96646 0.208085,0.28112 0.248047,-0.246669 c 1.664668,-1.663292 2.892501,-2.820844 3.549824,-3.35001 0.582909,-0.468533 1.514465,-1.026639 2.637565,-1.026639 h 0.03859 c 0.04823,0.0014 0.101973,0.0014 0.155715,0.0014 0.139187,0 0.278368,-0.0027 0.418926,-0.0055 h 0.07579 c 0.106109,-0.0028 0.230132,-0.0041 0.350023,-0.0041 0.20257,0 0.299032,0.0055 0.345884,0.01102 1.165823,0.405143 2.184194,0.982542 3.024796,1.718413 1.525487,1.332563 2.947625,2.888368 4.336688,4.740452"
       id="path4090" />
    <path
       style="fill:#2b2e2e;fill-opacity:1;fill-rule:nonzero;stroke:none;stroke-width:0.35277778"
       d="m 63.492432,-4.5483235 c -0.162605,0.09233 -0.326594,0.180523 -0.49058,0.263208 0.163986,-0.08268 0.327975,-0.170879 0.49058,-0.263208 0.265962,-0.148825 0.522277,-0.297656 0.768945,-0.446481 -0.246668,0.148825 -0.502983,0.297656 -0.768945,0.446481 m -3.300402,1.266421 c -0.66697,0.1378 -1.336696,0.206705 -2.00918,0.206705 0.672484,0 1.34221,-0.06891 2.00918,-0.206705 0.44373,-0.09233 0.887457,-0.214977 1.328431,-0.369316 -0.440974,0.154339 -0.884701,0.276987 -1.328431,0.369316 m -6.075767,-8.4832065 c 0.263202,0.217731 0.526409,0.424437 0.79375,0.613227 -0.267341,-0.18879 -0.530548,-0.395496 -0.79375,-0.613227 m -3.033065,-3.088182 -1.459343,-1.65227 c -0.09095,-0.155716 -0.186034,-0.316946 -0.285253,-0.482311 0.09922,0.165365 0.194305,0.326595 0.285253,0.482311 l 1.459343,1.65227 1.610929,1.823145 z m -2.72438,6.8984575 c 0.370692,0.343133 0.753785,0.697291 1.156174,1.051444 -0.402389,-0.354153 -0.785482,-0.708311 -1.156174,-1.051444 m 20.915866,-1.207159 -3.988046,-5.4680565 -0.220486,-0.303168 -0.249425,0.28112 c -1.530998,1.730814 -2.918685,2.899392 -4.49516,3.789606 -0.767566,0.432702 -1.448318,0.632518 -2.141471,0.632518 -0.55535,0 -1.131369,-0.132291 -1.762509,-0.405143 -1.293979,-0.560864 -2.370227,-1.554427 -3.508488,-2.607249 l -1.599901,-1.810742 -1.440048,-1.628841 c -0.177768,-0.308682 -0.374827,-0.633898 -0.582914,-0.970141 -0.15434,-0.249424 -0.319704,-0.508494 -0.491959,-0.773077 h -8.874566 l 2.594845,3.764798 0.165365,0.239782 1.521354,2.206238 0.0096,0.01378 0.01241,0.01241 2.666502,3.0564905 0.986676,1.116211 0.0055,0.0055 0.0055,0.0069 0.256315,0.259069 0.0055,0.0055 0.0069,0.0083 c 1.500682,1.386308 3.199804,2.957271 5.585187,3.992178 1.478635,0.639408 2.97243,0.964624 4.441418,0.964624 1.842436,0 3.679362,-0.508492 5.458409,-1.511705 1.989887,-1.121725 3.545692,-2.217264 5.61275,-4.496541 l 0.165364,-0.181898 z m 0,0"
       id="path4092" />
    <path
       style="fill:#2b2e2e;fill-opacity:1;fill-rule:nonzero;stroke:none;stroke-width:0.35277778;stroke-opacity:1"
       d="m -0.77789267,-42.183924 c -0.169499,0 -0.33210903,0.0027 -0.48644903,0.0055 l -0.05099,0.0014 c -0.103353,0.0014 -0.206706,0.0027 -0.308681,0.0027 h -0.08957 c -0.05512,-0.0014 -0.111622,-0.0014 -0.166744,-0.0014 -3.0358184,0 -5.3963992,1.386306 -6.8433385,2.547993 -0.821306,0.660085 -2.1166638,1.868625 -3.8488558,3.589795 l -0.205331,0.202571 0.194307,0.213596 c 0.919148,1.01148 1.794203,2.083594 2.6733922,3.276975 l 1.4510739,1.96646 0.2067066,0.28112 0.2480453,-0.246669 c 1.6646702,-1.663292 2.8925025,-2.820844 3.5498264,-3.348632 0.5829123,-0.469911 1.5144645,-1.028017 2.6375679,-1.028017 h 0.03858 c 0.04823,0.0014 0.101974,0.0014 0.15572,0.0014 0.139181,0 0.278363,-0.0027 0.420299,-0.0041 l 0.0441,-0.0014 h 0.0303 c 0.106109,-0.0027 0.23013503,-0.0041 0.35002303,-0.0041 0.202572,0 0.300411,0.0055 0.345888,0.01103 1.165821,0.405143 2.18418797,0.983919 3.02479397,1.718414 1.598525,1.395952 3.081292,3.030306 4.533745,4.999522 l 5.6017267,7.987111 3.690383,5.352301 0.166746,0.239778 1.519973,2.206242 0.01101,0.01378 0.01101,0.01241 2.666507,3.0564915 0.986674,1.116211 0.01101,0.01101 0.256312,0.260448 0.01241,0.01241 c 1.500685,1.387684 3.199802,2.95865 5.585188,3.993555 1.478637,0.639411 2.973808,0.964626 4.442796,0.964626 1.841058,0 3.677983,-0.508495 5.457031,-1.511708 1.98851,-1.121722 3.545692,-2.217264 5.612752,-4.495159 l 0.165364,-0.18328 -0.144695,-0.198437 -3.988044,-5.4680575 -0.220487,-0.303165 -0.249423,0.281117 c -1.531001,1.730817 -2.918682,2.899392 -4.49516,3.789606 -0.767569,0.431324 -1.448318,0.632521 -2.141474,0.632521 -0.553969,0 -1.131369,-0.132291 -1.762509,-0.406524 -1.293979,-0.559485 -2.370227,-1.553049 -3.50711,-2.605871 l -1.601279,-1.810742 -1.440048,-1.628841 c -0.179144,-0.310058 -0.374827,-0.635277 -0.582909,-0.97014 -1.149286,-1.852084 -2.760213,-4.136871 -4.78455,-6.789594 -1.158931,-1.835547 -2.444639,-3.609082 -3.581522,-5.178668 l 0.03171,-0.02618 -0.168122,-0.228755 -1.989886,-2.69682 c -1.77353,-2.404645 -3.6090747,-4.423472 -5.6113637,-6.17358 -1.547538,-1.351856 -3.372062,-2.392274 -5.421204,-3.089562 -0.89985797,-0.307302 -1.74046097,-0.348644 -2.44326097,-0.348644"
       id="path4140" />
  </g>
</svg>
