"RefDes","Value","Quantity","Name","Manufacturer"
"B1, J7, Lin, Lout, Nin","","5","",""
"C1, C18, C21, C22","1nF 25v (0603)","4","885012206059","Wurth Electronic"
"C2, C31","4.7uF 10v (0805)","2","C2012X7R1A475K085AC","TDK"
"C3, C6, C7, C8, C9, C10, C11, C12, C14, C17, C20, C24, C25","100nF 10v (0603)","13","CC0603KRX7R6BB104","Yageo"
"C4, C5, C15","220uF 6.3v (6.3x7)","3","865080143009","Wurth Electronics"
"C16, C27","22pF 10v (0603)","2","885012006004","Wurth Electronics"
"C19","1uF 6.3v (0603)","1","06036C105MAT2A","Wurth Electronic"
"CON3","2Pin Header x 2","1","2 x 960102-6303-AR","3M"
"D1, D9, D10, D11, D12, D13, D14, D15, D17, D18, D21, D22, D23, D24, D25, D26, D27, D28","Green LED (0603)","18","APT1608SGC","Kingbright"
"D2, D3, D5, D7, D8, D19, D20","Yellow LED (0603)","7","APT1608YC","Kingbright"
"D4","SS12 (SMA)","1","SS12E-TP","Micro Commertial Components"
"D6, D16, D29","Red LED (0603)","3","APT1608EC","Kingbright"
"F1","Fuse holder","1","FC -102 x 2 + 500mA Fuse","Bel Fuse"
"L1","100uH (0805)","1","LBC3225T101KR","Taiyo Yuden"
"L3","4.7uH (5020)","1","SRN5020-4R7M","Bourns"
"LS3","Buzzer","1","CST-931AP","CUI Inc"
"Q1, Q2","P-Channel Mosfet (SOT-23)","2","DMG2301L-7","Diodes Incorporated"
"Q3, Q4, Q5","N-Channel Mosfet (SOT-23)","3","2N7002LT1G","ON Semiconductor"
"R1, R8","10k (0603)","2","CR0603-FX-1002ELF","Bourns"
"R2, R4, R9","1k (0603)","3","APC0603B1K00N","Arcol / Ohmite"
"R3","270k (0603)","1","CR0603-FX-2703ELF","Bourns"
"R5, R27, R28","510k (1206)","3","CPF1206B510KE1","TE Connectivity / Heohm"
"R6, R10, R12, R14, R15, R16, R17, R18, R19, R20, R21, R22, R23, R24, R29","270h (0603)","15","CR0603-FX-2700GLF","Bourns"
"R7, R11","560h (0603)","2","CR0603-FX-5600ELF","Bourns"
"R13","100k (0603)","1","CR0603-FX-1003HLF","Bourns"
"R25, R26","22h (0603)","2","CR0603-FX-22R0ELF","Bourns"
"R34","1k5 (0603)","1","CR0603-FX-1501ELF","Bourns"
"S1, S2","Push button","2","FSMRA3JH","TE Connectivity"
"T2","DC-DC Converter","1","RFM-0505S","RECOM"
"T3","AC-DC Converter","1","HLK-5M05","Hi-Link"
"U1","STM32 Microcontroller","1","STM32F373C8T6","ST Microelectronics"
"U2","MCP1642B (SOP-8)","1","MCP1642B-50I/MS","Microchip"
"U3","Isolation amplifier","1","ACPL-C79A","Broadcom"
"U4","Battery charger","1","MCP73831T-2ACI/OT","Microchip"
"U5","Voltage reference","1","LM4040C25QFTA","Diodes Incorporated"
"U6","Voltage regulator","1","MCP1700-3.3","Microchip"
"U8","Current sensor","1","TLI4970-D050T4","Infineon"
"V4","250VAC Varistor","1","ERZ-V05D391","Panasonic"
"Y2","8MHz cristal","1","ABLS-8.000MHZ-B2-T","Abracon"
