M48
;DRILL file {KiCad 5.0.2+dfsg1-1~bpo9+1} date lun 17 jun 2019 00:41:50 CEST
;FORMAT={-:-/ absolute / metric / decimal}
FMAT,2
METRIC,TZ
T1C0.300
T2C0.600
T3C0.700
T4C0.750
T5C0.760
T6C0.800
T7C0.900
T8C1.000
T9C1.200
T10C1.300
T11C3.000
T12C3.100
T13C5.000
%
G90
G05
T1
X136.677Y-25.4
X136.677Y-30.48
X137.49Y-31.547
X138.125Y-82.067
X138.379Y-27.102
X138.379Y-27.686
X138.659Y-48.768
X138.938Y-69.799
X139.395Y-51.765
X139.878Y-61.976
X140.894Y-74.879
X143.18Y-84.938
X145.237Y-27.051
X145.593Y-37.363
X146.888Y-26.162
X148.336Y-48.425
X148.336Y-49.39
X149.2Y-67.424
X149.581Y-26.162
X149.733Y-37.363
X149.962Y-67.424
X150.038Y-51.46
X150.038Y-52.121
X150.673Y-67.424
X150.978Y-47.727
X150.978Y-48.362
X150.978Y-48.997
X150.978Y-49.657
X150.978Y-50.305
X150.978Y-50.927
X151.486Y-69.901
X151.486Y-75.26
X152.476Y-25.273
X153.111Y-29.909
X153.746Y-29.909
X154.305Y-25.273
X154.381Y-29.909
X154.381Y-32.385
X154.635Y-62.433
X155.016Y-29.909
X155.651Y-29.909
X155.931Y-28.6
X156.083Y-25.273
X156.794Y-39.294
X156.947Y-54.432
X157.15Y-28.6
X157.277Y-74.041
X157.404Y-45.669
X159.944Y-62.205
X160.452Y-41.935
X162.154Y-35.408
X162.179Y-34.671
X162.179Y-37.592
X162.509Y-73.254
X163.075Y-79.255
X163.322Y-74.041
X163.957Y-66.904
X164.008Y-34.671
X164.008Y-35.408
X164.008Y-37.617
X165.329Y-79.248
X166.446Y-74.041
X166.7Y-43.917
X166.853Y-50.597
X167.335Y-55.982
X167.589Y-74.041
X167.64Y-27.635
X167.945Y-66.446
X168.656Y-79.248
X169.545Y-65.354
X169.723Y-68.301
X170.713Y-74.041
X170.942Y-79.248
X171.704Y-28.575
X172.72Y-61.519
X173.025Y-34.671
X173.025Y-68.275
X173.05Y-69.545
X173.05Y-70.815
X173.05Y-71.907
X173.076Y-66.015
X173.863Y-42.367
X174.295Y-79.248
X174.828Y-75.87
X175.336Y-74.32
X175.387Y-54.585
X176.276Y-65.659
X178.079Y-72.034
X178.156Y-83.82
X178.257Y-67.132
X178.257Y-78.562
X178.41Y-47.752
X178.638Y-31.572
X178.791Y-34.9
X179.019Y-72.136
X179.248Y-69.139
X179.273Y-75.311
X179.349Y-65.862
X179.375Y-73.33
X180.746Y-69.596
X180.823Y-66.853
X181.28Y-72.034
X182.245Y-44.831
X182.575Y-27.
X182.956Y-90.195
X183.693Y-84.658
X184.861Y-63.627
X184.861Y-66.599
X184.861Y-72.796
X184.861Y-76.581
X185.014Y-35.611
X185.852Y-55.22
X185.903Y-81.864
X186.792Y-79.273
X186.944Y-67.361
X188.214Y-28.194
X188.239Y-73.33
X188.824Y-69.723
X189.128Y-68.123
X189.332Y-79.299
X189.357Y-81.94
X189.408Y-75.921
X189.763Y-62.763
X191.287Y-69.698
X191.745Y-79.273
X191.77Y-44.602
X192.227Y-56.972
X193.065Y-75.768
X193.472Y-49.911
X195.047Y-90.754
X195.402Y-85.954
X195.732Y-74.371
X195.758Y-77.089
X197.333Y-26.822
X197.46Y-56.439
X197.612Y-72.06
X197.637Y-29.896
X197.637Y-31.572
X198.603Y-79.273
X199.085Y-67.259
X199.085Y-71.399
X199.517Y-76.987
X200.279Y-78.105
X200.939Y-82.22
X201.219Y-41.681
X202.387Y-75.87
X202.438Y-72.06
X202.489Y-62.382
X203.073Y-69.85
X203.2Y-67.361
X203.251Y-28.372
X203.302Y-34.9
X203.556Y-71.399
X203.606Y-78.105
X203.759Y-74.168
X204.14Y-49.682
X204.14Y-58.826
X204.419Y-72.238
X204.673Y-75.87
X204.749Y-73.355
X205.003Y-85.039
X205.41Y-70.358
X205.816Y-72.06
X205.816Y-73.355
X206.121Y-90.475
X206.324Y-77.013
X206.908Y-67.31
X206.959Y-54.331
X207.975Y-72.06
X208.128Y-63.398
X208.382Y-44.831
X209.931Y-72.314
X210.363Y-61.392
X210.49Y-70.358
X210.795Y-81.636
X211.074Y-52.451
X211.226Y-64.567
X211.455Y-36.754
X211.76Y-42.215
X211.988Y-64.567
X212.547Y-63.297
X213.131Y-27.457
X213.208Y-67.005
X213.335Y-60.249
X213.436Y-80.416
X213.741Y-59.258
X213.868Y-56.871
X213.868Y-60.782
X213.868Y-65.354
X213.995Y-75.819
X215.405Y-53.95
X215.544Y-69.799
X215.544Y-71.298
X215.621Y-54.61
X215.697Y-72.669
X215.697Y-74.651
X215.697Y-75.844
X215.748Y-59.284
X215.925Y-58.445
X215.976Y-49.53
X216.002Y-51.003
X216.078Y-67.005
X216.116Y-55.27
X216.116Y-56.058
X216.154Y-60.782
X216.154Y-62.052
X216.179Y-65.354
X216.23Y-69.799
X216.23Y-71.323
X216.306Y-63.322
X216.306Y-64.567
X216.51Y-73.685
X216.586Y-59.588
X216.814Y-85.496
X216.967Y-71.552
X217.018Y-48.489
X217.018Y-51.994
X217.018Y-66.827
X217.018Y-68.224
X217.17Y-90.297
X217.526Y-34.9
X217.729Y-64.567
X218.618Y-66.827
X218.77Y-84.303
X219.608Y-72.492
X219.888Y-66.827
X220.294Y-47.523
X220.37Y-62.916
X220.904Y-41.3
X220.955Y-72.238
X221.031Y-55.27
X221.031Y-56.083
X221.031Y-56.871
X221.031Y-59.284
X221.056Y-57.683
X221.132Y-36.678
X221.132Y-48.616
X221.158Y-66.827
X221.64Y-52.07
X222.428Y-48.616
X222.428Y-53.873
X222.428Y-66.827
X222.758Y-45.136
X222.885Y-72.085
X222.961Y-59.334
X223.164Y-79.146
X223.19Y-55.321
X223.19Y-60.503
X223.393Y-56.972
X223.444Y-27.559
X223.622Y-81.864
X224.053Y-48.616
X224.18Y-86.03
X224.968Y-66.827
X225.12Y-56.21
X225.12Y-75.209
X225.12Y-75.87
X225.476Y-68.961
X225.654Y-70.866
X225.654Y-72.441
X225.806Y-83.845
X226.162Y-58.217
X226.517Y-73.076
X226.619Y-75.87
X227.076Y-55.321
X227.228Y-60.503
X227.508Y-67.005
X227.508Y-68.224
X227.508Y-70.866
X227.508Y-72.441
X228.092Y-75.209
X228.422Y-61.493
X228.575Y-68.224
X229.184Y-48.057
X229.184Y-49.987
X229.311Y-53.416
X229.718Y-84.379
X230.048Y-63.551
X230.048Y-66.904
X230.429Y-72.034
X230.429Y-76.886
X230.708Y-79.273
X231.318Y-67.005
X231.496Y-60.858
X231.8Y-59.284
X231.8Y-71.425
X231.978Y-81.001
X232.207Y-25.806
X232.41Y-77.927
X232.588Y-63.17
X232.588Y-67.005
X232.918Y-59.284
X233.299Y-72.06
T2
X157.556Y-83.82
X159.023Y-78.82
X153.67Y-83.82
X155.137Y-78.82
X158.255Y-25.432
X158.255Y-27.432
T3
X192.356Y-81.824
X181.053Y-81.824
X214.962Y-81.824
X203.659Y-81.824
X165.786Y-32.705
X165.786Y-70.165
X168.326Y-32.705
X168.326Y-70.165
T4
X142.291Y-26.346
X142.291Y-28.346
T5
X193.626Y-79.284
X194.896Y-81.824
X196.166Y-79.284
X182.323Y-79.284
X183.593Y-81.824
X184.863Y-79.284
X216.232Y-79.284
X217.502Y-81.824
X218.772Y-79.284
X204.929Y-79.284
X206.199Y-81.824
X207.469Y-79.284
T6
X144.833Y-40.297
X147.333Y-40.297
X138.811Y-58.102
X138.811Y-65.722
X141.351Y-58.102
X141.351Y-65.722
X143.891Y-58.102
X143.891Y-65.722
X146.431Y-58.102
X146.431Y-65.722
X138.887Y-39.067
X138.887Y-41.567
T7
X206.096Y-28.829
X208.636Y-28.829
X191.084Y-28.804
X193.624Y-28.804
X161.087Y-28.829
X163.627Y-28.829
X176.098Y-28.829
X178.638Y-28.829
T8
X218.313Y-42.697
X225.913Y-42.697
X148.611Y-89.459
X153.111Y-89.459
X138.891Y-72.072
X143.891Y-72.072
X229.845Y-39.776
X229.845Y-42.316
X229.845Y-44.856
X149.305Y-72.072
X154.305Y-72.072
T9
X146.939Y-78.024
X149.479Y-82.423
X159.639Y-87.884
X163.449Y-87.884
X167.259Y-87.884
X171.069Y-87.884
T10
X141.935Y-46.27
X141.935Y-51.27
X147.361Y-86.959
X154.361Y-86.959
T11
X159.516Y-33.735
X159.516Y-69.135
X194.916Y-33.735
X194.916Y-69.135
T12
X142.367Y-79.756
X227.367Y-79.756
T13
X142.367Y-34.798
X227.367Y-34.798
T0
M30
