G04 DipTrace 3.0.0.1*
G04 TopPaste.gbr*
%MOMM*%
G04 #@! TF.FileFunction,Paste,Top*
G04 #@! TF.Part,Single*
%ADD64C,1.1692*%
%ADD66R,0.35X1.35*%
%ADD68R,1.05X0.55*%
%ADD70R,0.55X1.95*%
%ADD72R,0.55X1.05*%
%ADD74R,0.25X1.55*%
%ADD76R,1.55X0.25*%
%ADD77C,1.55*%
%ADD78C,1.45*%
%ADD79R,1.55X1.55*%
%ADD80R,1.45X1.45*%
%ADD82R,1.45X1.35*%
%ADD84R,1.55X0.95*%
%ADD87R,1.45X2.15*%
%ADD89C,1.474*%
%ADD91R,1.474X1.474*%
%ADD93R,0.55X0.55*%
%ADD95R,1.0X0.6*%
%ADD97R,2.05X1.35*%
%ADD98R,1.35X2.05*%
%ADD100R,0.6X1.0*%
%ADD102C,1.75*%
%ADD105R,0.8X0.75*%
%ADD107R,0.95X1.55*%
%ADD109R,0.75X0.8*%
%FSLAX35Y35*%
G04*
G71*
G90*
G75*
G01*
G04 TopPaste*
%LPD*%
D109*
X-1127007Y4133933D3*
Y4278933D3*
X-1507967Y4628147D3*
Y4483147D3*
X158733Y3514873D3*
Y3659873D3*
D107*
X-1841500Y2841623D3*
X-2141500D3*
D105*
X-1564750Y2206623D3*
X-1419750D3*
D77*
X-240087Y2492113D3*
X-490087D3*
X1623053Y3539753D3*
X2123053D3*
D102*
X1623053Y2254013D3*
X2123053D3*
D109*
X-1634953Y4133933D3*
Y4278933D3*
X-2968313Y4621280D3*
Y4476280D3*
D105*
X-1548877Y777873D3*
X-1403877D3*
D77*
X-2125250Y1014000D3*
X-1875250D3*
D109*
X-1000020Y4483147D3*
Y4628147D3*
X-317467Y4929740D3*
Y4784740D3*
X-190480Y4929740D3*
Y4784740D3*
X-1761940Y4483147D3*
Y4628147D3*
X-2523860Y4133933D3*
Y4278933D3*
X-2396873Y4133933D3*
Y4278933D3*
D105*
X-1215380Y2888947D3*
X-1070380D3*
D109*
X-95240Y3514873D3*
Y3659873D3*
D105*
X-1977300Y3015933D3*
X-1832300D3*
D77*
X-240087Y3158793D3*
X-490087D3*
D109*
X-746047Y4278933D3*
Y4133933D3*
X-95240Y4024960D3*
Y3879960D3*
X31747Y3659873D3*
Y3514873D3*
X-2269887Y4628147D3*
Y4483147D3*
X-1253993Y4133933D3*
Y4278933D3*
X-873033Y4133933D3*
Y4278933D3*
D107*
X-2698750Y1603373D3*
X-2398750D3*
D109*
X-746047Y4628147D3*
Y4483147D3*
D77*
X-428627Y1140997D3*
Y890997D3*
D105*
X-1086377Y777873D3*
X-1231377D3*
Y1095377D3*
X-1086377D3*
Y1254127D3*
X-1231377D3*
X-1403877Y936623D3*
X-1548877D3*
X-2499250Y2286000D3*
X-2644250D3*
D77*
X-2125250Y2397123D3*
X-1875250D3*
D105*
X-1419750Y1825623D3*
X-1564750D3*
D109*
X-1507967Y4278933D3*
Y4133933D3*
D77*
X-2952750Y1455750D3*
Y1655750D3*
Y2089123D3*
Y2289123D3*
Y2489123D3*
Y2689123D3*
X-2492377Y4555627D3*
X-2746377D3*
X-2492377Y809627D3*
X-2746377D3*
D100*
X-1920673Y4238180D3*
X-2110673D3*
X-2015673Y4008180D3*
D98*
X-83867Y1762120D3*
X306120D3*
D100*
X-1158753Y4666760D3*
X-1348753D3*
X-1253753Y4436760D3*
D98*
X-2317750Y2889250D3*
X-2707737D3*
D97*
X1317633Y4234110D3*
Y4624097D3*
D100*
X-1920673Y4666760D3*
X-2110673D3*
X-2015673Y4436760D3*
D95*
X59607Y2602987D3*
Y2412987D3*
X289607Y2507987D3*
D100*
X-1920673Y3841347D3*
X-2110673D3*
X-2015673Y3611347D3*
D95*
X59607Y2968073D3*
Y2778073D3*
X289607Y2873073D3*
D97*
X619123Y4234110D3*
Y4624097D3*
D95*
X59607Y2237900D3*
Y2047900D3*
X289607Y2142900D3*
D98*
X-83867Y1381123D3*
X306120D3*
D97*
X968380Y4234110D3*
Y4624097D3*
D93*
X-983123Y1254127D3*
X-763123D3*
D77*
X2381237Y4937137D3*
X2127237D3*
X1873237D3*
X1619237D3*
X2381237Y5445137D3*
X2127237D3*
X1873237D3*
X1619237D3*
X-555530Y4937137D3*
X-809530D3*
X-1063530D3*
X-555530Y5445137D3*
X-809530D3*
X-1063530D3*
D91*
X-190473Y5190527D3*
D89*
Y5444527D3*
Y5698527D3*
D77*
X-1317557Y4937137D3*
X-1571557D3*
X-1825557D3*
X-1317557Y5445137D3*
X-1571557D3*
X-1825557D3*
X-2841610Y4937137D3*
X-3095610D3*
X-3349610D3*
X-2841610Y5445137D3*
X-3095610D3*
X-3349610D3*
X-2079583Y4937137D3*
X-2333583D3*
X-2587583D3*
X-2079583Y5445137D3*
X-2333583D3*
X-2587583D3*
D87*
X-1210123Y2460623D3*
X-790123D3*
D109*
X285720Y3514873D3*
Y3659873D3*
D102*
X984147Y1984167D3*
X584147D3*
D87*
X-1774377Y1778000D3*
X-2194377D3*
D102*
X1202500Y1190623D3*
X702500D3*
D79*
X-3142920Y3444513D3*
D77*
Y3944513D3*
D95*
X-2456750Y2445000D3*
Y2635000D3*
X-2686750Y2540000D3*
Y1269750D3*
Y1079750D3*
X-2456750Y1174750D3*
D109*
X-3508007Y2991053D3*
Y3136053D3*
D84*
X825413Y2310367D3*
Y2610367D3*
X1095260Y3531020D3*
Y3231020D3*
D109*
X-1000020Y4133933D3*
Y4278933D3*
D105*
X-2492377Y1428750D3*
X-2637377D3*
D84*
X825413Y3231020D3*
Y3531020D3*
D105*
X-2499250Y2159000D3*
X-2644250D3*
D109*
X-3127047Y3136053D3*
Y2991053D3*
D105*
X-1564750Y2079623D3*
X-1419750D3*
X-1564750Y1952623D3*
X-1419750D3*
D109*
X-3254033Y3136053D3*
Y2991053D3*
D102*
X968273Y3873093D3*
X568273D3*
D105*
X-929660Y2888947D3*
X-784660D3*
D84*
X825413Y2770693D3*
Y3070693D3*
X555567Y2310367D3*
Y2610367D3*
Y3231020D3*
Y3531020D3*
Y2770693D3*
Y3070693D3*
X1095260Y2770693D3*
Y3070693D3*
D109*
X-1380980Y4133933D3*
Y4278933D3*
X-1761940D3*
Y4133933D3*
X-873033Y4483147D3*
Y4628147D3*
D84*
X1095260Y2610367D3*
Y2310367D3*
D109*
X-1634953Y4483147D3*
Y4628147D3*
X-2650847Y4133933D3*
Y4278933D3*
X-2269887Y4133933D3*
Y4278933D3*
X-2777833Y4133933D3*
Y4278933D3*
X-3381020Y3136053D3*
Y2991053D3*
X-2873073D3*
Y3136053D3*
D105*
X-800623Y777873D3*
X-945623D3*
X-1231377Y936623D3*
X-1086377D3*
D109*
X-920750Y943500D3*
Y1088500D3*
D105*
X-1816627Y1428750D3*
X-1961627D3*
X-2247377D3*
X-2102377D3*
D82*
X1581000Y1380980D3*
X2381000D3*
X1581000Y936527D3*
X2381000D3*
D80*
X-2047660Y3238160D3*
D78*
X-2301660D3*
X-2555660D3*
D76*
X-866020Y3217517D3*
Y3267517D3*
Y3317517D3*
Y3367517D3*
Y3417517D3*
Y3467517D3*
Y3517517D3*
Y3567517D3*
Y3617517D3*
Y3667517D3*
Y3717517D3*
Y3767517D3*
D74*
X-1011020Y3912517D3*
X-1061020D3*
X-1111020D3*
X-1161020D3*
X-1211020D3*
X-1261020D3*
X-1311020D3*
X-1361020D3*
X-1411020D3*
X-1461020D3*
X-1511020D3*
X-1561020D3*
D76*
X-1706020Y3767517D3*
Y3717517D3*
Y3667517D3*
Y3617517D3*
Y3567517D3*
Y3517517D3*
Y3467517D3*
Y3417517D3*
Y3367517D3*
Y3317517D3*
Y3267517D3*
Y3217517D3*
D74*
X-1561020Y3072517D3*
X-1511020D3*
X-1461020D3*
X-1411020D3*
X-1361020D3*
X-1311020D3*
X-1261020D3*
X-1211020D3*
X-1161020D3*
X-1111020D3*
X-1061020D3*
X-1011020D3*
D72*
X79607Y3817460D3*
X174607D3*
X269607D3*
Y4087460D3*
X79607D3*
D70*
X-1222377Y1476247D3*
X-1095377D3*
X-968377D3*
X-841377D3*
X-714377D3*
X-587377D3*
X-460377D3*
X-333377D3*
Y2016247D3*
X-460377D3*
X-587377D3*
X-714377D3*
X-841377D3*
X-968377D3*
X-1095377D3*
X-1222377D3*
D68*
X-2691127Y1992123D3*
Y1897123D3*
Y1802123D3*
X-2421127D3*
Y1992123D3*
D66*
X-1592000Y2417500D3*
X-1527000D3*
X-1462000D3*
X-1397000D3*
Y2857500D3*
X-1462000D3*
X-1527000D3*
X-1592000D3*
D95*
X59607Y3333160D3*
Y3143160D3*
X289607Y3238160D3*
D66*
X-1603373Y1206500D3*
X-1538373D3*
X-1473373D3*
X-1408373D3*
Y1646500D3*
X-1473373D3*
X-1538373D3*
X-1603373D3*
D78*
X2250040Y4336280D3*
X1750040Y4616280D3*
D64*
X-428747Y4321117D3*
Y3838517D3*
D109*
X-2428877Y3467623D3*
Y3612623D3*
X-2555877Y3467623D3*
Y3612623D3*
M02*
