{
  "type": "service_account",
  "project_id": "foodly-12853",
  "private_key_id": "072fdd2f32718424ac6b9b9ae0ccbd81efd8e888",
  "private_key": "-----BEGIN PRIVATE KEY-----\nMIIEvQIBADANBgkqhkiG9w0BAQEFAASCBKcwggSjAgEAAoIBAQCx4psVfh1dPAVD\nqQSW900+ADqdTBnSqSgcoA5dSg/KX/W9pBZ/V6onyatBmkYT0R5ZLP/1XNLmHkpO\nUEDgxPZRm+0S4ji2dVEvxKIbmbttJjdjXC9Rq2Ql+kDX2949KRolj3PFXsFhtvGB\niix6drSaqzl3j1uoS00GajXGs0oHmJKfRQwRSO9K2nFQ2CaqxDVQMq1HRAInRFQZ\nsBReNllqc1oV/I9/hUHemWB8PrmaHDOL1AYNdqC9XWs2Z1YnZiVuIxgycj/VLaTR\nuOT9L/kVqbkJFti3TnsbuC/NsgoRBfiAuMxKKp6R9MLWz3Wsxxxmusf0RfOJaKKC\nto0nWw6RAgMBAAECggEAA3csYL0l6fhOmYD2A5ixk8RstT4+MTaSOAnhVqZg1mAn\n/nRhJETbSMdgP/jTkOaaK8HrOxia2splY/nbnUVnSGxm6TR98bDwh2p88R8oYbnh\nNUCs2DaWB6xExuiwcScJECWZa3cOyTHHjZmD3PvNfoAgIicpY2qFB4ZoogR6nbzK\njFIAU0NuyhNNgvoV+je4/lcxDEFXMTguZmkNmgtr8MWFe85SDSklIYZAJC+WnYRQ\nSGVNUwmxyRu9xpPLTBdL4Du6UI9U+TfM0w70gc8qYOaUyKfxjjBqeCFDWOLZ9cyM\nKBvX6RvlmjFBFLDBRTZFWRIP/cKLnb6jeb3KTWu2vQKBgQDf2zV2uAXOSkFXnzaj\nSlbMYVuit4io/O82VGe33Ev17b1OS6kPNaARRnWcC5Y/EXQ29hjbreTiYpHF3uOj\nUHNz1+8nmSxk3PCoAzoTc1IKMiAybrHwhvq/BPLVL2/i3worzzF1Affm6bZqEpZA\nQYB877EjnfaCKMFxOJjQ9+6mwwKBgQDLbYh98qyx+g1R6ay6dGHOG7z8oxSjnlmP\nI0A0f5JZBay0cDSEsT/e8ZmH2D1Wa/+O7CpBuDuyEwVCLx77M0ix0I/5GI2Hcw8y\ndXiOaq0VcHSgCrtCheGr5QKikcmMAgF3l6neUgRTNW16N6K/tQUZ/nlsDZ65CIN7\nFpPj9EsoGwKBgBcnupkEIf2bqrSgkGtFlkLf0zW6nFU2jJvnES9whx7yL4G4y8z5\n9Au1aRbyD+GIMag5voqCq0lLft6j1pIfEUIrVN6YtoHcZLxMUSaP6C2Lz87HqnpB\nzBAUN/YbSQyDm666aNg8kuL8y9SfBZGx9NN3i7Aud8Aw7QmEHDKJYtM3AoGBAIV0\nPCD0PRsdQfPE6s3/X9KJG/hZPEcCsRpYM9y8/FNuh5hwK+QJLC+kK+aUk9jITQWE\nJUysAm2WUNLUeuys/jm461qtItwDPasKqaY0kYwJFFmR8Lt5fUz5ljr0jVZOUowU\ncRoqkC/OUx3ktd4ycUBWU23xmXkl/quXajoXn96VAoGAFpNwcd24rHBtdUIh0CxV\nCFHpa4OzC2B/RsN/793Vi9QHGMilKQqevg2ThR+T4EVFplMK0+0dIbYKT0M5OlP+\n7y6pwqp78m82aXCrUTna2tJ99cOIXTkqwrdiHsgKz61BFmL+/vEML9XIu6NIKnPq\n1QkACEZmTghR6pWYeenjAec=\n-----END PRIVATE KEY-----\n",
  "client_email": "firebase-adminsdk-fpdoy@foodly-12853.iam.gserviceaccount.com",
  "client_id": "102006066961355288915",
  "auth_uri": "https://accounts.google.com/o/oauth2/auth",
  "token_uri": "https://oauth2.googleapis.com/token",
  "auth_provider_x509_cert_url": "https://www.googleapis.com/oauth2/v1/certs",
  "client_x509_cert_url": "https://www.googleapis.com/robot/v1/metadata/x509/firebase-adminsdk-fpdoy%40foodly-12853.iam.gserviceaccount.com",
  "universe_domain": "googleapis.com"
}
