<?xml version="1.0" encoding="UTF-8" standalone="no"?>
<svg
   xmlns:dc="http://purl.org/dc/elements/1.1/"
   xmlns:cc="http://creativecommons.org/ns#"
   xmlns:rdf="http://www.w3.org/1999/02/22-rdf-syntax-ns#"
   xmlns:svg="http://www.w3.org/2000/svg"
   xmlns="http://www.w3.org/2000/svg"
   xmlns:sodipodi="http://sodipodi.sourceforge.net/DTD/sodipodi-0.dtd"
   xmlns:inkscape="http://www.inkscape.org/namespaces/inkscape"
   width="17.316772mm"
   height="11.592091mm"
   viewBox="0 0 17.316772 11.592091"
   version="1.1"
   id="svg903"
   inkscape:version="1.0.1 (c497b03c, 2020-09-10)"
   sodipodi:docname="reorder.svg">
  <defs
     id="defs897" />
  <sodipodi:namedview
     id="base"
     pagecolor="#ffffff"
     bordercolor="#666666"
     borderopacity="1.0"
     inkscape:pageopacity="0.0"
     inkscape:pageshadow="2"
     inkscape:zoom="1.923493"
     inkscape:cx="64.56607"
     inkscape:cy="88.442695"
     inkscape:document-units="mm"
     inkscape:current-layer="layer1"
     inkscape:document-rotation="0"
     showgrid="false"
     inkscape:window-width="1440"
     inkscape:window-height="874"
     inkscape:window-x="0"
     inkscape:window-y="26"
     inkscape:window-maximized="0" />
  <metadata
     id="metadata900">
    <rdf:RDF>
      <cc:Work
         rdf:about="">
        <dc:format>image/svg+xml</dc:format>
        <dc:type
           rdf:resource="http://purl.org/dc/dcmitype/StillImage" />
        <dc:title></dc:title>
      </cc:Work>
    </rdf:RDF>
  </metadata>
  <g
     inkscape:label="Capa 1"
     inkscape:groupmode="layer"
     id="layer1"
     transform="translate(-25.683228,-49.907909)">
    <path
       style="fill:none;stroke:#000000;stroke-width:1;stroke-linecap:butt;stroke-linejoin:miter;stroke-miterlimit:4;stroke-dasharray:none;stroke-opacity:1"
       d="m 29.436464,52.407909 h 9.078534"
       id="path1485" />
    <circle
       style="fill:#000000;stroke:#ffffff;stroke-width:0.431654;stroke-miterlimit:4;stroke-dasharray:none;stroke-dashoffset:0"
       id="path1466"
       cx="28.183228"
       cy="52.407909"
       r="2.284173" />
    <path
       style="fill:none;stroke:#000000;stroke-width:1;stroke-linecap:butt;stroke-linejoin:miter;stroke-miterlimit:4;stroke-dasharray:none;stroke-opacity:1"
       d="M 34.113284,52.683015 V 59 h 5.227037"
       id="path1487"
       sodipodi:nodetypes="ccc" />
    <circle
       style="fill:#000000;stroke:#ffffff;stroke-width:0.431654;stroke-miterlimit:4;stroke-dasharray:none;stroke-dashoffset:0"
       id="path1466-7"
       cx="40.5"
       cy="52.407909"
       r="2.284173" />
    <circle
       style="fill:#000000;stroke:#ffffff;stroke-width:0.431654;stroke-miterlimit:4;stroke-dasharray:none;stroke-dashoffset:0"
       id="path1466-7-8"
       cx="40.5"
       cy="59"
       r="2.284173" />
  </g>
</svg>
