C:\Users\Agustin\Documents\selenium\NombreProyecto\src\test\java\org\test\locators\SauceLabsLocators.java
C:\Users\Agustin\Documents\selenium\NombreProyecto\src\test\java\org\test\page\ActionPage.java
C:\Users\Agustin\Documents\selenium\NombreProyecto\src\test\java\org\test\runner\TestRunner.java
C:\Users\Agustin\Documents\selenium\NombreProyecto\src\test\java\org\test\config\Config.java
C:\Users\Agustin\Documents\selenium\NombreProyecto\src\test\java\org\test\steps\SauceLabsSteps.java
C:\Users\Agustin\Documents\selenium\NombreProyecto\src\test\java\org\test\hooks\Hooks.java
