%YAML 1.1
%TAG !u! tag:unity3d.com,2011:
--- !u!114 &11400000
MonoBehaviour:
  m_ObjectHideFlags: 0
  m_CorrespondingSourceObject: {fileID: 0}
  m_PrefabInstance: {fileID: 0}
  m_PrefabAsset: {fileID: 0}
  m_GameObject: {fileID: 0}
  m_Enabled: 1
  m_EditorHideFlags: 0
  m_Script: {fileID: 11500000, guid: d25ceb92f5bf5ef42ad6a89325c17a3a, type: 3}
  m_Name: ItemData4
  m_EditorClassIdentifier: 
  Name: KeyItem
  ItemSprite: {fileID: 21300000, guid: 626b9cddb29049e4cac50cd87b419945, type: 3}
  Mesh: {fileID: 10207, guid: 0000000000000000e000000000000000, type: 0}
