%YAML 1.1
%TAG !u! tag:unity3d.com,2011:
--- !u!114 &11400000
MonoBehaviour:
  m_ObjectHideFlags: 0
  m_CorrespondingSourceObject: {fileID: 0}
  m_PrefabInstance: {fileID: 0}
  m_PrefabAsset: {fileID: 0}
  m_GameObject: {fileID: 0}
  m_Enabled: 1
  m_EditorHideFlags: 0
  m_Script: {fileID: 11500000, guid: 70fceb0cc33f7ea4185b03b5e1ab1245, type: 3}
  m_Name: InventoryData
  m_EditorClassIdentifier: 
  WeaponArrayIndex: 0
  WeaponDataArray:
  - {fileID: 11400000, guid: db4610f5399eae64aaf7366618661240, type: 2}
  - {fileID: 0}
  - {fileID: 0}
  - {fileID: 0}
  - {fileID: 0}
  ConsumibleItemArray:
  - {fileID: 0}
  - {fileID: 0}
