%YAML 1.1
%TAG !u! tag:unity3d.com,2011:
--- !u!1001 &126457888324102830
PrefabInstance:
  m_ObjectHideFlags: 0
  serializedVersion: 2
  m_Modification:
    m_TransformParent: {fileID: 0}
    m_Modifications:
    - target: {fileID: 7321956696131819793, guid: 7e1dc4ff263a5d741b6584e756e4ad55, type: 3}
      propertyPath: m_RootOrder
      value: 0
      objectReference: {fileID: 0}
    - target: {fileID: 7321956696131819793, guid: 7e1dc4ff263a5d741b6584e756e4ad55, type: 3}
      propertyPath: m_LocalPosition.x
      value: 287.95938
      objectReference: {fileID: 0}
    - target: {fileID: 7321956696131819793, guid: 7e1dc4ff263a5d741b6584e756e4ad55, type: 3}
      propertyPath: m_LocalPosition.y
      value: 122.27574
      objectReference: {fileID: 0}
    - target: {fileID: 7321956696131819793, guid: 7e1dc4ff263a5d741b6584e756e4ad55, type: 3}
      propertyPath: m_LocalPosition.z
      value: 0.16274852
      objectReference: {fileID: 0}
    - target: {fileID: 7321956696131819793, guid: 7e1dc4ff263a5d741b6584e756e4ad55, type: 3}
      propertyPath: m_LocalRotation.w
      value: 1
      objectReference: {fileID: 0}
    - target: {fileID: 7321956696131819793, guid: 7e1dc4ff263a5d741b6584e756e4ad55, type: 3}
      propertyPath: m_LocalRotation.x
      value: 0
      objectReference: {fileID: 0}
    - target: {fileID: 7321956696131819793, guid: 7e1dc4ff263a5d741b6584e756e4ad55, type: 3}
      propertyPath: m_LocalRotation.y
      value: 0
      objectReference: {fileID: 0}
    - target: {fileID: 7321956696131819793, guid: 7e1dc4ff263a5d741b6584e756e4ad55, type: 3}
      propertyPath: m_LocalRotation.z
      value: 0
      objectReference: {fileID: 0}
    - target: {fileID: 7321956696131819793, guid: 7e1dc4ff263a5d741b6584e756e4ad55, type: 3}
      propertyPath: m_LocalEulerAnglesHint.x
      value: 0
      objectReference: {fileID: 0}
    - target: {fileID: 7321956696131819793, guid: 7e1dc4ff263a5d741b6584e756e4ad55, type: 3}
      propertyPath: m_LocalEulerAnglesHint.y
      value: 0
      objectReference: {fileID: 0}
    - target: {fileID: 7321956696131819793, guid: 7e1dc4ff263a5d741b6584e756e4ad55, type: 3}
      propertyPath: m_LocalEulerAnglesHint.z
      value: 0
      objectReference: {fileID: 0}
    - target: {fileID: 7321956696131819795, guid: 7e1dc4ff263a5d741b6584e756e4ad55, type: 3}
      propertyPath: m_Color.b
      value: 1
      objectReference: {fileID: 0}
    - target: {fileID: 7321956696131819795, guid: 7e1dc4ff263a5d741b6584e756e4ad55, type: 3}
      propertyPath: m_Color.g
      value: 1
      objectReference: {fileID: 0}
    - target: {fileID: 7321956696131819795, guid: 7e1dc4ff263a5d741b6584e756e4ad55, type: 3}
      propertyPath: m_Color.r
      value: 1
      objectReference: {fileID: 0}
    - target: {fileID: 7321956696131819796, guid: 7e1dc4ff263a5d741b6584e756e4ad55, type: 3}
      propertyPath: m_Name
      value: BigPotion Variant
      objectReference: {fileID: 0}
    - target: {fileID: 7321956696131819798, guid: 7e1dc4ff263a5d741b6584e756e4ad55, type: 3}
      propertyPath: _itemDataSO
      value: 
      objectReference: {fileID: 11400000, guid: 786fe29f10df7764a86ff6ad5a1ee57f, type: 2}
    m_RemovedComponents: []
  m_SourcePrefab: {fileID: 100100000, guid: 7e1dc4ff263a5d741b6584e756e4ad55, type: 3}
