%YAML 1.1
%TAG !u! tag:unity3d.com,2011:
--- !u!114 &11400000
MonoBehaviour:
  m_ObjectHideFlags: 0
  m_CorrespondingSourceObject: {fileID: 0}
  m_PrefabInstance: {fileID: 0}
  m_PrefabAsset: {fileID: 0}
  m_GameObject: {fileID: 0}
  m_Enabled: 1
  m_EditorHideFlags: 0
  m_Script: {fileID: 11500000, guid: 5c971b08cd2e5dc4fae682f08eaf4cf5, type: 3}
  m_Name: SmallHealthPotionSO
  m_EditorClassIdentifier: 
  Name: ' Small Health Potion'
  Description: "Cura una peque\xF1a cantidad de vida "
  ItemSprite: {fileID: 21300000, guid: 27db96945a64e2f4d8087acfdbddc89e, type: 3}
  Price: 5
  HealthRecovered: 5
