%YAML 1.1
%TAG !u! tag:unity3d.com,2011:
--- !u!1 &191586607239795106
GameObject:
  m_ObjectHideFlags: 0
  m_CorrespondingSourceObject: {fileID: 0}
  m_PrefabInstance: {fileID: 0}
  m_PrefabAsset: {fileID: 0}
  serializedVersion: 6
  m_Component:
  - component: {fileID: 5544209853719214357}
  - component: {fileID: 896321737642840818}
  - component: {fileID: 6051034178880185149}
  m_Layer: 0
  m_Name: Layer1
  m_TagString: Untagged
  m_Icon: {fileID: 0}
  m_NavMeshLayer: 0
  m_StaticEditorFlags: 0
  m_IsActive: 1
--- !u!4 &5544209853719214357
Transform:
  m_ObjectHideFlags: 0
  m_CorrespondingSourceObject: {fileID: 0}
  m_PrefabInstance: {fileID: 0}
  m_PrefabAsset: {fileID: 0}
  m_GameObject: {fileID: 191586607239795106}
  m_LocalRotation: {x: -0, y: -0, z: -0, w: 1}
  m_LocalPosition: {x: 0, y: 0, z: 0}
  m_LocalScale: {x: 1, y: 1, z: 1}
  m_ConstrainProportionsScale: 0
  m_Children: []
  m_Father: {fileID: 5684918250652018734}
  m_RootOrder: 0
  m_LocalEulerAnglesHint: {x: 0, y: 0, z: 0}
--- !u!1839735485 &896321737642840818
Tilemap:
  m_ObjectHideFlags: 0
  m_CorrespondingSourceObject: {fileID: 0}
  m_PrefabInstance: {fileID: 0}
  m_PrefabAsset: {fileID: 0}
  m_GameObject: {fileID: 191586607239795106}
  m_Enabled: 1
  m_Tiles:
  - first: {x: -1, y: -12, z: 0}
    second:
      serializedVersion: 2
      m_TileIndex: 102
      m_TileSpriteIndex: 102
      m_TileMatrixIndex: 0
      m_TileColorIndex: 0
      m_TileObjectToInstantiateIndex: 65535
      dummyAlignment: 0
      m_AllTileFlags: 1073741825
  - first: {x: -1, y: -11, z: 0}
    second:
      serializedVersion: 2
      m_TileIndex: 99
      m_TileSpriteIndex: 99
      m_TileMatrixIndex: 0
      m_TileColorIndex: 0
      m_TileObjectToInstantiateIndex: 65535
      dummyAlignment: 0
      m_AllTileFlags: 1073741825
  - first: {x: 0, y: -11, z: 0}
    second:
      serializedVersion: 2
      m_TileIndex: 100
      m_TileSpriteIndex: 100
      m_TileMatrixIndex: 0
      m_TileColorIndex: 0
      m_TileObjectToInstantiateIndex: 65535
      dummyAlignment: 0
      m_AllTileFlags: 1073741825
  - first: {x: 1, y: -11, z: 0}
    second:
      serializedVersion: 2
      m_TileIndex: 101
      m_TileSpriteIndex: 101
      m_TileMatrixIndex: 0
      m_TileColorIndex: 0
      m_TileObjectToInstantiateIndex: 65535
      dummyAlignment: 0
      m_AllTileFlags: 1073741825
  - first: {x: -1, y: -10, z: 0}
    second:
      serializedVersion: 2
      m_TileIndex: 93
      m_TileSpriteIndex: 93
      m_TileMatrixIndex: 0
      m_TileColorIndex: 0
      m_TileObjectToInstantiateIndex: 65535
      dummyAlignment: 0
      m_AllTileFlags: 1073741825
  - first: {x: 0, y: -10, z: 0}
    second:
      serializedVersion: 2
      m_TileIndex: 97
      m_TileSpriteIndex: 97
      m_TileMatrixIndex: 0
      m_TileColorIndex: 0
      m_TileObjectToInstantiateIndex: 65535
      dummyAlignment: 0
      m_AllTileFlags: 1073741825
  - first: {x: 1, y: -10, z: 0}
    second:
      serializedVersion: 2
      m_TileIndex: 98
      m_TileSpriteIndex: 98
      m_TileMatrixIndex: 0
      m_TileColorIndex: 0
      m_TileObjectToInstantiateIndex: 65535
      dummyAlignment: 0
      m_AllTileFlags: 1073741825
  - first: {x: -1, y: -9, z: 0}
    second:
      serializedVersion: 2
      m_TileIndex: 94
      m_TileSpriteIndex: 94
      m_TileMatrixIndex: 0
      m_TileColorIndex: 0
      m_TileObjectToInstantiateIndex: 65535
      dummyAlignment: 0
      m_AllTileFlags: 1073741825
  - first: {x: 0, y: -9, z: 0}
    second:
      serializedVersion: 2
      m_TileIndex: 95
      m_TileSpriteIndex: 95
      m_TileMatrixIndex: 0
      m_TileColorIndex: 0
      m_TileObjectToInstantiateIndex: 65535
      dummyAlignment: 0
      m_AllTileFlags: 1073741825
  - first: {x: 1, y: -9, z: 0}
    second:
      serializedVersion: 2
      m_TileIndex: 96
      m_TileSpriteIndex: 96
      m_TileMatrixIndex: 0
      m_TileColorIndex: 0
      m_TileObjectToInstantiateIndex: 65535
      dummyAlignment: 0
      m_AllTileFlags: 1073741825
  - first: {x: 11, y: -6, z: 0}
    second:
      serializedVersion: 2
      m_TileIndex: 81
      m_TileSpriteIndex: 81
      m_TileMatrixIndex: 0
      m_TileColorIndex: 0
      m_TileObjectToInstantiateIndex: 65535
      dummyAlignment: 0
      m_AllTileFlags: 1073741825
  - first: {x: 12, y: -6, z: 0}
    second:
      serializedVersion: 2
      m_TileIndex: 82
      m_TileSpriteIndex: 82
      m_TileMatrixIndex: 0
      m_TileColorIndex: 0
      m_TileObjectToInstantiateIndex: 65535
      dummyAlignment: 0
      m_AllTileFlags: 1073741825
  - first: {x: 14, y: -6, z: 0}
    second:
      serializedVersion: 2
      m_TileIndex: 83
      m_TileSpriteIndex: 83
      m_TileMatrixIndex: 0
      m_TileColorIndex: 0
      m_TileObjectToInstantiateIndex: 65535
      dummyAlignment: 0
      m_AllTileFlags: 1073741825
  - first: {x: 15, y: -6, z: 0}
    second:
      serializedVersion: 2
      m_TileIndex: 84
      m_TileSpriteIndex: 84
      m_TileMatrixIndex: 0
      m_TileColorIndex: 0
      m_TileObjectToInstantiateIndex: 65535
      dummyAlignment: 0
      m_AllTileFlags: 1073741825
  - first: {x: 16, y: -6, z: 0}
    second:
      serializedVersion: 2
      m_TileIndex: 85
      m_TileSpriteIndex: 85
      m_TileMatrixIndex: 0
      m_TileColorIndex: 0
      m_TileObjectToInstantiateIndex: 65535
      dummyAlignment: 0
      m_AllTileFlags: 1073741825
  - first: {x: 17, y: -6, z: 0}
    second:
      serializedVersion: 2
      m_TileIndex: 86
      m_TileSpriteIndex: 86
      m_TileMatrixIndex: 0
      m_TileColorIndex: 0
      m_TileObjectToInstantiateIndex: 65535
      dummyAlignment: 0
      m_AllTileFlags: 1073741825
  - first: {x: 18, y: -6, z: 0}
    second:
      serializedVersion: 2
      m_TileIndex: 87
      m_TileSpriteIndex: 87
      m_TileMatrixIndex: 0
      m_TileColorIndex: 0
      m_TileObjectToInstantiateIndex: 65535
      dummyAlignment: 0
      m_AllTileFlags: 1073741825
  - first: {x: 19, y: -6, z: 0}
    second:
      serializedVersion: 2
      m_TileIndex: 88
      m_TileSpriteIndex: 88
      m_TileMatrixIndex: 0
      m_TileColorIndex: 0
      m_TileObjectToInstantiateIndex: 65535
      dummyAlignment: 0
      m_AllTileFlags: 1073741825
  - first: {x: 20, y: -6, z: 0}
    second:
      serializedVersion: 2
      m_TileIndex: 89
      m_TileSpriteIndex: 89
      m_TileMatrixIndex: 0
      m_TileColorIndex: 0
      m_TileObjectToInstantiateIndex: 65535
      dummyAlignment: 0
      m_AllTileFlags: 1073741825
  - first: {x: 21, y: -6, z: 0}
    second:
      serializedVersion: 2
      m_TileIndex: 90
      m_TileSpriteIndex: 90
      m_TileMatrixIndex: 0
      m_TileColorIndex: 0
      m_TileObjectToInstantiateIndex: 65535
      dummyAlignment: 0
      m_AllTileFlags: 1073741825
  - first: {x: 22, y: -6, z: 0}
    second:
      serializedVersion: 2
      m_TileIndex: 91
      m_TileSpriteIndex: 91
      m_TileMatrixIndex: 0
      m_TileColorIndex: 0
      m_TileObjectToInstantiateIndex: 65535
      dummyAlignment: 0
      m_AllTileFlags: 1073741825
  - first: {x: 23, y: -6, z: 0}
    second:
      serializedVersion: 2
      m_TileIndex: 92
      m_TileSpriteIndex: 92
      m_TileMatrixIndex: 0
      m_TileColorIndex: 0
      m_TileObjectToInstantiateIndex: 65535
      dummyAlignment: 0
      m_AllTileFlags: 1073741825
  - first: {x: 11, y: -5, z: 0}
    second:
      serializedVersion: 2
      m_TileIndex: 71
      m_TileSpriteIndex: 71
      m_TileMatrixIndex: 0
      m_TileColorIndex: 0
      m_TileObjectToInstantiateIndex: 65535
      dummyAlignment: 0
      m_AllTileFlags: 1073741825
  - first: {x: 12, y: -5, z: 0}
    second:
      serializedVersion: 2
      m_TileIndex: 72
      m_TileSpriteIndex: 72
      m_TileMatrixIndex: 0
      m_TileColorIndex: 0
      m_TileObjectToInstantiateIndex: 65535
      dummyAlignment: 0
      m_AllTileFlags: 1073741825
  - first: {x: 15, y: -5, z: 0}
    second:
      serializedVersion: 2
      m_TileIndex: 73
      m_TileSpriteIndex: 73
      m_TileMatrixIndex: 0
      m_TileColorIndex: 0
      m_TileObjectToInstantiateIndex: 65535
      dummyAlignment: 0
      m_AllTileFlags: 1073741825
  - first: {x: 16, y: -5, z: 0}
    second:
      serializedVersion: 2
      m_TileIndex: 74
      m_TileSpriteIndex: 74
      m_TileMatrixIndex: 0
      m_TileColorIndex: 0
      m_TileObjectToInstantiateIndex: 65535
      dummyAlignment: 0
      m_AllTileFlags: 1073741825
  - first: {x: 17, y: -5, z: 0}
    second:
      serializedVersion: 2
      m_TileIndex: 75
      m_TileSpriteIndex: 75
      m_TileMatrixIndex: 0
      m_TileColorIndex: 0
      m_TileObjectToInstantiateIndex: 65535
      dummyAlignment: 0
      m_AllTileFlags: 1073741825
  - first: {x: 18, y: -5, z: 0}
    second:
      serializedVersion: 2
      m_TileIndex: 76
      m_TileSpriteIndex: 76
      m_TileMatrixIndex: 0
      m_TileColorIndex: 0
      m_TileObjectToInstantiateIndex: 65535
      dummyAlignment: 0
      m_AllTileFlags: 1073741825
  - first: {x: 19, y: -5, z: 0}
    second:
      serializedVersion: 2
      m_TileIndex: 77
      m_TileSpriteIndex: 77
      m_TileMatrixIndex: 0
      m_TileColorIndex: 0
      m_TileObjectToInstantiateIndex: 65535
      dummyAlignment: 0
      m_AllTileFlags: 1073741825
  - first: {x: 20, y: -5, z: 0}
    second:
      serializedVersion: 2
      m_TileIndex: 78
      m_TileSpriteIndex: 78
      m_TileMatrixIndex: 0
      m_TileColorIndex: 0
      m_TileObjectToInstantiateIndex: 65535
      dummyAlignment: 0
      m_AllTileFlags: 1073741825
  - first: {x: 21, y: -5, z: 0}
    second:
      serializedVersion: 2
      m_TileIndex: 79
      m_TileSpriteIndex: 79
      m_TileMatrixIndex: 0
      m_TileColorIndex: 0
      m_TileObjectToInstantiateIndex: 65535
      dummyAlignment: 0
      m_AllTileFlags: 1073741825
  - first: {x: 22, y: -5, z: 0}
    second:
      serializedVersion: 2
      m_TileIndex: 80
      m_TileSpriteIndex: 80
      m_TileMatrixIndex: 0
      m_TileColorIndex: 0
      m_TileObjectToInstantiateIndex: 65535
      dummyAlignment: 0
      m_AllTileFlags: 1073741825
  - first: {x: -2, y: -4, z: 0}
    second:
      serializedVersion: 2
      m_TileIndex: 58
      m_TileSpriteIndex: 58
      m_TileMatrixIndex: 0
      m_TileColorIndex: 0
      m_TileObjectToInstantiateIndex: 65535
      dummyAlignment: 0
      m_AllTileFlags: 1073741825
  - first: {x: -1, y: -4, z: 0}
    second:
      serializedVersion: 2
      m_TileIndex: 59
      m_TileSpriteIndex: 59
      m_TileMatrixIndex: 0
      m_TileColorIndex: 0
      m_TileObjectToInstantiateIndex: 65535
      dummyAlignment: 0
      m_AllTileFlags: 1073741825
  - first: {x: 8, y: -4, z: 0}
    second:
      serializedVersion: 2
      m_TileIndex: 60
      m_TileSpriteIndex: 60
      m_TileMatrixIndex: 0
      m_TileColorIndex: 0
      m_TileObjectToInstantiateIndex: 65535
      dummyAlignment: 0
      m_AllTileFlags: 1073741825
  - first: {x: 9, y: -4, z: 0}
    second:
      serializedVersion: 2
      m_TileIndex: 61
      m_TileSpriteIndex: 61
      m_TileMatrixIndex: 0
      m_TileColorIndex: 0
      m_TileObjectToInstantiateIndex: 65535
      dummyAlignment: 0
      m_AllTileFlags: 1073741825
  - first: {x: 11, y: -4, z: 0}
    second:
      serializedVersion: 2
      m_TileIndex: 62
      m_TileSpriteIndex: 62
      m_TileMatrixIndex: 0
      m_TileColorIndex: 0
      m_TileObjectToInstantiateIndex: 65535
      dummyAlignment: 0
      m_AllTileFlags: 1073741825
  - first: {x: 12, y: -4, z: 0}
    second:
      serializedVersion: 2
      m_TileIndex: 63
      m_TileSpriteIndex: 63
      m_TileMatrixIndex: 0
      m_TileColorIndex: 0
      m_TileObjectToInstantiateIndex: 65535
      dummyAlignment: 0
      m_AllTileFlags: 1073741825
  - first: {x: 15, y: -4, z: 0}
    second:
      serializedVersion: 2
      m_TileIndex: 64
      m_TileSpriteIndex: 64
      m_TileMatrixIndex: 0
      m_TileColorIndex: 0
      m_TileObjectToInstantiateIndex: 65535
      dummyAlignment: 0
      m_AllTileFlags: 1073741825
  - first: {x: 16, y: -4, z: 0}
    second:
      serializedVersion: 2
      m_TileIndex: 65
      m_TileSpriteIndex: 65
      m_TileMatrixIndex: 0
      m_TileColorIndex: 0
      m_TileObjectToInstantiateIndex: 65535
      dummyAlignment: 0
      m_AllTileFlags: 1073741825
  - first: {x: 17, y: -4, z: 0}
    second:
      serializedVersion: 2
      m_TileIndex: 66
      m_TileSpriteIndex: 66
      m_TileMatrixIndex: 0
      m_TileColorIndex: 0
      m_TileObjectToInstantiateIndex: 65535
      dummyAlignment: 0
      m_AllTileFlags: 1073741825
  - first: {x: 18, y: -4, z: 0}
    second:
      serializedVersion: 2
      m_TileIndex: 67
      m_TileSpriteIndex: 67
      m_TileMatrixIndex: 0
      m_TileColorIndex: 0
      m_TileObjectToInstantiateIndex: 65535
      dummyAlignment: 0
      m_AllTileFlags: 1073741825
  - first: {x: 19, y: -4, z: 0}
    second:
      serializedVersion: 2
      m_TileIndex: 68
      m_TileSpriteIndex: 68
      m_TileMatrixIndex: 0
      m_TileColorIndex: 0
      m_TileObjectToInstantiateIndex: 65535
      dummyAlignment: 0
      m_AllTileFlags: 1073741825
  - first: {x: 20, y: -4, z: 0}
    second:
      serializedVersion: 2
      m_TileIndex: 69
      m_TileSpriteIndex: 69
      m_TileMatrixIndex: 0
      m_TileColorIndex: 0
      m_TileObjectToInstantiateIndex: 65535
      dummyAlignment: 0
      m_AllTileFlags: 1073741825
  - first: {x: 21, y: -4, z: 0}
    second:
      serializedVersion: 2
      m_TileIndex: 70
      m_TileSpriteIndex: 70
      m_TileMatrixIndex: 0
      m_TileColorIndex: 0
      m_TileObjectToInstantiateIndex: 65535
      dummyAlignment: 0
      m_AllTileFlags: 1073741825
  - first: {x: -2, y: -3, z: 0}
    second:
      serializedVersion: 2
      m_TileIndex: 37
      m_TileSpriteIndex: 37
      m_TileMatrixIndex: 0
      m_TileColorIndex: 0
      m_TileObjectToInstantiateIndex: 65535
      dummyAlignment: 0
      m_AllTileFlags: 1073741825
  - first: {x: -1, y: -3, z: 0}
    second:
      serializedVersion: 2
      m_TileIndex: 38
      m_TileSpriteIndex: 38
      m_TileMatrixIndex: 0
      m_TileColorIndex: 0
      m_TileObjectToInstantiateIndex: 65535
      dummyAlignment: 0
      m_AllTileFlags: 1073741825
  - first: {x: 1, y: -3, z: 0}
    second:
      serializedVersion: 2
      m_TileIndex: 39
      m_TileSpriteIndex: 39
      m_TileMatrixIndex: 0
      m_TileColorIndex: 0
      m_TileObjectToInstantiateIndex: 65535
      dummyAlignment: 0
      m_AllTileFlags: 1073741825
  - first: {x: 2, y: -3, z: 0}
    second:
      serializedVersion: 2
      m_TileIndex: 40
      m_TileSpriteIndex: 40
      m_TileMatrixIndex: 0
      m_TileColorIndex: 0
      m_TileObjectToInstantiateIndex: 65535
      dummyAlignment: 0
      m_AllTileFlags: 1073741825
  - first: {x: 3, y: -3, z: 0}
    second:
      serializedVersion: 2
      m_TileIndex: 41
      m_TileSpriteIndex: 41
      m_TileMatrixIndex: 0
      m_TileColorIndex: 0
      m_TileObjectToInstantiateIndex: 65535
      dummyAlignment: 0
      m_AllTileFlags: 1073741825
  - first: {x: 4, y: -3, z: 0}
    second:
      serializedVersion: 2
      m_TileIndex: 42
      m_TileSpriteIndex: 42
      m_TileMatrixIndex: 0
      m_TileColorIndex: 0
      m_TileObjectToInstantiateIndex: 65535
      dummyAlignment: 0
      m_AllTileFlags: 1073741825
  - first: {x: 5, y: -3, z: 0}
    second:
      serializedVersion: 2
      m_TileIndex: 43
      m_TileSpriteIndex: 43
      m_TileMatrixIndex: 0
      m_TileColorIndex: 0
      m_TileObjectToInstantiateIndex: 65535
      dummyAlignment: 0
      m_AllTileFlags: 1073741825
  - first: {x: 6, y: -3, z: 0}
    second:
      serializedVersion: 2
      m_TileIndex: 44
      m_TileSpriteIndex: 44
      m_TileMatrixIndex: 0
      m_TileColorIndex: 0
      m_TileObjectToInstantiateIndex: 65535
      dummyAlignment: 0
      m_AllTileFlags: 1073741825
  - first: {x: 8, y: -3, z: 0}
    second:
      serializedVersion: 2
      m_TileIndex: 45
      m_TileSpriteIndex: 45
      m_TileMatrixIndex: 0
      m_TileColorIndex: 0
      m_TileObjectToInstantiateIndex: 65535
      dummyAlignment: 0
      m_AllTileFlags: 1073741825
  - first: {x: 9, y: -3, z: 0}
    second:
      serializedVersion: 2
      m_TileIndex: 46
      m_TileSpriteIndex: 46
      m_TileMatrixIndex: 0
      m_TileColorIndex: 0
      m_TileObjectToInstantiateIndex: 65535
      dummyAlignment: 0
      m_AllTileFlags: 1073741825
  - first: {x: 11, y: -3, z: 0}
    second:
      serializedVersion: 2
      m_TileIndex: 47
      m_TileSpriteIndex: 47
      m_TileMatrixIndex: 0
      m_TileColorIndex: 0
      m_TileObjectToInstantiateIndex: 65535
      dummyAlignment: 0
      m_AllTileFlags: 1073741825
  - first: {x: 12, y: -3, z: 0}
    second:
      serializedVersion: 2
      m_TileIndex: 48
      m_TileSpriteIndex: 48
      m_TileMatrixIndex: 0
      m_TileColorIndex: 0
      m_TileObjectToInstantiateIndex: 65535
      dummyAlignment: 0
      m_AllTileFlags: 1073741825
  - first: {x: 13, y: -3, z: 0}
    second:
      serializedVersion: 2
      m_TileIndex: 49
      m_TileSpriteIndex: 49
      m_TileMatrixIndex: 0
      m_TileColorIndex: 0
      m_TileObjectToInstantiateIndex: 65535
      dummyAlignment: 0
      m_AllTileFlags: 1073741825
  - first: {x: 14, y: -3, z: 0}
    second:
      serializedVersion: 2
      m_TileIndex: 50
      m_TileSpriteIndex: 50
      m_TileMatrixIndex: 0
      m_TileColorIndex: 0
      m_TileObjectToInstantiateIndex: 65535
      dummyAlignment: 0
      m_AllTileFlags: 1073741825
  - first: {x: 15, y: -3, z: 0}
    second:
      serializedVersion: 2
      m_TileIndex: 51
      m_TileSpriteIndex: 51
      m_TileMatrixIndex: 0
      m_TileColorIndex: 0
      m_TileObjectToInstantiateIndex: 65535
      dummyAlignment: 0
      m_AllTileFlags: 1073741825
  - first: {x: 16, y: -3, z: 0}
    second:
      serializedVersion: 2
      m_TileIndex: 52
      m_TileSpriteIndex: 52
      m_TileMatrixIndex: 0
      m_TileColorIndex: 0
      m_TileObjectToInstantiateIndex: 65535
      dummyAlignment: 0
      m_AllTileFlags: 1073741825
  - first: {x: 17, y: -3, z: 0}
    second:
      serializedVersion: 2
      m_TileIndex: 53
      m_TileSpriteIndex: 53
      m_TileMatrixIndex: 0
      m_TileColorIndex: 0
      m_TileObjectToInstantiateIndex: 65535
      dummyAlignment: 0
      m_AllTileFlags: 1073741825
  - first: {x: 18, y: -3, z: 0}
    second:
      serializedVersion: 2
      m_TileIndex: 54
      m_TileSpriteIndex: 54
      m_TileMatrixIndex: 0
      m_TileColorIndex: 0
      m_TileObjectToInstantiateIndex: 65535
      dummyAlignment: 0
      m_AllTileFlags: 1073741825
  - first: {x: 19, y: -3, z: 0}
    second:
      serializedVersion: 2
      m_TileIndex: 55
      m_TileSpriteIndex: 55
      m_TileMatrixIndex: 0
      m_TileColorIndex: 0
      m_TileObjectToInstantiateIndex: 65535
      dummyAlignment: 0
      m_AllTileFlags: 1073741825
  - first: {x: 20, y: -3, z: 0}
    second:
      serializedVersion: 2
      m_TileIndex: 56
      m_TileSpriteIndex: 56
      m_TileMatrixIndex: 0
      m_TileColorIndex: 0
      m_TileObjectToInstantiateIndex: 65535
      dummyAlignment: 0
      m_AllTileFlags: 1073741825
  - first: {x: 21, y: -3, z: 0}
    second:
      serializedVersion: 2
      m_TileIndex: 57
      m_TileSpriteIndex: 57
      m_TileMatrixIndex: 0
      m_TileColorIndex: 0
      m_TileObjectToInstantiateIndex: 65535
      dummyAlignment: 0
      m_AllTileFlags: 1073741825
  - first: {x: -2, y: -2, z: 0}
    second:
      serializedVersion: 2
      m_TileIndex: 20
      m_TileSpriteIndex: 20
      m_TileMatrixIndex: 0
      m_TileColorIndex: 0
      m_TileObjectToInstantiateIndex: 65535
      dummyAlignment: 0
      m_AllTileFlags: 1073741825
  - first: {x: -1, y: -2, z: 0}
    second:
      serializedVersion: 2
      m_TileIndex: 21
      m_TileSpriteIndex: 21
      m_TileMatrixIndex: 0
      m_TileColorIndex: 0
      m_TileObjectToInstantiateIndex: 65535
      dummyAlignment: 0
      m_AllTileFlags: 1073741825
  - first: {x: 1, y: -2, z: 0}
    second:
      serializedVersion: 2
      m_TileIndex: 22
      m_TileSpriteIndex: 22
      m_TileMatrixIndex: 0
      m_TileColorIndex: 0
      m_TileObjectToInstantiateIndex: 65535
      dummyAlignment: 0
      m_AllTileFlags: 1073741825
  - first: {x: 2, y: -2, z: 0}
    second:
      serializedVersion: 2
      m_TileIndex: 23
      m_TileSpriteIndex: 23
      m_TileMatrixIndex: 0
      m_TileColorIndex: 0
      m_TileObjectToInstantiateIndex: 65535
      dummyAlignment: 0
      m_AllTileFlags: 1073741825
  - first: {x: 3, y: -2, z: 0}
    second:
      serializedVersion: 2
      m_TileIndex: 24
      m_TileSpriteIndex: 24
      m_TileMatrixIndex: 0
      m_TileColorIndex: 0
      m_TileObjectToInstantiateIndex: 65535
      dummyAlignment: 0
      m_AllTileFlags: 1073741825
  - first: {x: 4, y: -2, z: 0}
    second:
      serializedVersion: 2
      m_TileIndex: 25
      m_TileSpriteIndex: 25
      m_TileMatrixIndex: 0
      m_TileColorIndex: 0
      m_TileObjectToInstantiateIndex: 65535
      dummyAlignment: 0
      m_AllTileFlags: 1073741825
  - first: {x: 5, y: -2, z: 0}
    second:
      serializedVersion: 2
      m_TileIndex: 26
      m_TileSpriteIndex: 26
      m_TileMatrixIndex: 0
      m_TileColorIndex: 0
      m_TileObjectToInstantiateIndex: 65535
      dummyAlignment: 0
      m_AllTileFlags: 1073741825
  - first: {x: 6, y: -2, z: 0}
    second:
      serializedVersion: 2
      m_TileIndex: 27
      m_TileSpriteIndex: 27
      m_TileMatrixIndex: 0
      m_TileColorIndex: 0
      m_TileObjectToInstantiateIndex: 65535
      dummyAlignment: 0
      m_AllTileFlags: 1073741825
  - first: {x: 8, y: -2, z: 0}
    second:
      serializedVersion: 2
      m_TileIndex: 28
      m_TileSpriteIndex: 28
      m_TileMatrixIndex: 0
      m_TileColorIndex: 0
      m_TileObjectToInstantiateIndex: 65535
      dummyAlignment: 0
      m_AllTileFlags: 1073741825
  - first: {x: 9, y: -2, z: 0}
    second:
      serializedVersion: 2
      m_TileIndex: 29
      m_TileSpriteIndex: 29
      m_TileMatrixIndex: 0
      m_TileColorIndex: 0
      m_TileObjectToInstantiateIndex: 65535
      dummyAlignment: 0
      m_AllTileFlags: 1073741825
  - first: {x: 11, y: -2, z: 0}
    second:
      serializedVersion: 2
      m_TileIndex: 30
      m_TileSpriteIndex: 30
      m_TileMatrixIndex: 0
      m_TileColorIndex: 0
      m_TileObjectToInstantiateIndex: 65535
      dummyAlignment: 0
      m_AllTileFlags: 1073741825
  - first: {x: 12, y: -2, z: 0}
    second:
      serializedVersion: 2
      m_TileIndex: 31
      m_TileSpriteIndex: 31
      m_TileMatrixIndex: 0
      m_TileColorIndex: 0
      m_TileObjectToInstantiateIndex: 65535
      dummyAlignment: 0
      m_AllTileFlags: 1073741825
  - first: {x: 13, y: -2, z: 0}
    second:
      serializedVersion: 2
      m_TileIndex: 32
      m_TileSpriteIndex: 32
      m_TileMatrixIndex: 0
      m_TileColorIndex: 0
      m_TileObjectToInstantiateIndex: 65535
      dummyAlignment: 0
      m_AllTileFlags: 1073741825
  - first: {x: 14, y: -2, z: 0}
    second:
      serializedVersion: 2
      m_TileIndex: 33
      m_TileSpriteIndex: 33
      m_TileMatrixIndex: 0
      m_TileColorIndex: 0
      m_TileObjectToInstantiateIndex: 65535
      dummyAlignment: 0
      m_AllTileFlags: 1073741825
  - first: {x: 17, y: -2, z: 0}
    second:
      serializedVersion: 2
      m_TileIndex: 34
      m_TileSpriteIndex: 34
      m_TileMatrixIndex: 0
      m_TileColorIndex: 0
      m_TileObjectToInstantiateIndex: 65535
      dummyAlignment: 0
      m_AllTileFlags: 1073741825
  - first: {x: 18, y: -2, z: 0}
    second:
      serializedVersion: 2
      m_TileIndex: 35
      m_TileSpriteIndex: 35
      m_TileMatrixIndex: 0
      m_TileColorIndex: 0
      m_TileObjectToInstantiateIndex: 65535
      dummyAlignment: 0
      m_AllTileFlags: 1073741825
  - first: {x: 19, y: -2, z: 0}
    second:
      serializedVersion: 2
      m_TileIndex: 36
      m_TileSpriteIndex: 36
      m_TileMatrixIndex: 0
      m_TileColorIndex: 0
      m_TileObjectToInstantiateIndex: 65535
      dummyAlignment: 0
      m_AllTileFlags: 1073741825
  - first: {x: 1, y: -1, z: 0}
    second:
      serializedVersion: 2
      m_TileIndex: 8
      m_TileSpriteIndex: 8
      m_TileMatrixIndex: 0
      m_TileColorIndex: 0
      m_TileObjectToInstantiateIndex: 65535
      dummyAlignment: 0
      m_AllTileFlags: 1073741825
  - first: {x: 2, y: -1, z: 0}
    second:
      serializedVersion: 2
      m_TileIndex: 9
      m_TileSpriteIndex: 9
      m_TileMatrixIndex: 0
      m_TileColorIndex: 0
      m_TileObjectToInstantiateIndex: 65535
      dummyAlignment: 0
      m_AllTileFlags: 1073741825
  - first: {x: 3, y: -1, z: 0}
    second:
      serializedVersion: 2
      m_TileIndex: 10
      m_TileSpriteIndex: 10
      m_TileMatrixIndex: 0
      m_TileColorIndex: 0
      m_TileObjectToInstantiateIndex: 65535
      dummyAlignment: 0
      m_AllTileFlags: 1073741825
  - first: {x: 4, y: -1, z: 0}
    second:
      serializedVersion: 2
      m_TileIndex: 11
      m_TileSpriteIndex: 11
      m_TileMatrixIndex: 0
      m_TileColorIndex: 0
      m_TileObjectToInstantiateIndex: 65535
      dummyAlignment: 0
      m_AllTileFlags: 1073741825
  - first: {x: 11, y: -1, z: 0}
    second:
      serializedVersion: 2
      m_TileIndex: 12
      m_TileSpriteIndex: 12
      m_TileMatrixIndex: 0
      m_TileColorIndex: 0
      m_TileObjectToInstantiateIndex: 65535
      dummyAlignment: 0
      m_AllTileFlags: 1073741825
  - first: {x: 12, y: -1, z: 0}
    second:
      serializedVersion: 2
      m_TileIndex: 13
      m_TileSpriteIndex: 13
      m_TileMatrixIndex: 0
      m_TileColorIndex: 0
      m_TileObjectToInstantiateIndex: 65535
      dummyAlignment: 0
      m_AllTileFlags: 1073741825
  - first: {x: 16, y: -1, z: 0}
    second:
      serializedVersion: 2
      m_TileIndex: 14
      m_TileSpriteIndex: 14
      m_TileMatrixIndex: 0
      m_TileColorIndex: 0
      m_TileObjectToInstantiateIndex: 65535
      dummyAlignment: 0
      m_AllTileFlags: 1073741825
  - first: {x: 17, y: -1, z: 0}
    second:
      serializedVersion: 2
      m_TileIndex: 15
      m_TileSpriteIndex: 15
      m_TileMatrixIndex: 0
      m_TileColorIndex: 0
      m_TileObjectToInstantiateIndex: 65535
      dummyAlignment: 0
      m_AllTileFlags: 1073741825
  - first: {x: 18, y: -1, z: 0}
    second:
      serializedVersion: 2
      m_TileIndex: 16
      m_TileSpriteIndex: 16
      m_TileMatrixIndex: 0
      m_TileColorIndex: 0
      m_TileObjectToInstantiateIndex: 65535
      dummyAlignment: 0
      m_AllTileFlags: 1073741825
  - first: {x: 19, y: -1, z: 0}
    second:
      serializedVersion: 2
      m_TileIndex: 17
      m_TileSpriteIndex: 17
      m_TileMatrixIndex: 0
      m_TileColorIndex: 0
      m_TileObjectToInstantiateIndex: 65535
      dummyAlignment: 0
      m_AllTileFlags: 1073741825
  - first: {x: 20, y: -1, z: 0}
    second:
      serializedVersion: 2
      m_TileIndex: 18
      m_TileSpriteIndex: 18
      m_TileMatrixIndex: 0
      m_TileColorIndex: 0
      m_TileObjectToInstantiateIndex: 65535
      dummyAlignment: 0
      m_AllTileFlags: 1073741825
  - first: {x: 21, y: -1, z: 0}
    second:
      serializedVersion: 2
      m_TileIndex: 19
      m_TileSpriteIndex: 19
      m_TileMatrixIndex: 0
      m_TileColorIndex: 0
      m_TileObjectToInstantiateIndex: 65535
      dummyAlignment: 0
      m_AllTileFlags: 1073741825
  - first: {x: 16, y: 0, z: 0}
    second:
      serializedVersion: 2
      m_TileIndex: 2
      m_TileSpriteIndex: 2
      m_TileMatrixIndex: 0
      m_TileColorIndex: 0
      m_TileObjectToInstantiateIndex: 65535
      dummyAlignment: 0
      m_AllTileFlags: 1073741825
  - first: {x: 17, y: 0, z: 0}
    second:
      serializedVersion: 2
      m_TileIndex: 3
      m_TileSpriteIndex: 3
      m_TileMatrixIndex: 0
      m_TileColorIndex: 0
      m_TileObjectToInstantiateIndex: 65535
      dummyAlignment: 0
      m_AllTileFlags: 1073741825
  - first: {x: 18, y: 0, z: 0}
    second:
      serializedVersion: 2
      m_TileIndex: 4
      m_TileSpriteIndex: 4
      m_TileMatrixIndex: 0
      m_TileColorIndex: 0
      m_TileObjectToInstantiateIndex: 65535
      dummyAlignment: 0
      m_AllTileFlags: 1073741825
  - first: {x: 19, y: 0, z: 0}
    second:
      serializedVersion: 2
      m_TileIndex: 5
      m_TileSpriteIndex: 5
      m_TileMatrixIndex: 0
      m_TileColorIndex: 0
      m_TileObjectToInstantiateIndex: 65535
      dummyAlignment: 0
      m_AllTileFlags: 1073741825
  - first: {x: 20, y: 0, z: 0}
    second:
      serializedVersion: 2
      m_TileIndex: 6
      m_TileSpriteIndex: 6
      m_TileMatrixIndex: 0
      m_TileColorIndex: 0
      m_TileObjectToInstantiateIndex: 65535
      dummyAlignment: 0
      m_AllTileFlags: 1073741825
  - first: {x: 21, y: 0, z: 0}
    second:
      serializedVersion: 2
      m_TileIndex: 7
      m_TileSpriteIndex: 7
      m_TileMatrixIndex: 0
      m_TileColorIndex: 0
      m_TileObjectToInstantiateIndex: 65535
      dummyAlignment: 0
      m_AllTileFlags: 1073741825
  - first: {x: 18, y: 1, z: 0}
    second:
      serializedVersion: 2
      m_TileIndex: 0
      m_TileSpriteIndex: 0
      m_TileMatrixIndex: 0
      m_TileColorIndex: 0
      m_TileObjectToInstantiateIndex: 65535
      dummyAlignment: 0
      m_AllTileFlags: 1073741825
  - first: {x: 19, y: 1, z: 0}
    second:
      serializedVersion: 2
      m_TileIndex: 1
      m_TileSpriteIndex: 1
      m_TileMatrixIndex: 0
      m_TileColorIndex: 0
      m_TileObjectToInstantiateIndex: 65535
      dummyAlignment: 0
      m_AllTileFlags: 1073741825
  m_AnimatedTiles: {}
  m_TileAssetArray:
  - m_RefCount: 1
    m_Data: {fileID: 11400000, guid: b5738acd7ec434a4a8bc39887ab992c0, type: 2}
  - m_RefCount: 1
    m_Data: {fileID: 11400000, guid: b7414e09c1ab6424bb566ca49a3e8415, type: 2}
  - m_RefCount: 1
    m_Data: {fileID: 11400000, guid: 5e502ae07b1a2204b8cd5bb74534e5e3, type: 2}
  - m_RefCount: 1
    m_Data: {fileID: 11400000, guid: 92f78876a803c684da30ffc293030870, type: 2}
  - m_RefCount: 1
    m_Data: {fileID: 11400000, guid: 4d4ae669f63e72642b9b00e3a5e0e58f, type: 2}
  - m_RefCount: 1
    m_Data: {fileID: 11400000, guid: 97c73205cf95b1f4aa99ac08e0be2625, type: 2}
  - m_RefCount: 1
    m_Data: {fileID: 11400000, guid: c5494d7db1a777348ac4436ca20e8b5e, type: 2}
  - m_RefCount: 1
    m_Data: {fileID: 11400000, guid: 86b0b56f999966f4695f574e3d2accf4, type: 2}
  - m_RefCount: 1
    m_Data: {fileID: 11400000, guid: 7332ca76680f5754aa65977aff0b8d3f, type: 2}
  - m_RefCount: 1
    m_Data: {fileID: 11400000, guid: 341efd4c9f62fd54fbfd6a9711341734, type: 2}
  - m_RefCount: 1
    m_Data: {fileID: 11400000, guid: 87734b15033cb8f45bfe2f2355bae3cd, type: 2}
  - m_RefCount: 1
    m_Data: {fileID: 11400000, guid: 2dbf424d0a4ae4946814e7b60fc34ca5, type: 2}
  - m_RefCount: 1
    m_Data: {fileID: 11400000, guid: d876a5870cd028542bd45e68c4aa8be4, type: 2}
  - m_RefCount: 1
    m_Data: {fileID: 11400000, guid: 591c755175c4e804cbc353dc7519b380, type: 2}
  - m_RefCount: 1
    m_Data: {fileID: 11400000, guid: 378abca0833ef7b40bd60e00c4f1d291, type: 2}
  - m_RefCount: 1
    m_Data: {fileID: 11400000, guid: 893bcb71c9529dc4195786d38c4de089, type: 2}
  - m_RefCount: 1
    m_Data: {fileID: 11400000, guid: 0f352b0808168e74eb2f25cd96fc7eee, type: 2}
  - m_RefCount: 1
    m_Data: {fileID: 11400000, guid: 7c923ac413a2ad34ebac498b621ddc60, type: 2}
  - m_RefCount: 1
    m_Data: {fileID: 11400000, guid: c2110182e9fbf404697c9e2853b8e7e2, type: 2}
  - m_RefCount: 1
    m_Data: {fileID: 11400000, guid: 632e5825add703546a9b05c9951bf1c7, type: 2}
  - m_RefCount: 1
    m_Data: {fileID: 11400000, guid: 7582edf3eab370348a67ec48afc9a5a9, type: 2}
  - m_RefCount: 1
    m_Data: {fileID: 11400000, guid: 112c43de92d8dfd468422c6ba926f93c, type: 2}
  - m_RefCount: 1
    m_Data: {fileID: 11400000, guid: ffce48c1f0749d94387e832124d4ac42, type: 2}
  - m_RefCount: 1
    m_Data: {fileID: 11400000, guid: 7bc8b5cf36c9ee54e9fb3834cb3399f4, type: 2}
  - m_RefCount: 1
    m_Data: {fileID: 11400000, guid: a8e0ef42ed208ac44a0bb9c907c98093, type: 2}
  - m_RefCount: 1
    m_Data: {fileID: 11400000, guid: d943470c606e6ee40bc406a351dfddc0, type: 2}
  - m_RefCount: 1
    m_Data: {fileID: 11400000, guid: 3dfff70af79c09f49b9111cf46dab87c, type: 2}
  - m_RefCount: 1
    m_Data: {fileID: 11400000, guid: 00cdd9ee91e99514881542ab0dd92b7c, type: 2}
  - m_RefCount: 1
    m_Data: {fileID: 11400000, guid: baec204d3d6ea334894fbf293832fde2, type: 2}
  - m_RefCount: 1
    m_Data: {fileID: 11400000, guid: f75f35c05db8627428cfea8344f7975d, type: 2}
  - m_RefCount: 1
    m_Data: {fileID: 11400000, guid: 77168f16c19fe2244a190e411f72f3f9, type: 2}
  - m_RefCount: 1
    m_Data: {fileID: 11400000, guid: ff20c5ab51fea0148a3e8e7ed6ff8e54, type: 2}
  - m_RefCount: 1
    m_Data: {fileID: 11400000, guid: 0ad4c82e3c565934cb596a20a2d37a87, type: 2}
  - m_RefCount: 1
    m_Data: {fileID: 11400000, guid: f078e8e3a7a38ea42a3d74efce5206a9, type: 2}
  - m_RefCount: 1
    m_Data: {fileID: 11400000, guid: 8b892d9ea37ea1f438476edc5737208c, type: 2}
  - m_RefCount: 1
    m_Data: {fileID: 11400000, guid: 5334bd026b66c5c4fb644bdcc07a47c8, type: 2}
  - m_RefCount: 1
    m_Data: {fileID: 11400000, guid: d96a1e4435595034698bf25e8572f2e8, type: 2}
  - m_RefCount: 1
    m_Data: {fileID: 11400000, guid: 0e5bbc42bf4a0014cbd68364e2a82366, type: 2}
  - m_RefCount: 1
    m_Data: {fileID: 11400000, guid: 77e5acdbf1081fd4e801c561702faba6, type: 2}
  - m_RefCount: 1
    m_Data: {fileID: 11400000, guid: 073ec223b2eee434db73dff7a1e12841, type: 2}
  - m_RefCount: 1
    m_Data: {fileID: 11400000, guid: 45ca85bb7f3527a408d66cedb686e0c4, type: 2}
  - m_RefCount: 1
    m_Data: {fileID: 11400000, guid: f699c585e7bdd0c429868430d631d8db, type: 2}
  - m_RefCount: 1
    m_Data: {fileID: 11400000, guid: 616a1840492fb4c4a941003decba5c7e, type: 2}
  - m_RefCount: 1
    m_Data: {fileID: 11400000, guid: 45ba67d89d5b93441b7c76be0bb16a6f, type: 2}
  - m_RefCount: 1
    m_Data: {fileID: 11400000, guid: 097f91d4879a1be4297425cbf1a906cf, type: 2}
  - m_RefCount: 1
    m_Data: {fileID: 11400000, guid: c8a5a4af218cf3042a777b3ea9351382, type: 2}
  - m_RefCount: 1
    m_Data: {fileID: 11400000, guid: 69f5fac8f7448e34a92afe7dc398255d, type: 2}
  - m_RefCount: 1
    m_Data: {fileID: 11400000, guid: 45caebcc84d40dc45a1c69a726814d99, type: 2}
  - m_RefCount: 1
    m_Data: {fileID: 11400000, guid: 45855d6ddcb32354f937db5caf57a1cb, type: 2}
  - m_RefCount: 1
    m_Data: {fileID: 11400000, guid: 41de77ab7daa5784cb86c9d22a9896fd, type: 2}
  - m_RefCount: 1
    m_Data: {fileID: 11400000, guid: 58e6c1b9202b87749b03309479878f74, type: 2}
  - m_RefCount: 1
    m_Data: {fileID: 11400000, guid: d691594347864a04ea2818fc728f21ab, type: 2}
  - m_RefCount: 1
    m_Data: {fileID: 11400000, guid: e7ce9be1832746d45bd7ccb4acf3ad84, type: 2}
  - m_RefCount: 1
    m_Data: {fileID: 11400000, guid: de56911c7fc749346822c27fdbb79288, type: 2}
  - m_RefCount: 1
    m_Data: {fileID: 11400000, guid: f64d5105c009bdb4f936c4dd69c64173, type: 2}
  - m_RefCount: 1
    m_Data: {fileID: 11400000, guid: 0d7001d5c519b0240ad1eddd2af02c4e, type: 2}
  - m_RefCount: 1
    m_Data: {fileID: 11400000, guid: 471da5e2968e8a646be5bd1a7e6f33bd, type: 2}
  - m_RefCount: 1
    m_Data: {fileID: 11400000, guid: c53b65069343bb74cb783d73ef934425, type: 2}
  - m_RefCount: 1
    m_Data: {fileID: 11400000, guid: 60469daa7b66dbe449233de4fc4859bc, type: 2}
  - m_RefCount: 1
    m_Data: {fileID: 11400000, guid: fb72e6458b6febc428c6e530c2c4533d, type: 2}
  - m_RefCount: 1
    m_Data: {fileID: 11400000, guid: 2a3dd577504b3544888f005856ca76bd, type: 2}
  - m_RefCount: 1
    m_Data: {fileID: 11400000, guid: 0b391469d68dc0b40be5f9b4b44f5176, type: 2}
  - m_RefCount: 1
    m_Data: {fileID: 11400000, guid: 49b8e69937f3b0d449fa60870547e872, type: 2}
  - m_RefCount: 1
    m_Data: {fileID: 11400000, guid: 6f28f51dcc178f14fabeb64f0b2a624a, type: 2}
  - m_RefCount: 1
    m_Data: {fileID: 11400000, guid: a38388a6f05c7444f951fba91431ba0a, type: 2}
  - m_RefCount: 1
    m_Data: {fileID: 11400000, guid: 0ec476b29c76b8548a957e30ac629c81, type: 2}
  - m_RefCount: 1
    m_Data: {fileID: 11400000, guid: a73a73b7cf96f6d4da3295c96c1dee27, type: 2}
  - m_RefCount: 1
    m_Data: {fileID: 11400000, guid: 32d0c4ae1894d0c49bb359dd9ddbd4bf, type: 2}
  - m_RefCount: 1
    m_Data: {fileID: 11400000, guid: f841ca01387bac343ab2949651a74748, type: 2}
  - m_RefCount: 1
    m_Data: {fileID: 11400000, guid: 53d222a9689c2c942a7490fa469d15c4, type: 2}
  - m_RefCount: 1
    m_Data: {fileID: 11400000, guid: ebed28aa129161c41bf2153b7a457da9, type: 2}
  - m_RefCount: 1
    m_Data: {fileID: 11400000, guid: ba6737ea3f4f13d479c4c7249eeabded, type: 2}
  - m_RefCount: 1
    m_Data: {fileID: 11400000, guid: 9870e58d23496f94da071cb70e0c6a04, type: 2}
  - m_RefCount: 1
    m_Data: {fileID: 11400000, guid: 23c501b84ac83e342a790f5632959f93, type: 2}
  - m_RefCount: 1
    m_Data: {fileID: 11400000, guid: 6c39f1c46c9a92d43b9dfc0781e244f8, type: 2}
  - m_RefCount: 1
    m_Data: {fileID: 11400000, guid: b652ee44d7e0c30429b46d7237b168c5, type: 2}
  - m_RefCount: 1
    m_Data: {fileID: 11400000, guid: 1656902d86bf68549b627b57fc27623a, type: 2}
  - m_RefCount: 1
    m_Data: {fileID: 11400000, guid: 526127b29b27785469092b5e15d2b190, type: 2}
  - m_RefCount: 1
    m_Data: {fileID: 11400000, guid: 3449cc505ab9f4c4da9c606ef7ab2eca, type: 2}
  - m_RefCount: 1
    m_Data: {fileID: 11400000, guid: 26cb2892b6a1e0f40b2ce95fc3e896bf, type: 2}
  - m_RefCount: 1
    m_Data: {fileID: 11400000, guid: 30e5e30d3be0f4348bec7823af0d3003, type: 2}
  - m_RefCount: 1
    m_Data: {fileID: 11400000, guid: 58cadb6ce4187244da29423e052b811d, type: 2}
  - m_RefCount: 1
    m_Data: {fileID: 11400000, guid: 8159d956f7f1b214daa257bd440b70b9, type: 2}
  - m_RefCount: 1
    m_Data: {fileID: 11400000, guid: 91c500842b0552940ba6e6a3e76ae6cf, type: 2}
  - m_RefCount: 1
    m_Data: {fileID: 11400000, guid: 3a26bcd3a832edd4a94c6c14c2c1e49d, type: 2}
  - m_RefCount: 1
    m_Data: {fileID: 11400000, guid: 8176f8b412ff3a24f8442eef0be28daf, type: 2}
  - m_RefCount: 1
    m_Data: {fileID: 11400000, guid: 30f2cb696de0ace42a901b378f7e140a, type: 2}
  - m_RefCount: 1
    m_Data: {fileID: 11400000, guid: eb55bf55187dcdb48b2d1791aae17461, type: 2}
  - m_RefCount: 1
    m_Data: {fileID: 11400000, guid: 9364f6387f4a2534bb3287cf12e72908, type: 2}
  - m_RefCount: 1
    m_Data: {fileID: 11400000, guid: 1338bce5058ed4d47bf0691bdf5d430a, type: 2}
  - m_RefCount: 1
    m_Data: {fileID: 11400000, guid: ad8ec87dde63e4140ae6697ea14f967a, type: 2}
  - m_RefCount: 1
    m_Data: {fileID: 11400000, guid: 93a8be7674d8679419313e55d1e7efba, type: 2}
  - m_RefCount: 1
    m_Data: {fileID: 11400000, guid: f9eaf6de26d50394caa025a8dd63d6bc, type: 2}
  - m_RefCount: 1
    m_Data: {fileID: 11400000, guid: 22b87062a0f083c45a502ecd204a9716, type: 2}
  - m_RefCount: 1
    m_Data: {fileID: 11400000, guid: 24a1c8dfa3c8bac4a818716be719a2e9, type: 2}
  - m_RefCount: 1
    m_Data: {fileID: 11400000, guid: 6157e97ed0c7c7d438ddf0046080f650, type: 2}
  - m_RefCount: 1
    m_Data: {fileID: 11400000, guid: 19a33e267ac6d9b40b7baf84bacf33af, type: 2}
  - m_RefCount: 1
    m_Data: {fileID: 11400000, guid: c2d6c8f7ef959ba42833a8892cf2798d, type: 2}
  - m_RefCount: 1
    m_Data: {fileID: 11400000, guid: 1350ca9b90d1eae4a8bbbad05eeef4c1, type: 2}
  - m_RefCount: 1
    m_Data: {fileID: 11400000, guid: a8b52e3f88ade9e4682f1dd974085cc3, type: 2}
  - m_RefCount: 1
    m_Data: {fileID: 11400000, guid: e5a661e669129364ea6fc487eddc1e0b, type: 2}
  - m_RefCount: 1
    m_Data: {fileID: 11400000, guid: 6c0b328358eec9b458e9f7615ee3d71a, type: 2}
  - m_RefCount: 1
    m_Data: {fileID: 11400000, guid: a1ad3632a2e6c42469682e277855132d, type: 2}
  m_TileSpriteArray:
  - m_RefCount: 1
    m_Data: {fileID: 21300000, guid: 297a514ba6a7c44e6a1eac9511e640e5, type: 3}
  - m_RefCount: 1
    m_Data: {fileID: 21300002, guid: 297a514ba6a7c44e6a1eac9511e640e5, type: 3}
  - m_RefCount: 1
    m_Data: {fileID: 21300004, guid: 297a514ba6a7c44e6a1eac9511e640e5, type: 3}
  - m_RefCount: 1
    m_Data: {fileID: 21300006, guid: 297a514ba6a7c44e6a1eac9511e640e5, type: 3}
  - m_RefCount: 1
    m_Data: {fileID: 21300008, guid: 297a514ba6a7c44e6a1eac9511e640e5, type: 3}
  - m_RefCount: 1
    m_Data: {fileID: 21300010, guid: 297a514ba6a7c44e6a1eac9511e640e5, type: 3}
  - m_RefCount: 1
    m_Data: {fileID: 21300012, guid: 297a514ba6a7c44e6a1eac9511e640e5, type: 3}
  - m_RefCount: 1
    m_Data: {fileID: 21300014, guid: 297a514ba6a7c44e6a1eac9511e640e5, type: 3}
  - m_RefCount: 1
    m_Data: {fileID: 21300016, guid: 297a514ba6a7c44e6a1eac9511e640e5, type: 3}
  - m_RefCount: 1
    m_Data: {fileID: 21300018, guid: 297a514ba6a7c44e6a1eac9511e640e5, type: 3}
  - m_RefCount: 1
    m_Data: {fileID: 21300020, guid: 297a514ba6a7c44e6a1eac9511e640e5, type: 3}
  - m_RefCount: 1
    m_Data: {fileID: 21300022, guid: 297a514ba6a7c44e6a1eac9511e640e5, type: 3}
  - m_RefCount: 1
    m_Data: {fileID: 21300024, guid: 297a514ba6a7c44e6a1eac9511e640e5, type: 3}
  - m_RefCount: 1
    m_Data: {fileID: 21300026, guid: 297a514ba6a7c44e6a1eac9511e640e5, type: 3}
  - m_RefCount: 1
    m_Data: {fileID: 21300028, guid: 297a514ba6a7c44e6a1eac9511e640e5, type: 3}
  - m_RefCount: 1
    m_Data: {fileID: 21300030, guid: 297a514ba6a7c44e6a1eac9511e640e5, type: 3}
  - m_RefCount: 1
    m_Data: {fileID: 21300032, guid: 297a514ba6a7c44e6a1eac9511e640e5, type: 3}
  - m_RefCount: 1
    m_Data: {fileID: 21300034, guid: 297a514ba6a7c44e6a1eac9511e640e5, type: 3}
  - m_RefCount: 1
    m_Data: {fileID: 21300036, guid: 297a514ba6a7c44e6a1eac9511e640e5, type: 3}
  - m_RefCount: 1
    m_Data: {fileID: 21300038, guid: 297a514ba6a7c44e6a1eac9511e640e5, type: 3}
  - m_RefCount: 1
    m_Data: {fileID: 21300040, guid: 297a514ba6a7c44e6a1eac9511e640e5, type: 3}
  - m_RefCount: 1
    m_Data: {fileID: 21300042, guid: 297a514ba6a7c44e6a1eac9511e640e5, type: 3}
  - m_RefCount: 1
    m_Data: {fileID: 21300044, guid: 297a514ba6a7c44e6a1eac9511e640e5, type: 3}
  - m_RefCount: 1
    m_Data: {fileID: 21300046, guid: 297a514ba6a7c44e6a1eac9511e640e5, type: 3}
  - m_RefCount: 1
    m_Data: {fileID: 21300048, guid: 297a514ba6a7c44e6a1eac9511e640e5, type: 3}
  - m_RefCount: 1
    m_Data: {fileID: 21300050, guid: 297a514ba6a7c44e6a1eac9511e640e5, type: 3}
  - m_RefCount: 1
    m_Data: {fileID: 21300052, guid: 297a514ba6a7c44e6a1eac9511e640e5, type: 3}
  - m_RefCount: 1
    m_Data: {fileID: 21300054, guid: 297a514ba6a7c44e6a1eac9511e640e5, type: 3}
  - m_RefCount: 1
    m_Data: {fileID: 21300056, guid: 297a514ba6a7c44e6a1eac9511e640e5, type: 3}
  - m_RefCount: 1
    m_Data: {fileID: 21300058, guid: 297a514ba6a7c44e6a1eac9511e640e5, type: 3}
  - m_RefCount: 1
    m_Data: {fileID: 21300060, guid: 297a514ba6a7c44e6a1eac9511e640e5, type: 3}
  - m_RefCount: 1
    m_Data: {fileID: 21300062, guid: 297a514ba6a7c44e6a1eac9511e640e5, type: 3}
  - m_RefCount: 1
    m_Data: {fileID: 21300064, guid: 297a514ba6a7c44e6a1eac9511e640e5, type: 3}
  - m_RefCount: 1
    m_Data: {fileID: 21300066, guid: 297a514ba6a7c44e6a1eac9511e640e5, type: 3}
  - m_RefCount: 1
    m_Data: {fileID: 21300068, guid: 297a514ba6a7c44e6a1eac9511e640e5, type: 3}
  - m_RefCount: 1
    m_Data: {fileID: 21300070, guid: 297a514ba6a7c44e6a1eac9511e640e5, type: 3}
  - m_RefCount: 1
    m_Data: {fileID: 21300072, guid: 297a514ba6a7c44e6a1eac9511e640e5, type: 3}
  - m_RefCount: 1
    m_Data: {fileID: 21300074, guid: 297a514ba6a7c44e6a1eac9511e640e5, type: 3}
  - m_RefCount: 1
    m_Data: {fileID: 21300076, guid: 297a514ba6a7c44e6a1eac9511e640e5, type: 3}
  - m_RefCount: 1
    m_Data: {fileID: 21300078, guid: 297a514ba6a7c44e6a1eac9511e640e5, type: 3}
  - m_RefCount: 1
    m_Data: {fileID: 21300080, guid: 297a514ba6a7c44e6a1eac9511e640e5, type: 3}
  - m_RefCount: 1
    m_Data: {fileID: 21300082, guid: 297a514ba6a7c44e6a1eac9511e640e5, type: 3}
  - m_RefCount: 1
    m_Data: {fileID: 21300084, guid: 297a514ba6a7c44e6a1eac9511e640e5, type: 3}
  - m_RefCount: 1
    m_Data: {fileID: 21300086, guid: 297a514ba6a7c44e6a1eac9511e640e5, type: 3}
  - m_RefCount: 1
    m_Data: {fileID: 21300088, guid: 297a514ba6a7c44e6a1eac9511e640e5, type: 3}
  - m_RefCount: 1
    m_Data: {fileID: 21300090, guid: 297a514ba6a7c44e6a1eac9511e640e5, type: 3}
  - m_RefCount: 1
    m_Data: {fileID: 21300092, guid: 297a514ba6a7c44e6a1eac9511e640e5, type: 3}
  - m_RefCount: 1
    m_Data: {fileID: 21300094, guid: 297a514ba6a7c44e6a1eac9511e640e5, type: 3}
  - m_RefCount: 1
    m_Data: {fileID: 21300096, guid: 297a514ba6a7c44e6a1eac9511e640e5, type: 3}
  - m_RefCount: 1
    m_Data: {fileID: 21300098, guid: 297a514ba6a7c44e6a1eac9511e640e5, type: 3}
  - m_RefCount: 1
    m_Data: {fileID: 21300100, guid: 297a514ba6a7c44e6a1eac9511e640e5, type: 3}
  - m_RefCount: 1
    m_Data: {fileID: 21300102, guid: 297a514ba6a7c44e6a1eac9511e640e5, type: 3}
  - m_RefCount: 1
    m_Data: {fileID: 21300104, guid: 297a514ba6a7c44e6a1eac9511e640e5, type: 3}
  - m_RefCount: 1
    m_Data: {fileID: 21300106, guid: 297a514ba6a7c44e6a1eac9511e640e5, type: 3}
  - m_RefCount: 1
    m_Data: {fileID: 21300108, guid: 297a514ba6a7c44e6a1eac9511e640e5, type: 3}
  - m_RefCount: 1
    m_Data: {fileID: 21300110, guid: 297a514ba6a7c44e6a1eac9511e640e5, type: 3}
  - m_RefCount: 1
    m_Data: {fileID: 21300112, guid: 297a514ba6a7c44e6a1eac9511e640e5, type: 3}
  - m_RefCount: 1
    m_Data: {fileID: 21300114, guid: 297a514ba6a7c44e6a1eac9511e640e5, type: 3}
  - m_RefCount: 1
    m_Data: {fileID: 21300116, guid: 297a514ba6a7c44e6a1eac9511e640e5, type: 3}
  - m_RefCount: 1
    m_Data: {fileID: 21300118, guid: 297a514ba6a7c44e6a1eac9511e640e5, type: 3}
  - m_RefCount: 1
    m_Data: {fileID: 21300120, guid: 297a514ba6a7c44e6a1eac9511e640e5, type: 3}
  - m_RefCount: 1
    m_Data: {fileID: 21300122, guid: 297a514ba6a7c44e6a1eac9511e640e5, type: 3}
  - m_RefCount: 1
    m_Data: {fileID: 21300124, guid: 297a514ba6a7c44e6a1eac9511e640e5, type: 3}
  - m_RefCount: 1
    m_Data: {fileID: 21300126, guid: 297a514ba6a7c44e6a1eac9511e640e5, type: 3}
  - m_RefCount: 1
    m_Data: {fileID: 21300128, guid: 297a514ba6a7c44e6a1eac9511e640e5, type: 3}
  - m_RefCount: 1
    m_Data: {fileID: 21300130, guid: 297a514ba6a7c44e6a1eac9511e640e5, type: 3}
  - m_RefCount: 1
    m_Data: {fileID: 21300132, guid: 297a514ba6a7c44e6a1eac9511e640e5, type: 3}
  - m_RefCount: 1
    m_Data: {fileID: 21300134, guid: 297a514ba6a7c44e6a1eac9511e640e5, type: 3}
  - m_RefCount: 1
    m_Data: {fileID: 21300136, guid: 297a514ba6a7c44e6a1eac9511e640e5, type: 3}
  - m_RefCount: 1
    m_Data: {fileID: 21300138, guid: 297a514ba6a7c44e6a1eac9511e640e5, type: 3}
  - m_RefCount: 1
    m_Data: {fileID: 21300140, guid: 297a514ba6a7c44e6a1eac9511e640e5, type: 3}
  - m_RefCount: 1
    m_Data: {fileID: 21300142, guid: 297a514ba6a7c44e6a1eac9511e640e5, type: 3}
  - m_RefCount: 1
    m_Data: {fileID: 21300144, guid: 297a514ba6a7c44e6a1eac9511e640e5, type: 3}
  - m_RefCount: 1
    m_Data: {fileID: 21300146, guid: 297a514ba6a7c44e6a1eac9511e640e5, type: 3}
  - m_RefCount: 1
    m_Data: {fileID: 21300148, guid: 297a514ba6a7c44e6a1eac9511e640e5, type: 3}
  - m_RefCount: 1
    m_Data: {fileID: 21300150, guid: 297a514ba6a7c44e6a1eac9511e640e5, type: 3}
  - m_RefCount: 1
    m_Data: {fileID: 21300152, guid: 297a514ba6a7c44e6a1eac9511e640e5, type: 3}
  - m_RefCount: 1
    m_Data: {fileID: 21300154, guid: 297a514ba6a7c44e6a1eac9511e640e5, type: 3}
  - m_RefCount: 1
    m_Data: {fileID: 21300156, guid: 297a514ba6a7c44e6a1eac9511e640e5, type: 3}
  - m_RefCount: 1
    m_Data: {fileID: 21300158, guid: 297a514ba6a7c44e6a1eac9511e640e5, type: 3}
  - m_RefCount: 1
    m_Data: {fileID: 21300160, guid: 297a514ba6a7c44e6a1eac9511e640e5, type: 3}
  - m_RefCount: 1
    m_Data: {fileID: 21300162, guid: 297a514ba6a7c44e6a1eac9511e640e5, type: 3}
  - m_RefCount: 1
    m_Data: {fileID: 21300164, guid: 297a514ba6a7c44e6a1eac9511e640e5, type: 3}
  - m_RefCount: 1
    m_Data: {fileID: 21300166, guid: 297a514ba6a7c44e6a1eac9511e640e5, type: 3}
  - m_RefCount: 1
    m_Data: {fileID: 21300168, guid: 297a514ba6a7c44e6a1eac9511e640e5, type: 3}
  - m_RefCount: 1
    m_Data: {fileID: 21300170, guid: 297a514ba6a7c44e6a1eac9511e640e5, type: 3}
  - m_RefCount: 1
    m_Data: {fileID: 21300172, guid: 297a514ba6a7c44e6a1eac9511e640e5, type: 3}
  - m_RefCount: 1
    m_Data: {fileID: 21300174, guid: 297a514ba6a7c44e6a1eac9511e640e5, type: 3}
  - m_RefCount: 1
    m_Data: {fileID: 21300176, guid: 297a514ba6a7c44e6a1eac9511e640e5, type: 3}
  - m_RefCount: 1
    m_Data: {fileID: 21300178, guid: 297a514ba6a7c44e6a1eac9511e640e5, type: 3}
  - m_RefCount: 1
    m_Data: {fileID: 21300180, guid: 297a514ba6a7c44e6a1eac9511e640e5, type: 3}
  - m_RefCount: 1
    m_Data: {fileID: 21300182, guid: 297a514ba6a7c44e6a1eac9511e640e5, type: 3}
  - m_RefCount: 1
    m_Data: {fileID: 21300184, guid: 297a514ba6a7c44e6a1eac9511e640e5, type: 3}
  - m_RefCount: 1
    m_Data: {fileID: 21300000, guid: a49935f49dc384b83ae4e1e7ac7802f2, type: 3}
  - m_RefCount: 1
    m_Data: {fileID: 21300000, guid: 169c738601686406e9dc499aecfe1539, type: 3}
  - m_RefCount: 1
    m_Data: {fileID: 21300000, guid: 36d30963c1b6a4d4ab1c9d7a31b892b2, type: 3}
  - m_RefCount: 1
    m_Data: {fileID: 21300000, guid: 4cd70fb4a47bf4c84ad549f7f57b3cd6, type: 3}
  - m_RefCount: 1
    m_Data: {fileID: 21300000, guid: ccbc321d821ff4ee4bff372e6fae0f3d, type: 3}
  - m_RefCount: 1
    m_Data: {fileID: 21300000, guid: 85e2e5d9c081f4980b3f2730fe87dfd7, type: 3}
  - m_RefCount: 1
    m_Data: {fileID: 21300000, guid: a08a37b3e8fd348a6aa32f11d3a65b29, type: 3}
  - m_RefCount: 1
    m_Data: {fileID: 21300000, guid: eca112b76f20b46868ad86e0bd613dae, type: 3}
  - m_RefCount: 1
    m_Data: {fileID: 21300000, guid: 52959829b05c3443bb826105c7399ae7, type: 3}
  - m_RefCount: 1
    m_Data: {fileID: 21300000, guid: 77adc8bfe31a0412fb512e6d9c444330, type: 3}
  m_TileMatrixArray:
  - m_RefCount: 103
    m_Data:
      e00: 1
      e01: 0
      e02: 0
      e03: 0
      e10: 0
      e11: 1
      e12: 0
      e13: 0
      e20: 0
      e21: 0
      e22: 1
      e23: 0
      e30: 0
      e31: 0
      e32: 0
      e33: 1
  m_TileColorArray:
  - m_RefCount: 103
    m_Data: {r: 1, g: 1, b: 1, a: 1}
  - m_RefCount: 0
    m_Data: {r: NaN, g: NaN, b: NaN, a: NaN}
  m_TileObjectToInstantiateArray: []
  m_AnimationFrameRate: 1
  m_Color: {r: 1, g: 1, b: 1, a: 1}
  m_Origin: {x: -2, y: -12, z: 0}
  m_Size: {x: 26, y: 14, z: 1}
  m_TileAnchor: {x: 0.5, y: 0.5, z: 0}
  m_TileOrientation: 0
  m_TileOrientationMatrix:
    e00: 1
    e01: 0
    e02: 0
    e03: 0
    e10: 0
    e11: 1
    e12: 0
    e13: 0
    e20: 0
    e21: 0
    e22: 1
    e23: 0
    e30: 0
    e31: 0
    e32: 0
    e33: 1
--- !u!483693784 &6051034178880185149
TilemapRenderer:
  m_ObjectHideFlags: 0
  m_CorrespondingSourceObject: {fileID: 0}
  m_PrefabInstance: {fileID: 0}
  m_PrefabAsset: {fileID: 0}
  m_GameObject: {fileID: 191586607239795106}
  m_Enabled: 1
  m_CastShadows: 0
  m_ReceiveShadows: 0
  m_DynamicOccludee: 0
  m_StaticShadowCaster: 0
  m_MotionVectors: 1
  m_LightProbeUsage: 0
  m_ReflectionProbeUsage: 0
  m_RayTracingMode: 0
  m_RayTraceProcedural: 0
  m_RenderingLayerMask: 1
  m_RendererPriority: 0
  m_Materials:
  - {fileID: 10754, guid: 0000000000000000f000000000000000, type: 0}
  m_StaticBatchInfo:
    firstSubMesh: 0
    subMeshCount: 0
  m_StaticBatchRoot: {fileID: 0}
  m_ProbeAnchor: {fileID: 0}
  m_LightProbeVolumeOverride: {fileID: 0}
  m_ScaleInLightmap: 1
  m_ReceiveGI: 1
  m_PreserveUVs: 0
  m_IgnoreNormalsForChartDetection: 0
  m_ImportantGI: 0
  m_StitchLightmapSeams: 1
  m_SelectedEditorRenderState: 0
  m_MinimumChartSize: 4
  m_AutoUVMaxDistance: 0.5
  m_AutoUVMaxAngle: 89
  m_LightmapParameters: {fileID: 0}
  m_SortingLayerID: 0
  m_SortingLayer: 0
  m_SortingOrder: 0
  m_ChunkSize: {x: 32, y: 32, z: 32}
  m_ChunkCullingBounds: {x: 0, y: 0, z: 0}
  m_MaxChunkCount: 16
  m_MaxFrameAge: 16
  m_SortOrder: 0
  m_Mode: 0
  m_DetectChunkCullingBounds: 0
  m_MaskInteraction: 0
--- !u!1 &1236872620437325407
GameObject:
  m_ObjectHideFlags: 0
  m_CorrespondingSourceObject: {fileID: 0}
  m_PrefabInstance: {fileID: 0}
  m_PrefabAsset: {fileID: 0}
  serializedVersion: 6
  m_Component:
  - component: {fileID: 5684918250652018734}
  - component: {fileID: 2908769903697567162}
  m_Layer: 0
  m_Name: New Palette
  m_TagString: Untagged
  m_Icon: {fileID: 0}
  m_NavMeshLayer: 0
  m_StaticEditorFlags: 0
  m_IsActive: 1
--- !u!4 &5684918250652018734
Transform:
  m_ObjectHideFlags: 0
  m_CorrespondingSourceObject: {fileID: 0}
  m_PrefabInstance: {fileID: 0}
  m_PrefabAsset: {fileID: 0}
  m_GameObject: {fileID: 1236872620437325407}
  m_LocalRotation: {x: 0, y: 0, z: 0, w: 1}
  m_LocalPosition: {x: 0, y: 0, z: 0}
  m_LocalScale: {x: 1, y: 1, z: 1}
  m_ConstrainProportionsScale: 0
  m_Children:
  - {fileID: 5544209853719214357}
  m_Father: {fileID: 0}
  m_RootOrder: 0
  m_LocalEulerAnglesHint: {x: 0, y: 0, z: 0}
--- !u!156049354 &2908769903697567162
Grid:
  m_ObjectHideFlags: 0
  m_CorrespondingSourceObject: {fileID: 0}
  m_PrefabInstance: {fileID: 0}
  m_PrefabAsset: {fileID: 0}
  m_GameObject: {fileID: 1236872620437325407}
  m_Enabled: 1
  m_CellSize: {x: 9.92, y: 2.24, z: 0}
  m_CellGap: {x: 0, y: 0, z: 0}
  m_CellLayout: 0
  m_CellSwizzle: 0
--- !u!114 &242904668865273121
MonoBehaviour:
  m_ObjectHideFlags: 0
  m_CorrespondingSourceObject: {fileID: 0}
  m_PrefabInstance: {fileID: 0}
  m_PrefabAsset: {fileID: 0}
  m_GameObject: {fileID: 0}
  m_Enabled: 1
  m_EditorHideFlags: 0
  m_Script: {fileID: 12395, guid: 0000000000000000e000000000000000, type: 0}
  m_Name: Palette Settings
  m_EditorClassIdentifier: 
  cellSizing: 0
  m_TransparencySortMode: 0
  m_TransparencySortAxis: {x: 0, y: 0, z: 1}
