%YAML 1.1
%TAG !u! tag:unity3d.com,2011:
--- !u!1001 &579251749987329715
PrefabInstance:
  m_ObjectHideFlags: 0
  serializedVersion: 2
  m_Modification:
    m_TransformParent: {fileID: 0}
    m_Modifications:
    - target: {fileID: 1230325184218856, guid: 3952c3fe53f74a0409f716652bd8d27d, type: 3}
      propertyPath: m_Name
      value: 2DShipsMissileMedium Variant
      objectReference: {fileID: 0}
    - target: {fileID: 4939776514575168, guid: 3952c3fe53f74a0409f716652bd8d27d, type: 3}
      propertyPath: m_RootOrder
      value: 0
      objectReference: {fileID: 0}
    - target: {fileID: 4939776514575168, guid: 3952c3fe53f74a0409f716652bd8d27d, type: 3}
      propertyPath: m_LocalScale.x
      value: 0.2
      objectReference: {fileID: 0}
    - target: {fileID: 4939776514575168, guid: 3952c3fe53f74a0409f716652bd8d27d, type: 3}
      propertyPath: m_LocalScale.y
      value: 0.2
      objectReference: {fileID: 0}
    - target: {fileID: 4939776514575168, guid: 3952c3fe53f74a0409f716652bd8d27d, type: 3}
      propertyPath: m_LocalScale.z
      value: 0.2
      objectReference: {fileID: 0}
    - target: {fileID: 4939776514575168, guid: 3952c3fe53f74a0409f716652bd8d27d, type: 3}
      propertyPath: m_LocalPosition.x
      value: 2.5441647
      objectReference: {fileID: 0}
    - target: {fileID: 4939776514575168, guid: 3952c3fe53f74a0409f716652bd8d27d, type: 3}
      propertyPath: m_LocalPosition.y
      value: 2.0830646
      objectReference: {fileID: 0}
    - target: {fileID: 4939776514575168, guid: 3952c3fe53f74a0409f716652bd8d27d, type: 3}
      propertyPath: m_LocalPosition.z
      value: 0
      objectReference: {fileID: 0}
    - target: {fileID: 4939776514575168, guid: 3952c3fe53f74a0409f716652bd8d27d, type: 3}
      propertyPath: m_LocalRotation.w
      value: 0
      objectReference: {fileID: 0}
    - target: {fileID: 4939776514575168, guid: 3952c3fe53f74a0409f716652bd8d27d, type: 3}
      propertyPath: m_LocalRotation.x
      value: 0
      objectReference: {fileID: 0}
    - target: {fileID: 4939776514575168, guid: 3952c3fe53f74a0409f716652bd8d27d, type: 3}
      propertyPath: m_LocalRotation.y
      value: 0
      objectReference: {fileID: 0}
    - target: {fileID: 4939776514575168, guid: 3952c3fe53f74a0409f716652bd8d27d, type: 3}
      propertyPath: m_LocalRotation.z
      value: 1
      objectReference: {fileID: 0}
    - target: {fileID: 4939776514575168, guid: 3952c3fe53f74a0409f716652bd8d27d, type: 3}
      propertyPath: m_LocalEulerAnglesHint.x
      value: 0
      objectReference: {fileID: 0}
    - target: {fileID: 4939776514575168, guid: 3952c3fe53f74a0409f716652bd8d27d, type: 3}
      propertyPath: m_LocalEulerAnglesHint.y
      value: 0
      objectReference: {fileID: 0}
    - target: {fileID: 4939776514575168, guid: 3952c3fe53f74a0409f716652bd8d27d, type: 3}
      propertyPath: m_LocalEulerAnglesHint.z
      value: 180
      objectReference: {fileID: 0}
    m_RemovedComponents: []
  m_SourcePrefab: {fileID: 100100000, guid: 3952c3fe53f74a0409f716652bd8d27d, type: 3}
--- !u!1 &580318512029163611 stripped
GameObject:
  m_CorrespondingSourceObject: {fileID: 1230325184218856, guid: 3952c3fe53f74a0409f716652bd8d27d,
    type: 3}
  m_PrefabInstance: {fileID: 579251749987329715}
  m_PrefabAsset: {fileID: 0}
--- !u!50 &-2521925067660410320
Rigidbody2D:
  serializedVersion: 4
  m_ObjectHideFlags: 0
  m_CorrespondingSourceObject: {fileID: 0}
  m_PrefabInstance: {fileID: 0}
  m_PrefabAsset: {fileID: 0}
  m_GameObject: {fileID: 580318512029163611}
  m_BodyType: 0
  m_Simulated: 1
  m_UseFullKinematicContacts: 0
  m_UseAutoMass: 0
  m_Mass: 0.0001
  m_LinearDrag: 0
  m_AngularDrag: 0
  m_GravityScale: 0
  m_Material: {fileID: 0}
  m_Interpolate: 0
  m_SleepingMode: 1
  m_CollisionDetection: 1
  m_Constraints: 0
--- !u!114 &-6081179033024688058
MonoBehaviour:
  m_ObjectHideFlags: 0
  m_CorrespondingSourceObject: {fileID: 0}
  m_PrefabInstance: {fileID: 0}
  m_PrefabAsset: {fileID: 0}
  m_GameObject: {fileID: 580318512029163611}
  m_Enabled: 1
  m_EditorHideFlags: 0
  m_Script: {fileID: 11500000, guid: d00b884a68f270448b7a9e5b7784b426, type: 3}
  m_Name: 
  m_EditorClassIdentifier: 
  Speed: -10
