%YAML 1.1
%TAG !u! tag:unity3d.com,2011:
--- !u!74 &7400000
AnimationClip:
  m_ObjectHideFlags: 0
  m_CorrespondingSourceObject: {fileID: 0}
  m_PrefabInstance: {fileID: 0}
  m_PrefabAsset: {fileID: 0}
  m_Name: susDie
  serializedVersion: 6
  m_Legacy: 0
  m_Compressed: 0
  m_UseHighQualityCurve: 1
  m_RotationCurves:
  - curve:
      serializedVersion: 2
      m_Curve:
      - serializedVersion: 3
        time: 0
        value: {x: -0.7071068, y: 0, z: -0, w: 0.7071067}
        inSlope: {x: 0, y: 0, z: 0, w: 0}
        outSlope: {x: 0, y: 0, z: 0, w: 0}
        tangentMode: 0
        weightedMode: 0
        inWeight: {x: 0.33333334, y: 0.33333334, z: 0.33333334, w: 0.33333334}
        outWeight: {x: 0.33333334, y: 0.33333334, z: 0.33333334, w: 0.33333334}
      - serializedVersion: 3
        time: 2.500001
        value: {x: -0.7071068, y: 0, z: -0, w: 0.7071067}
        inSlope: {x: 0, y: 0, z: 0, w: 0}
        outSlope: {x: 0, y: 0, z: 0, w: 0}
        tangentMode: 0
        weightedMode: 0
        inWeight: {x: 0.33333334, y: 0.33333334, z: 0.33333334, w: 0.33333334}
        outWeight: {x: 0.33333334, y: 0.33333334, z: 0.33333334, w: 0.33333334}
      m_PreInfinity: 2
      m_PostInfinity: 2
      m_RotationOrder: 4
    path: Armature
  - curve:
      serializedVersion: 2
      m_Curve:
      - serializedVersion: 3
        time: 0
        value: {x: 0.7071068, y: 0, z: 0, w: 0.7071067}
        inSlope: {x: 0, y: 0, z: 0, w: 0}
        outSlope: {x: 0, y: 0, z: 0, w: 0}
        tangentMode: 0
        weightedMode: 0
        inWeight: {x: 0.33333334, y: 0.33333334, z: 0.33333334, w: 0.33333334}
        outWeight: {x: 0.33333334, y: 0.33333334, z: 0.33333334, w: 0.33333334}
      - serializedVersion: 3
        time: 0.20833397
        value: {x: 0.7071068, y: 0, z: 0, w: 0.7071067}
        inSlope: {x: 0, y: 0, z: 0, w: 0}
        outSlope: {x: 0, y: 0, z: 0, w: 0}
        tangentMode: 0
        weightedMode: 0
        inWeight: {x: 0.33333334, y: 0.33333334, z: 0.33333334, w: 0.33333334}
        outWeight: {x: 0.33333334, y: 0.33333334, z: 0.33333334, w: 0.33333334}
      - serializedVersion: 3
        time: 2.291667
        value: {x: 0.7071068, y: 0, z: 0, w: 0.7071067}
        inSlope: {x: 0, y: 0, z: 0, w: 0}
        outSlope: {x: 0, y: 0, z: 0, w: 0}
        tangentMode: 0
        weightedMode: 0
        inWeight: {x: 0.33333334, y: 0.33333334, z: 0.33333334, w: 0.33333334}
        outWeight: {x: 0.33333334, y: 0.33333334, z: 0.33333334, w: 0.33333334}
      - serializedVersion: 3
        time: 2.500001
        value: {x: 0.7071068, y: 0, z: -0, w: 0.7071067}
        inSlope: {x: 0, y: 0, z: -0, w: 0}
        outSlope: {x: 0, y: 0, z: -0, w: 0}
        tangentMode: 0
        weightedMode: 0
        inWeight: {x: 0.33333334, y: 0.33333334, z: 0.33333334, w: 0.33333334}
        outWeight: {x: 0.33333334, y: 0.33333334, z: 0.33333334, w: 0.33333334}
      m_PreInfinity: 2
      m_PostInfinity: 2
      m_RotationOrder: 4
    path: Armature/Bottom
  - curve:
      serializedVersion: 2
      m_Curve:
      - serializedVersion: 3
        time: 0
        value: {x: -0.0017657317, y: -0.00019455835, z: -0.00027568883, w: 1.0000507}
        inSlope: {x: -0.088668846, y: -0.00959819, z: -0.013865922, w: 0.00167298}
        outSlope: {x: -0.088668846, y: -0.00959819, z: -0.013865922, w: 0.00167298}
        tangentMode: 0
        weightedMode: 0
        inWeight: {x: 0.33333334, y: 0.33333334, z: 0.33333334, w: 0.33333334}
        outWeight: {x: 0.33333334, y: 0.33333334, z: 0.33333334, w: 0.33333334}
      - serializedVersion: 3
        time: 0.12500095
        value: {x: -0.03690112, y: -0.004453072, z: -0.005712585, w: 0.9992927}
        inSlope: {x: -0.5093068, y: -0.061461, z: -0.07884477, w: -0.020632433}
        outSlope: {x: -0.5093068, y: -0.061461, z: -0.07884477, w: -0.020632433}
        tangentMode: 0
        weightedMode: 0
        inWeight: {x: 0.33333334, y: 0.33333334, z: 0.33333334, w: 0.33333334}
        outWeight: {x: 0.33333334, y: 0.33333334, z: 0.33333334, w: 0.33333334}
      - serializedVersion: 3
        time: 0.41666698
        value: {x: -0.17039666, y: -0.020562751, z: -0.026378755, w: 0.9848078}
        inSlope: {x: -0.0564315, y: -0.00680983, z: -0.008736021, w: -0.009995852}
        outSlope: {x: -0.0564315, y: -0.00680983, z: -0.008736021, w: -0.009995852}
        tangentMode: 0
        weightedMode: 0
        inWeight: {x: 0.33333334, y: 0.33333334, z: 0.33333334, w: 0.33333334}
        outWeight: {x: 0.33333334, y: 0.33333334, z: 0.33333334, w: 0.33333334}
      - serializedVersion: 3
        time: 0.916667
        value: {x: -0.17039666, y: -0.020562751, z: -0.026378755, w: 0.9848078}
        inSlope: {x: 0, y: 0, z: 0, w: 0}
        outSlope: {x: 0, y: 0, z: 0, w: 0}
        tangentMode: 0
        weightedMode: 0
        inWeight: {x: 0.33333334, y: 0.33333334, z: 0.33333334, w: 0.33333334}
        outWeight: {x: 0.33333334, y: 0.33333334, z: 0.33333334, w: 0.33333334}
      - serializedVersion: 3
        time: 1.291667
        value: {x: -0.16856325, y: -0.019985946, z: -0.025638808, w: 0.9851546}
        inSlope: {x: 0.08494989, y: 0.025700532, z: 0.032969777, w: 0.015728448}
        outSlope: {x: 0.08494989, y: 0.025700532, z: 0.032969777, w: 0.015728448}
        tangentMode: 0
        weightedMode: 0
        inWeight: {x: 0.33333334, y: 0.33333334, z: 0.33333334, w: 0.33333334}
        outWeight: {x: 0.33333334, y: 0.33333334, z: 0.33333334, w: 0.33333334}
      - serializedVersion: 3
        time: 1.708334
        value: {x: -0.024457468, y: -4.2406694e-12, z: -2.2114838e-10, w: 0.99970084}
        inSlope: {x: 0.45976794, y: -9.6354355e-11, z: 2.8124336e-10, w: 0.011252318}
        outSlope: {x: 0.45976794, y: -9.6354355e-11, z: 2.8124336e-10, w: 0.011252318}
        tangentMode: 0
        weightedMode: 0
        inWeight: {x: 0.33333334, y: 0.33333334, z: 0.33333334, w: 0.33333334}
        outWeight: {x: 0.33333334, y: 0.33333334, z: 0.33333334, w: 0.33333334}
      - serializedVersion: 3
        time: 2.500001
        value: {x: 0.21600763, y: 0, z: -0, w: 0.9763917}
        inSlope: {x: 0.023070756, y: 7.1926964e-11, z: 2.699754e-10, w: -0.005092582}
        outSlope: {x: 0.023070756, y: 7.1926964e-11, z: 2.699754e-10, w: -0.005092582}
        tangentMode: 0
        weightedMode: 0
        inWeight: {x: 0.33333334, y: 0.33333334, z: 0.33333334, w: 0.33333334}
        outWeight: {x: 0.33333334, y: 0.33333334, z: 0.33333334, w: 0.33333334}
      m_PreInfinity: 2
      m_PostInfinity: 2
      m_RotationOrder: 4
    path: Armature/Bottom/Middle
  - curve:
      serializedVersion: 2
      m_Curve:
      - serializedVersion: 3
        time: 0.0000009536743
        value: {x: -0.00000001848685, y: 5.1241053e-17, z: 8.757027e-25, w: 1}
        inSlope: {x: -0.014656761, y: -2.049682e-17, z: 7.385109e-19, w: -0.0000085832}
        outSlope: {x: -0.014656761, y: -2.049682e-17, z: 7.385109e-19, w: -0.0000085832}
        tangentMode: 0
        weightedMode: 0
        inWeight: {x: 0.33333334, y: 0.33333334, z: 0.33333334, w: 0.33333334}
        outWeight: {x: 0.33333334, y: 0.33333334, z: 0.33333334, w: 0.33333334}
      - serializedVersion: 3
        time: 0.45833397
        value: {x: -0.043619417, y: 4.180703e-17, z: 1.8253355e-18, w: 0.99904823}
        inSlope: {x: 0, y: -2.0476892e-17, z: -8.940406e-19, w: 0}
        outSlope: {x: 0, y: -2.0476892e-17, z: -8.940406e-19, w: 0}
        tangentMode: 0
        weightedMode: 0
        inWeight: {x: 0.33333334, y: 0.33333334, z: 0.33333334, w: 0.33333334}
        outWeight: {x: 0.33333334, y: 0.33333334, z: 0.33333334, w: 0.33333334}
      - serializedVersion: 3
        time: 1.333334
        value: {x: -0.042349864, y: 2.3891037e-17, z: 1.0126907e-18, w: 0.99910283}
        inSlope: {x: 0.032244734, y: -2.0445963e-17, z: -1.6313544e-18, w: 0.0013546841}
        outSlope: {x: 0.032244734, y: -2.0445963e-17, z: -1.6313544e-18, w: 0.0013546841}
        tangentMode: 0
        weightedMode: 0
        inWeight: {x: 0.33333334, y: 0.33333334, z: 0.33333334, w: 0.33333334}
        outWeight: {x: 0.33333334, y: 0.33333334, z: 0.33333334, w: 0.33333334}
      - serializedVersion: 3
        time: 1.916667
        value: {x: 0.08082247, y: 1.1917133e-17, z: -9.663335e-19, w: 0.99672854}
        inSlope: {x: 0.37230575, y: -2.0788273e-17, z: -2.7918413e-18, w: -0.030246815}
        outSlope: {x: 0.37230575, y: -2.0788273e-17, z: -2.7918413e-18, w: -0.030246815}
        tangentMode: 0
        weightedMode: 0
        inWeight: {x: 0.33333334, y: 0.33333334, z: 0.33333334, w: 0.33333334}
        outWeight: {x: 0.33333334, y: 0.33333334, z: 0.33333334, w: 0.33333334}
      - serializedVersion: 3
        time: 2.500001
        value: {x: 0.23411724, y: 0, z: -0, w: 0.9722084}
        inSlope: {x: 0.028605005, y: -1.9932361e-17, z: 4.774065e-18, w: -0.0068692635}
        outSlope: {x: 0.028605005, y: -1.9932361e-17, z: 4.774065e-18, w: -0.0068692635}
        tangentMode: 0
        weightedMode: 0
        inWeight: {x: 0.33333334, y: 0.33333334, z: 0.33333334, w: 0.33333334}
        outWeight: {x: 0.33333334, y: 0.33333334, z: 0.33333334, w: 0.33333334}
      m_PreInfinity: 2
      m_PostInfinity: 2
      m_RotationOrder: 4
    path: Armature/Bottom/Middle/Top
  - curve:
      serializedVersion: 2
      m_Curve:
      - serializedVersion: 3
        time: 0
        value: {x: -0.0011581322, y: 0.0003007038, z: 0.8977827, w: -0.4414627}
        inSlope: {x: -0.07016967, y: 0.018558573, z: -0.06995106, w: -0.17421961}
        outSlope: {x: -0.07016967, y: 0.018558573, z: -0.06995106, w: -0.17421961}
        tangentMode: 0
        weightedMode: 0
        inWeight: {x: 0.33333334, y: 0.33333334, z: 0.33333334, w: 0.33333334}
        outWeight: {x: 0.33333334, y: 0.33333334, z: 0.33333334, w: 0.33333334}
      - serializedVersion: 3
        time: 0.08333397
        value: {x: -0.02136162, y: 0.005798038, z: 0.87169933, w: -0.489541}
        inSlope: {x: -0.4730538, y: 0.12986246, z: -0.65495753, w: -1.1102197}
        outSlope: {x: -0.4730538, y: 0.12986246, z: -0.65495753, w: -1.1102197}
        tangentMode: 0
        weightedMode: 0
        inWeight: {x: 0.33333334, y: 0.33333334, z: 0.33333334, w: 0.33333334}
        outWeight: {x: 0.33333334, y: 0.33333334, z: 0.33333334, w: 0.33333334}
      - serializedVersion: 3
        time: 0.20833397
        value: {x: -0.10659956, y: 0.029866276, z: 0.72542006, w: -0.6793456}
        inSlope: {x: -0.7612543, y: 0.2232764, z: -1.6137348, w: -1.5893419}
        outSlope: {x: -0.7612543, y: 0.2232764, z: -1.6137348, w: -1.5893419}
        tangentMode: 0
        weightedMode: 0
        inWeight: {x: 0.33333334, y: 0.33333334, z: 0.33333334, w: 0.33333334}
        outWeight: {x: 0.33333334, y: 0.33333334, z: 0.33333334, w: 0.33333334}
      - serializedVersion: 3
        time: 0.33333397
        value: {x: -0.18692513, y: 0.05536526, z: 0.51225567, w: -0.8364137}
        inSlope: {x: -0.42747146, y: 0.16096354, z: -1.4628546, w: -0.80966616}
        outSlope: {x: -0.42747146, y: 0.16096354, z: -1.4628546, w: -0.80966616}
        tangentMode: 0
        weightedMode: 0
        inWeight: {x: 0.33333334, y: 0.33333334, z: 0.33333334, w: 0.33333334}
        outWeight: {x: 0.33333334, y: 0.33333334, z: 0.33333334, w: 0.33333334}
      - serializedVersion: 3
        time: 0.45833397
        value: {x: -0.20847277, y: 0.069090866, z: 0.4020824, w: -0.88887304}
        inSlope: {x: -0.01880393, y: 0.07680465, z: -0.4576754, w: -0.1979634}
        outSlope: {x: -0.01880393, y: 0.07680465, z: -0.4576754, w: -0.1979634}
        tangentMode: 0
        weightedMode: 0
        inWeight: {x: 0.33333334, y: 0.33333334, z: 0.33333334, w: 0.33333334}
        outWeight: {x: 0.33333334, y: 0.33333334, z: 0.33333334, w: 0.33333334}
      - serializedVersion: 3
        time: 0.916667
        value: {x: -0.20189528, y: 0.08220099, z: 0.34551477, w: -0.91274357}
        inSlope: {x: -0.016362585, y: -0.03363058, z: 0.020817423, w: 0.008498635}
        outSlope: {x: -0.016362585, y: -0.03363058, z: 0.020817423, w: 0.008498635}
        tangentMode: 0
        weightedMode: 0
        inWeight: {x: 0.33333334, y: 0.33333334, z: 0.33333334, w: 0.33333334}
        outWeight: {x: 0.33333334, y: 0.33333334, z: 0.33333334, w: 0.33333334}
      - serializedVersion: 3
        time: 1.208334
        value: {x: -0.20765051, y: 0.06729536, z: 0.4022066, w: -0.88914704}
        inSlope: {x: 0.0032323946, y: -0.042776167, z: 0.4553938, w: 0.20328343}
        outSlope: {x: 0.0032323946, y: -0.042776167, z: 0.4553938, w: 0.20328343}
        tangentMode: 0
        weightedMode: 0
        inWeight: {x: 0.33333334, y: 0.33333334, z: 0.33333334, w: 0.33333334}
        outWeight: {x: 0.33333334, y: 0.33333334, z: 0.33333334, w: 0.33333334}
      - serializedVersion: 3
        time: 1.333334
        value: {x: -0.18150575, y: 0.077672124, z: 0.5018365, w: -0.84212995}
        inSlope: {x: 0.56092787, y: 0.28714296, z: 1.2415643, w: 0.66062164}
        outSlope: {x: 0.56092787, y: 0.28714296, z: 1.2415643, w: 0.66062164}
        tangentMode: 0
        weightedMode: 0
        inWeight: {x: 0.33333334, y: 0.33333334, z: 0.33333334, w: 0.33333334}
        outWeight: {x: 0.33333334, y: 0.33333334, z: 0.33333334, w: 0.33333334}
      - serializedVersion: 3
        time: 1.458334
        value: {x: -0.07796048, y: 0.12929483, z: 0.67991835, w: -0.7175765}
        inSlope: {x: 0.96051353, y: 0.45169485, z: 1.3631598, w: 1.266867}
        outSlope: {x: 0.96051353, y: 0.45169485, z: 1.3631598, w: 1.266867}
        tangentMode: 0
        weightedMode: 0
        inWeight: {x: 0.33333334, y: 0.33333334, z: 0.33333334, w: 0.33333334}
        outWeight: {x: 0.33333334, y: 0.33333334, z: 0.33333334, w: 0.33333334}
      - serializedVersion: 3
        time: 1.583334
        value: {x: 0.028533539, y: 0.17605878, z: 0.8097745, w: -0.5589762}
        inSlope: {x: 0.5901798, y: 0.24284142, z: 0.6499379, w: 1.024802}
        outSlope: {x: 0.5901798, y: 0.24284142, z: 0.6499379, w: 1.024802}
        tangentMode: 0
        weightedMode: 0
        inWeight: {x: 0.33333334, y: 0.33333334, z: 0.33333334, w: 0.33333334}
        outWeight: {x: 0.33333334, y: 0.33333334, z: 0.33333334, w: 0.33333334}
      - serializedVersion: 3
        time: 1.708334
        value: {x: 0.053593732, y: 0.18851838, z: 0.84835327, w: -0.49181834}
        inSlope: {x: -0.079187684, y: 0.07137679, z: 0.12378693, w: 0.23239519}
        outSlope: {x: -0.079187684, y: 0.07137679, z: 0.12378693, w: 0.23239519}
        tangentMode: 0
        weightedMode: 0
        inWeight: {x: 0.33333334, y: 0.33333334, z: 0.33333334, w: 0.33333334}
        outWeight: {x: 0.33333334, y: 0.33333334, z: 0.33333334, w: 0.33333334}
      - serializedVersion: 3
        time: 2.166667
        value: {x: -0.102237776, y: 0.3158052, z: 0.8450202, w: -0.41923207}
        inSlope: {x: -0.42103946, y: 0.32475033, z: -0.12306951, w: 0.09848854}
        outSlope: {x: -0.42103946, y: 0.32475033, z: -0.12306951, w: 0.09848854}
        tangentMode: 0
        weightedMode: 0
        inWeight: {x: 0.33333334, y: 0.33333334, z: 0.33333334, w: 0.33333334}
        outWeight: {x: 0.33333334, y: 0.33333334, z: 0.33333334, w: 0.33333334}
      - serializedVersion: 3
        time: 2.500001
        value: {x: -0.18532382, y: 0.37981737, z: 0.8145213, w: -0.3974278}
        inSlope: {x: -0.04016774, y: 0.030072698, z: -0.018540718, w: 0.009317566}
        outSlope: {x: -0.04016774, y: 0.030072698, z: -0.018540718, w: 0.009317566}
        tangentMode: 0
        weightedMode: 0
        inWeight: {x: 0.33333334, y: 0.33333334, z: 0.33333334, w: 0.33333334}
        outWeight: {x: 0.33333334, y: 0.33333334, z: 0.33333334, w: 0.33333334}
      m_PreInfinity: 2
      m_PostInfinity: 2
      m_RotationOrder: 4
    path: Armature/Bottom/Middle/Arm1_r
  - curve:
      serializedVersion: 2
      m_Curve:
      - serializedVersion: 3
        time: 0
        value: {x: 0.29388988, y: -0.11213014, z: 0.12424384, w: 0.94115794}
        inSlope: {x: -0.08596635, y: -0.011701465, z: -0.010026813, w: 0.029406548}
        outSlope: {x: -0.08596635, y: -0.011701465, z: -0.010026813, w: 0.029406548}
        tangentMode: 0
        weightedMode: 0
        inWeight: {x: 0.33333334, y: 0.33333334, z: 0.33333334, w: 0.33333334}
        outWeight: {x: 0.33333334, y: 0.33333334, z: 0.33333334, w: 0.33333334}
      - serializedVersion: 3
        time: 0.08333397
        value: {x: 0.26982546, y: -0.11524431, z: 0.121340364, w: 0.948256}
        inSlope: {x: -0.55834115, y: -0.07100683, z: -0.06810935, w: 0.15601468}
        outSlope: {x: -0.55834115, y: -0.07100683, z: -0.06810935, w: 0.15601468}
        tangentMode: 0
        weightedMode: 0
        inWeight: {x: 0.33333334, y: 0.33333334, z: 0.33333334, w: 0.33333334}
        outWeight: {x: 0.33333334, y: 0.33333334, z: 0.33333334, w: 0.33333334}
      - serializedVersion: 3
        time: 0.29166698
        value: {x: 0.0971394, y: -0.13495639, z: 0.0989456, w: 0.9811017}
        inSlope: {x: -0.764218, y: -0.07741378, z: -0.10490957, w: 0.07815295}
        outSlope: {x: -0.764218, y: -0.07741378, z: -0.10490957, w: 0.07815295}
        tangentMode: 0
        weightedMode: 0
        inWeight: {x: 0.33333334, y: 0.33333334, z: 0.33333334, w: 0.33333334}
        outWeight: {x: 0.33333334, y: 0.33333334, z: 0.33333334, w: 0.33333334}
      - serializedVersion: 3
        time: 0.41666698
        value: {x: 0.04181781, y: -0.14030392, z: 0.09120036, w: 0.985012}
        inSlope: {x: -0.08572784, y: -0.007961276, z: -0.0121842995, w: 0.0039539943}
        outSlope: {x: -0.08572784, y: -0.007961276, z: -0.0121842995, w: 0.0039539943}
        tangentMode: 0
        weightedMode: 0
        inWeight: {x: 0.33333334, y: 0.33333334, z: 0.33333334, w: 0.33333334}
        outWeight: {x: 0.33333334, y: 0.33333334, z: 0.33333334, w: 0.33333334}
      - serializedVersion: 3
        time: 0.75000095
        value: {x: 0.041817207, y: -0.14029673, z: 0.091200255, w: 0.98501307}
        inSlope: {x: -0.0000018328514, y: 0.00002163657, z: -0.00000044703756, w: 0.0000028610339}
        outSlope: {x: -0.0000018328514, y: 0.00002163657, z: -0.00000044703756, w: 0.0000028610339}
        tangentMode: 0
        weightedMode: 0
        inWeight: {x: 0.33333334, y: 0.33333334, z: 0.33333334, w: 0.33333334}
        outWeight: {x: 0.33333334, y: 0.33333334, z: 0.33333334, w: 0.33333334}
      - serializedVersion: 3
        time: 1.208334
        value: {x: 0.04181636, y: -0.1402868, z: 0.09120008, w: 0.9850145}
        inSlope: {x: -0.0000005364377, y: 0.000021815134, z: -0.00000017881257, w: 0.0000028610011}
        outSlope: {x: -0.0000005364377, y: 0.000021815134, z: -0.00000017881257, w: 0.0000028610011}
        tangentMode: 0
        weightedMode: 0
        inWeight: {x: 0.33333334, y: 0.33333334, z: 0.33333334, w: 0.33333334}
        outWeight: {x: 0.33333334, y: 0.33333334, z: 0.33333334, w: 0.33333334}
      - serializedVersion: 3
        time: 1.333334
        value: {x: 0.06839956, y: -0.13777024, z: 0.094954915, w: 0.9835265}
        inSlope: {x: 0.57813203, y: 0.05624084, z: 0.08074425, w: -0.042963654}
        outSlope: {x: 0.57813203, y: 0.05624084, z: 0.08074425, w: -0.042963654}
        tangentMode: 0
        weightedMode: 0
        inWeight: {x: 0.33333334, y: 0.33333334, z: 0.33333334, w: 0.33333334}
        outWeight: {x: 0.33333334, y: 0.33333334, z: 0.33333334, w: 0.33333334}
      - serializedVersion: 3
        time: 1.541667
        value: {x: 0.24197257, y: -0.11871339, z: 0.11791069, w: 0.9557476}
        inSlope: {x: 0.74531, y: 0.09159769, z: 0.09279069, w: -0.18614179}
        outSlope: {x: 0.74531, y: 0.09159769, z: 0.09279069, w: -0.18614179}
        tangentMode: 0
        weightedMode: 0
        inWeight: {x: 0.33333334, y: 0.33333334, z: 0.33333334, w: 0.33333334}
        outWeight: {x: 0.33333334, y: 0.33333334, z: 0.33333334, w: 0.33333334}
      - serializedVersion: 3
        time: 1.666667
        value: {x: 0.29533157, y: -0.111892805, z: 0.12439868, w: 0.9406297}
        inSlope: {x: 0.08196777, y: 0.010813401, z: 0.009772956, w: -0.025406271}
        outSlope: {x: 0.08196777, y: 0.010813401, z: 0.009772956, w: -0.025406271}
        tangentMode: 0
        weightedMode: 0
        inWeight: {x: 0.33333334, y: 0.33333334, z: 0.33333334, w: 0.33333334}
        outWeight: {x: 0.33333334, y: 0.33333334, z: 0.33333334, w: 0.33333334}
      - serializedVersion: 3
        time: 2.000001
        value: {x: 0.29533127, y: -0.111885875, z: 0.12439671, w: 0.94063085}
        inSlope: {x: -0.0000010728918, y: 0.000020653086, z: -0.0000059008826, w: 0.0000035763005}
        outSlope: {x: -0.0000010728918, y: 0.000020653086, z: -0.0000059008826, w: 0.0000035763005}
        tangentMode: 0
        weightedMode: 0
        inWeight: {x: 0.33333334, y: 0.33333334, z: 0.33333334, w: 0.33333334}
        outWeight: {x: 0.33333334, y: 0.33333334, z: 0.33333334, w: 0.33333334}
      - serializedVersion: 3
        time: 2.500001
        value: {x: 0.2953308, y: -0.1118755, z: 0.12439374, w: 0.94063264}
        inSlope: {x: -0.0000007152503, y: 0.000020742258, z: -0.000005900815, w: 0.0000028610011}
        outSlope: {x: -0.0000007152503, y: 0.000020742258, z: -0.000005900815, w: 0.0000028610011}
        tangentMode: 0
        weightedMode: 0
        inWeight: {x: 0.33333334, y: 0.33333334, z: 0.33333334, w: 0.33333334}
        outWeight: {x: 0.33333334, y: 0.33333334, z: 0.33333334, w: 0.33333334}
      m_PreInfinity: 2
      m_PostInfinity: 2
      m_RotationOrder: 4
    path: Armature/Bottom/Middle/Arm1_r/Arm2_r
  - curve:
      serializedVersion: 2
      m_Curve:
      - serializedVersion: 3
        time: 0
        value: {x: 0.25044096, y: -0.004013926, z: -0.0052365726, w: 0.9681914}
        inSlope: {x: -0.08861542, y: 0.0004727058, z: -0.0003828965, w: 0.025475502}
        outSlope: {x: -0.08861542, y: 0.0004727058, z: -0.0003828965, w: 0.025475502}
        tangentMode: 0
        weightedMode: 0
        inWeight: {x: 0.33333334, y: 0.33333334, z: 0.33333334, w: 0.33333334}
        outWeight: {x: 0.33333334, y: 0.33333334, z: 0.33333334, w: 0.33333334}
      - serializedVersion: 3
        time: 0.08333397
        value: {x: 0.2257174, y: -0.0038791348, z: -0.0053365445, w: 0.9741705}
        inSlope: {x: -0.5730027, y: 0.0031462854, z: -0.0022643316, w: 0.12990734}
        outSlope: {x: -0.5730027, y: 0.0031462854, z: -0.0022643316, w: 0.12990734}
        tangentMode: 0
        weightedMode: 0
        inWeight: {x: 0.33333334, y: 0.33333334, z: 0.33333334, w: 0.33333334}
        outWeight: {x: 0.33333334, y: 0.33333334, z: 0.33333334, w: 0.33333334}
      - serializedVersion: 3
        time: 0.29166698
        value: {x: 0.04945302, y: -0.0028717, z: -0.005939676, w: 0.9987547}
        inSlope: {x: -0.77738833, y: 0.0046167914, z: -0.0022503017, w: 0.0409752}
        outSlope: {x: -0.77738833, y: 0.0046167914, z: -0.0022503017, w: 0.0409752}
        tangentMode: 0
        weightedMode: 0
        inWeight: {x: 0.33333334, y: 0.33333334, z: 0.33333334, w: 0.33333334}
        outWeight: {x: 0.33333334, y: 0.33333334, z: 0.33333334, w: 0.33333334}
      - serializedVersion: 3
        time: 0.41666698
        value: {x: -0.0071177403, y: -0.0025311431, z: -0.006092597, w: 0.9999529}
        inSlope: {x: -0.09259177, y: 0.0007715832, z: 0.029076105, w: -0.00018025}
        outSlope: {x: -0.09259177, y: 0.0007715832, z: 0.029076105, w: -0.00018025}
        tangentMode: 0
        weightedMode: 0
        inWeight: {x: 0.33333334, y: 0.33333334, z: 0.33333334, w: 0.33333334}
        outWeight: {x: 0.33333334, y: 0.33333334, z: 0.33333334, w: 0.33333334}
      - serializedVersion: 3
        time: 0.70833397
        value: {x: -0.007454315, y: -0.0020371457, z: 0.06233811, w: 0.9980252}
        inSlope: {x: 0.0016672595, y: 0.0018726091, z: 0.25884318, w: -0.015877126}
        outSlope: {x: 0.0016672595, y: 0.0018726091, z: 0.25884318, w: -0.015877126}
        tangentMode: 0
        weightedMode: 0
        inWeight: {x: 0.33333334, y: 0.33333334, z: 0.33333334, w: 0.33333334}
        outWeight: {x: 0.33333334, y: 0.33333334, z: 0.33333334, w: 0.33333334}
      - serializedVersion: 3
        time: 1.000001
        value: {x: -0.00752402, y: -0.0021227044, z: 0.050497416, w: 0.9986936}
        inSlope: {x: -0.0014971178, y: -0.0021424964, z: -0.29700246, w: 0.01484303}
        outSlope: {x: -0.0014971178, y: -0.0021424964, z: -0.29700246, w: 0.01484303}
        tangentMode: 0
        weightedMode: 0
        inWeight: {x: 0.33333334, y: 0.33333334, z: 0.33333334, w: 0.33333334}
        outWeight: {x: 0.33333334, y: 0.33333334, z: 0.33333334, w: 0.33333334}
      - serializedVersion: 3
        time: 1.250001
        value: {x: -0.007117609, y: -0.0025311513, z: -0.0060925633, w: 0.9999529}
        inSlope: {x: 0.09259299, y: -0.0007717927, z: -0.02907473, w: 0.00018025}
        outSlope: {x: 0.09259299, y: -0.0007717927, z: -0.02907473, w: 0.00018025}
        tangentMode: 0
        weightedMode: 0
        inWeight: {x: 0.33333334, y: 0.33333334, z: 0.33333334, w: 0.33333334}
        outWeight: {x: 0.33333334, y: 0.33333334, z: 0.33333334, w: 0.33333334}
      - serializedVersion: 3
        time: 1.500001
        value: {x: 0.16210742, y: -0.0035251281, z: -0.0055766962, w: 0.9867511}
        inSlope: {x: 0.88215744, y: -0.004989366, z: 0.0031425771, w: -0.1434595}
        outSlope: {x: 0.88215744, y: -0.004989366, z: 0.0031425771, w: -0.1434595}
        tangentMode: 0
        weightedMode: 0
        inWeight: {x: 0.33333334, y: 0.33333334, z: 0.33333334, w: 0.33333334}
        outWeight: {x: 0.33333334, y: 0.33333334, z: 0.33333334, w: 0.33333334}
      - serializedVersion: 3
        time: 1.666667
        value: {x: 0.25193167, y: -0.004021781, z: -0.005229853, w: 0.96772254}
        inSlope: {x: 0.06968126, y: -0.00037740555, z: 0.0002876727, w: -0.01782453}
        outSlope: {x: 0.06968126, y: -0.00037740555, z: 0.0002876727, w: -0.01782453}
        tangentMode: 0
        weightedMode: 0
        inWeight: {x: 0.33333334, y: 0.33333334, z: 0.33333334, w: 0.33333334}
        outWeight: {x: 0.33333334, y: 0.33333334, z: 0.33333334, w: 0.33333334}
      - serializedVersion: 3
        time: 2.083334
        value: {x: 0.16663028, y: -0.0035506706, z: -0.005560473, w: 0.9859974}
        inSlope: {x: -0.3094879, y: 0.0017453225, z: -0.0011144996, w: 0.052302677}
        outSlope: {x: -0.3094879, y: 0.0017453225, z: -0.0011144996, w: 0.052302677}
        tangentMode: 0
        weightedMode: 0
        inWeight: {x: 0.33333334, y: 0.33333334, z: 0.33333334, w: 0.33333334}
        outWeight: {x: 0.33333334, y: 0.33333334, z: 0.33333334, w: 0.33333334}
      - serializedVersion: 3
        time: 2.500001
        value: {x: 0.080061026, y: -0.0030525394, z: -0.0058487747, w: 0.9967682}
        inSlope: {x: -0.030116329, y: 0.00017665005, z: -0.00009235669, w: 0.0024390034}
        outSlope: {x: -0.030116329, y: 0.00017665005, z: -0.00009235669, w: 0.0024390034}
        tangentMode: 0
        weightedMode: 0
        inWeight: {x: 0.33333334, y: 0.33333334, z: 0.33333334, w: 0.33333334}
        outWeight: {x: 0.33333334, y: 0.33333334, z: 0.33333334, w: 0.33333334}
      m_PreInfinity: 2
      m_PostInfinity: 2
      m_RotationOrder: 4
    path: Armature/Bottom/Middle/Arm1_r/Arm2_r/Arm3_r
  - curve:
      serializedVersion: 2
      m_Curve:
      - serializedVersion: 3
        time: 0
        value: {x: 0.000123973, y: 0.000107108615, z: 0.8987012, w: 0.43903786}
        inSlope: {x: 0.03093361, y: 0.024497826, z: -0.046291526, w: 0.10408155}
        outSlope: {x: 0.03093361, y: 0.024497826, z: -0.046291526, w: 0.10408155}
        tangentMode: 0
        weightedMode: 0
        inWeight: {x: 0.33333334, y: 0.33333334, z: 0.33333334, w: 0.33333334}
        outWeight: {x: 0.33333334, y: 0.33333334, z: 0.33333334, w: 0.33333334}
      - serializedVersion: 3
        time: 0.041666985
        value: {x: 0.0046604928, y: 0.0036543182, z: 0.8911034, w: 0.45376182}
        inSlope: {x: 0.21180813, y: 0.16512148, z: -0.36356452, w: 0.68156654}
        outSlope: {x: 0.21180813, y: 0.16512148, z: -0.36356452, w: 0.68156654}
        tangentMode: 0
        weightedMode: 0
        inWeight: {x: 0.33333334, y: 0.33333334, z: 0.33333334, w: 0.33333334}
        outWeight: {x: 0.33333334, y: 0.33333334, z: 0.33333334, w: 0.33333334}
      - serializedVersion: 3
        time: 0.16666698
        value: {x: 0.062390197, y: 0.047922656, z: 0.7739398, w: 0.6283535}
        inSlope: {x: 0.6258435, y: 0.47003466, z: -1.5118885, w: 1.7431934}
        outSlope: {x: 0.6258435, y: 0.47003466, z: -1.5118885, w: 1.7431934}
        tangentMode: 0
        weightedMode: 0
        inWeight: {x: 0.33333334, y: 0.33333334, z: 0.33333334, w: 0.33333334}
        outWeight: {x: 0.33333334, y: 0.33333334, z: 0.33333334, w: 0.33333334}
      - serializedVersion: 3
        time: 0.25000095
        value: {x: 0.11639379, y: 0.087518245, z: 0.62519026, w: 0.7667661}
        inSlope: {x: 0.6032945, y: 0.42579713, z: -1.8625107, w: 1.3953736}
        outSlope: {x: 0.6032945, y: 0.42579713, z: -1.8625107, w: 1.3953736}
        tangentMode: 0
        weightedMode: 0
        inWeight: {x: 0.33333334, y: 0.33333334, z: 0.33333334, w: 0.33333334}
        outWeight: {x: 0.33333334, y: 0.33333334, z: 0.33333334, w: 0.33333334}
      - serializedVersion: 3
        time: 0.37500095
        value: {x: 0.17194255, y: 0.12198446, z: 0.4394976, w: 0.87315375}
        inSlope: {x: 0.24722454, y: 0.0895418, z: -0.724784, w: 0.31879026}
        outSlope: {x: 0.24722454, y: 0.0895418, z: -0.724784, w: 0.31879026}
        tangentMode: 0
        weightedMode: 0
        inWeight: {x: 0.33333334, y: 0.33333334, z: 0.33333334, w: 0.33333334}
        outWeight: {x: 0.33333334, y: 0.33333334, z: 0.33333334, w: 0.33333334}
      - serializedVersion: 3
        time: 0.50000095
        value: {x: 0.18583152, y: 0.11846472, z: 0.43085927, w: 0.8750961}
        inSlope: {x: 0.05727832, y: -0.05281486, z: 0.17009671, w: -0.08906989}
        outSlope: {x: 0.05727832, y: -0.05281486, z: 0.17009671, w: -0.08906989}
        tangentMode: 0
        weightedMode: 0
        inWeight: {x: 0.33333334, y: 0.33333334, z: 0.33333334, w: 0.33333334}
        outWeight: {x: 0.33333334, y: 0.33333334, z: 0.33333334, w: 0.33333334}
      - serializedVersion: 3
        time: 0.87500095
        value: {x: 0.18945162, y: 0.10705522, z: 0.49617183, w: 0.8405122}
        inSlope: {x: 0.0019578892, y: 0.010673438, z: -0.09236325, w: 0.052460182}
        outSlope: {x: 0.0019578892, y: 0.010673438, z: -0.09236325, w: 0.052460182}
        tangentMode: 0
        weightedMode: 0
        inWeight: {x: 0.33333334, y: 0.33333334, z: 0.33333334, w: 0.33333334}
        outWeight: {x: 0.33333334, y: 0.33333334, z: 0.33333334, w: 0.33333334}
      - serializedVersion: 3
        time: 1.208334
        value: {x: 0.183036, y: 0.120682344, z: 0.42516232, w: 0.8781632}
        inSlope: {x: -0.07831651, y: 0.053038225, z: -0.09191717, w: 0.05374176}
        outSlope: {x: -0.07831651, y: 0.053038225, z: -0.09191717, w: 0.05374176}
        tangentMode: 0
        weightedMode: 0
        inWeight: {x: 0.33333334, y: 0.33333334, z: 0.33333334, w: 0.33333334}
        outWeight: {x: 0.33333334, y: 0.33333334, z: 0.33333334, w: 0.33333334}
      - serializedVersion: 3
        time: 1.291667
        value: {x: 0.16971497, y: 0.12561697, z: 0.44077516, w: 0.87243026}
        inSlope: {x: -0.3502566, y: 0.0746111, z: 0.7836974, w: -0.35730952}
        outSlope: {x: -0.3502566, y: 0.0746111, z: 0.7836974, w: -0.35730952}
        tangentMode: 0
        weightedMode: 0
        inWeight: {x: 0.33333334, y: 0.33333334, z: 0.33333334, w: 0.33333334}
        outWeight: {x: 0.33333334, y: 0.33333334, z: 0.33333334, w: 0.33333334}
      - serializedVersion: 3
        time: 1.416667
        value: {x: 0.08462533, y: 0.1348618, z: 0.6421838, w: 0.7498339}
        inSlope: {x: -0.9365275, y: 0.03231243, z: 2.0078907, w: -1.6428704}
        outSlope: {x: -0.9365275, y: 0.03231243, z: 2.0078907, w: -1.6428704}
        tangentMode: 0
        weightedMode: 0
        inWeight: {x: 0.33333334, y: 0.33333334, z: 0.33333334, w: 0.33333334}
        outWeight: {x: 0.33333334, y: 0.33333334, z: 0.33333334, w: 0.33333334}
      - serializedVersion: 3
        time: 1.500001
        value: {x: 0.0016836218, y: 0.13336529, z: 0.79957145, w: 0.58557355}
        inSlope: {x: -0.9412685, y: -0.06374209, z: 1.5481402, w: -2.0662842}
        outSlope: {x: -0.9412685, y: -0.06374209, z: 1.5481402, w: -2.0662842}
        tangentMode: 0
        weightedMode: 0
        inWeight: {x: 0.33333334, y: 0.33333334, z: 0.33333334, w: 0.33333334}
        outWeight: {x: 0.33333334, y: 0.33333334, z: 0.33333334, w: 0.33333334}
      - serializedVersion: 3
        time: 1.625001
        value: {x: -0.08210107, y: 0.12297992, z: 0.9125742, w: 0.38123974}
        inSlope: {x: -0.29665872, y: -0.05094564, z: 0.32561308, w: -0.78488183}
        outSlope: {x: -0.29665872, y: -0.05094564, z: 0.32561308, w: -0.78488183}
        tangentMode: 0
        weightedMode: 0
        inWeight: {x: 0.33333334, y: 0.33333334, z: 0.33333334, w: 0.33333334}
        outWeight: {x: 0.33333334, y: 0.33333334, z: 0.33333334, w: 0.33333334}
      - serializedVersion: 3
        time: 1.750001
        value: {x: -0.08098684, y: 0.12932722, z: 0.91801286, w: 0.3660164}
        inSlope: {x: 0.17175117, y: 0.17152274, z: -0.022475615, w: 0.032259967}
        outSlope: {x: 0.17175117, y: 0.17152274, z: -0.022475615, w: 0.032259967}
        tangentMode: 0
        weightedMode: 0
        inWeight: {x: 0.33333334, y: 0.33333334, z: 0.33333334, w: 0.33333334}
        outWeight: {x: 0.33333334, y: 0.33333334, z: 0.33333334, w: 0.33333334}
      - serializedVersion: 3
        time: 2.125001
        value: {x: 0.07018551, y: 0.2753096, z: 0.8756542, w: 0.3905231}
        inSlope: {x: 0.4941421, y: 0.4611578, z: -0.20783916, w: 0.05270663}
        outSlope: {x: 0.4941421, y: 0.4611578, z: -0.20783916, w: 0.05270663}
        tangentMode: 0
        weightedMode: 0
        inWeight: {x: 0.33333334, y: 0.33333334, z: 0.33333334, w: 0.33333334}
        outWeight: {x: 0.33333334, y: 0.33333334, z: 0.33333334, w: 0.33333334}
      - serializedVersion: 3
        time: 2.500001
        value: {x: 0.18532382, y: 0.37981737, z: 0.8145213, w: 0.3974278}
        inSlope: {x: 0.04521848, y: 0.039875202, z: -0.029050605, w: 0.0005779222}
        outSlope: {x: 0.04521848, y: 0.039875202, z: -0.029050605, w: 0.0005779222}
        tangentMode: 0
        weightedMode: 0
        inWeight: {x: 0.33333334, y: 0.33333334, z: 0.33333334, w: 0.33333334}
        outWeight: {x: 0.33333334, y: 0.33333334, z: 0.33333334, w: 0.33333334}
      m_PreInfinity: 2
      m_PostInfinity: 2
      m_RotationOrder: 4
    path: Armature/Bottom/Middle/Arm1_l
  - curve:
      serializedVersion: 2
      m_Curve:
      - serializedVersion: 3
        time: 0
        value: {x: 0.29388523, y: 0.112026215, z: -0.12421428, w: 0.94117564}
        inSlope: {x: -0.08596635, y: 0.011740088, z: 0.010005474, w: 0.029397964}
        outSlope: {x: -0.08596635, y: 0.011740088, z: 0.010005474, w: 0.029397964}
        tangentMode: 0
        weightedMode: 0
        inWeight: {x: 0.33333334, y: 0.33333334, z: 0.33333334, w: 0.33333334}
        outWeight: {x: 0.33333334, y: 0.33333334, z: 0.33333334, w: 0.33333334}
      - serializedVersion: 3
        time: 0.08333397
        value: {x: 0.2698205, y: 0.115143165, z: -0.12131436, w: 0.94827306}
        inSlope: {x: -0.5583483, y: 0.07103374, z: 0.068038985, w: 0.15600538}
        outSlope: {x: -0.5583483, y: 0.07103374, z: 0.068038985, w: 0.15600538}
        tangentMode: 0
        weightedMode: 0
        inWeight: {x: 0.33333334, y: 0.33333334, z: 0.33333334, w: 0.33333334}
        outWeight: {x: 0.33333334, y: 0.33333334, z: 0.33333334, w: 0.33333334}
      - serializedVersion: 3
        time: 0.29166698
        value: {x: 0.097132176, y: 0.1348612, z: -0.09893863, w: 0.9811162}
        inSlope: {x: -0.76422584, y: 0.077451155, z: 0.10483205, w: 0.07814079}
        outSlope: {x: -0.76422584, y: 0.077451155, z: 0.10483205, w: 0.07814079}
        tangentMode: 0
        weightedMode: 0
        inWeight: {x: 0.33333334, y: 0.33333334, z: 0.33333334, w: 0.33333334}
        outWeight: {x: 0.33333334, y: 0.33333334, z: 0.33333334, w: 0.33333334}
      - serializedVersion: 3
        time: 0.41666698
        value: {x: 0.04181024, y: 0.1402139, z: -0.091198854, w: 0.9850253}
        inSlope: {x: -0.085725516, y: 0.00800437, z: 0.012175447, w: 0.0039475565}
        outSlope: {x: -0.085725516, y: 0.00800437, z: 0.012175447, w: 0.0039475565}
        tangentMode: 0
        weightedMode: 0
        inWeight: {x: 0.33333334, y: 0.33333334, z: 0.33333334, w: 0.33333334}
        outWeight: {x: 0.33333334, y: 0.33333334, z: 0.33333334, w: 0.33333334}
      - serializedVersion: 3
        time: 0.75000095
        value: {x: 0.04181085, y: 0.14022109, z: -0.09119897, w: 0.9850242}
        inSlope: {x: 0.0000018328493, y: 0.00002163657, z: -0.00000035762923, w: -0.0000035763005}
        outSlope: {x: 0.0000018328493, y: 0.00002163657, z: -0.00000035762923, w: -0.0000035763005}
        tangentMode: 0
        weightedMode: 0
        inWeight: {x: 0.33333334, y: 0.33333334, z: 0.33333334, w: 0.33333334}
        outWeight: {x: 0.33333334, y: 0.33333334, z: 0.33333334, w: 0.33333334}
      - serializedVersion: 3
        time: 1.208334
        value: {x: 0.04181169, y: 0.14023098, z: -0.091199145, w: 0.9850227}
        inSlope: {x: 0.000003084517, y: 0.000021278696, z: -0.00000044703143, w: -0.0000035762514}
        outSlope: {x: 0.000003084517, y: 0.000021278696, z: -0.00000044703143, w: -0.0000035762514}
        tangentMode: 0
        weightedMode: 0
        inWeight: {x: 0.33333334, y: 0.33333334, z: 0.33333334, w: 0.33333334}
        outWeight: {x: 0.33333334, y: 0.33333334, z: 0.33333334, w: 0.33333334}
      - serializedVersion: 3
        time: 1.333334
        value: {x: 0.068395555, y: 0.13771987, z: -0.09495271, w: 0.9835341}
        inSlope: {x: 0.5781398, y: -0.056196317, z: -0.080716625, w: -0.042967945}
        outSlope: {x: 0.5781398, y: -0.056196317, z: -0.080716625, w: -0.042967945}
        tangentMode: 0
        weightedMode: 0
        inWeight: {x: 0.33333334, y: 0.33333334, z: 0.33333334, w: 0.33333334}
        outWeight: {x: 0.33333334, y: 0.33333334, z: 0.33333334, w: 0.33333334}
      - serializedVersion: 3
        time: 1.541667
        value: {x: 0.24197039, y: 0.118673, z: -0.11790156, w: 0.95575434}
        inSlope: {x: 0.7453179, y: -0.09154861, z: -0.09276852, w: -0.18614751}
        outSlope: {x: 0.7453179, y: -0.09154861, z: -0.09276852, w: -0.18614751}
        tangentMode: 0
        weightedMode: 0
        inWeight: {x: 0.33333334, y: 0.33333334, z: 0.33333334, w: 0.33333334}
        outWeight: {x: 0.33333334, y: 0.33333334, z: 0.33333334, w: 0.33333334}
      - serializedVersion: 3
        time: 1.666667
        value: {x: 0.29533002, y: 0.11185819, z: -0.12438878, w: 0.9406356}
        inSlope: {x: 0.08197099, y: -0.010771022, z: -0.009781808, w: -0.025412709}
        outSlope: {x: 0.08197099, y: -0.010771022, z: -0.009781808, w: -0.025412709}
        tangentMode: 0
        weightedMode: 0
        inWeight: {x: 0.33333334, y: 0.33333334, z: 0.33333334, w: 0.33333334}
        outWeight: {x: 0.33333334, y: 0.33333334, z: 0.33333334, w: 0.33333334}
      - serializedVersion: 3
        time: 2.000001
        value: {x: 0.29533035, y: 0.11186511, z: -0.124390766, w: 0.9406344}
        inSlope: {x: 0.00000071525847, y: 0.000020563682, z: -0.000005811476, w: -0.0000035762841}
        outSlope: {x: 0.00000071525847, y: 0.000020563682, z: -0.000005811476, w: -0.0000035762841}
        tangentMode: 0
        weightedMode: 0
        inWeight: {x: 0.33333334, y: 0.33333334, z: 0.33333334, w: 0.33333334}
        outWeight: {x: 0.33333334, y: 0.33333334, z: 0.33333334, w: 0.33333334}
      - serializedVersion: 3
        time: 2.500001
        value: {x: 0.2953308, y: 0.1118755, z: -0.12439374, w: 0.94063264}
        inSlope: {x: 0.0000007152503, y: 0.00002092107, z: -0.000005900815, w: -0.0000042915017}
        outSlope: {x: 0.0000007152503, y: 0.00002092107, z: -0.000005900815, w: -0.0000042915017}
        tangentMode: 0
        weightedMode: 0
        inWeight: {x: 0.33333334, y: 0.33333334, z: 0.33333334, w: 0.33333334}
        outWeight: {x: 0.33333334, y: 0.33333334, z: 0.33333334, w: 0.33333334}
      m_PreInfinity: 2
      m_PostInfinity: 2
      m_RotationOrder: 4
    path: Armature/Bottom/Middle/Arm1_l/Arm2_l
  - curve:
      serializedVersion: 2
      m_Curve:
      - serializedVersion: 3
        time: 0
        value: {x: 0.25044096, y: 0.004014012, z: 0.0052365665, w: 0.9681914}
        inSlope: {x: -0.088615656, y: -0.0004727021, z: 0.0003828928, w: 0.025475502}
        outSlope: {x: -0.088615656, y: -0.0004727021, z: 0.0003828928, w: 0.025475502}
        tangentMode: 0
        weightedMode: 0
        inWeight: {x: 0.33333334, y: 0.33333334, z: 0.33333334, w: 0.33333334}
        outWeight: {x: 0.33333334, y: 0.33333334, z: 0.33333334, w: 0.33333334}
      - serializedVersion: 3
        time: 0.08333397
        value: {x: 0.22571738, y: 0.0038792216, z: 0.0053365394, w: 0.9741705}
        inSlope: {x: -0.5730026, y: -0.003146277, z: 0.0022643707, w: 0.12990734}
        outSlope: {x: -0.5730026, y: -0.003146277, z: 0.0022643707, w: 0.12990734}
        tangentMode: 0
        weightedMode: 0
        inWeight: {x: 0.33333334, y: 0.33333334, z: 0.33333334, w: 0.33333334}
        outWeight: {x: 0.33333334, y: 0.33333334, z: 0.33333334, w: 0.33333334}
      - serializedVersion: 3
        time: 0.29166698
        value: {x: 0.04945305, y: 0.0028717876, z: 0.0059396843, w: 0.9987547}
        inSlope: {x: -0.77738726, y: -0.0046167914, z: 0.0022503464, w: 0.040974483}
        outSlope: {x: -0.77738726, y: -0.0046167914, z: 0.0022503464, w: 0.040974483}
        tangentMode: 0
        weightedMode: 0
        inWeight: {x: 0.33333334, y: 0.33333334, z: 0.33333334, w: 0.33333334}
        outWeight: {x: 0.33333334, y: 0.33333334, z: 0.33333334, w: 0.33333334}
      - serializedVersion: 3
        time: 0.41666698
        value: {x: -0.0071176924, y: 0.002531231, z: 0.0060926094, w: 0.9999529}
        inSlope: {x: -0.09244333, y: -0.00035453634, z: 0.029547654, w: -0.00053787517}
        outSlope: {x: -0.09244333, y: -0.00035453634, z: 0.029547654, w: -0.00053787517}
        tangentMode: 0
        weightedMode: 0
        inWeight: {x: 0.33333334, y: 0.33333334, z: 0.33333334, w: 0.33333334}
        outWeight: {x: 0.33333334, y: 0.33333334, z: 0.33333334, w: 0.33333334}
      - serializedVersion: 3
        time: 0.70833397
        value: {x: -0.00710787, y: 0.003011161, z: 0.074495636, w: 0.9971915}
        inSlope: {x: 0.0029769554, y: 0.0018101952, z: 0.25861877, w: -0.019029949}
        outSlope: {x: 0.0029769554, y: 0.0018101952, z: 0.25861877, w: -0.019029949}
        tangentMode: 0
        weightedMode: 0
        inWeight: {x: 0.33333334, y: 0.33333334, z: 0.33333334, w: 0.33333334}
        outWeight: {x: 0.33333334, y: 0.33333334, z: 0.33333334, w: 0.33333334}
      - serializedVersion: 3
        time: 1.000001
        value: {x: -0.007237599, y: 0.0029282104, z: 0.062664516, w: 0.99800414}
        inSlope: {x: -0.0030004075, y: -0.002084105, z: -0.29678845, w: 0.018461525}
        outSlope: {x: -0.0030004075, y: -0.002084105, z: -0.29678845, w: 0.018461525}
        tangentMode: 0
        weightedMode: 0
        inWeight: {x: 0.33333334, y: 0.33333334, z: 0.33333334, w: 0.33333334}
        outWeight: {x: 0.33333334, y: 0.33333334, z: 0.33333334, w: 0.33333334}
      - serializedVersion: 3
        time: 1.250001
        value: {x: -0.007117581, y: 0.0025312132, z: 0.0060926154, w: 0.9999529}
        inSlope: {x: 0.09244453, y: 0.0003541815, z: -0.02954752, w: 0.00053787517}
        outSlope: {x: 0.09244453, y: 0.0003541815, z: -0.02954752, w: 0.00053787517}
        tangentMode: 0
        weightedMode: 0
        inWeight: {x: 0.33333334, y: 0.33333334, z: 0.33333334, w: 0.33333334}
        outWeight: {x: 0.33333334, y: 0.33333334, z: 0.33333334, w: 0.33333334}
      - serializedVersion: 3
        time: 1.500001
        value: {x: 0.16210742, y: 0.003525184, z: 0.0055767293, w: 0.9867511}
        inSlope: {x: 0.88215744, y: 0.004989338, z: -0.0031426554, w: -0.1434595}
        outSlope: {x: 0.88215744, y: 0.004989338, z: -0.0031426554, w: -0.1434595}
        tangentMode: 0
        weightedMode: 0
        inWeight: {x: 0.33333334, y: 0.33333334, z: 0.33333334, w: 0.33333334}
        outWeight: {x: 0.33333334, y: 0.33333334, z: 0.33333334, w: 0.33333334}
      - serializedVersion: 3
        time: 1.666667
        value: {x: 0.2519317, y: 0.00402183, z: 0.005229876, w: 0.96772254}
        inSlope: {x: 0.0696809, y: 0.00037734967, z: -0.00028769506, w: -0.017823815}
        outSlope: {x: 0.0696809, y: 0.00037734967, z: -0.00028769506, w: -0.017823815}
        tangentMode: 0
        weightedMode: 0
        inWeight: {x: 0.33333334, y: 0.33333334, z: 0.33333334, w: 0.33333334}
        outWeight: {x: 0.33333334, y: 0.33333334, z: 0.33333334, w: 0.33333334}
      - serializedVersion: 3
        time: 2.083334
        value: {x: 0.1666303, y: 0.003550694, z: 0.0055604866, w: 0.9859974}
        inSlope: {x: -0.3094872, y: -0.0017453784, z: 0.0011144717, w: 0.052302677}
        outSlope: {x: -0.3094872, y: -0.0017453784, z: 0.0011144717, w: 0.052302677}
        tangentMode: 0
        weightedMode: 0
        inWeight: {x: 0.33333334, y: 0.33333334, z: 0.33333334, w: 0.33333334}
        outWeight: {x: 0.33333334, y: 0.33333334, z: 0.33333334, w: 0.33333334}
      - serializedVersion: 3
        time: 2.500001
        value: {x: 0.080061026, y: 0.0030525394, z: 0.0058487747, w: 0.9967682}
        inSlope: {x: -0.030116687, y: -0.00017670593, z: 0.000092323164, w: 0.0024390034}
        outSlope: {x: -0.030116687, y: -0.00017670593, z: 0.000092323164, w: 0.0024390034}
        tangentMode: 0
        weightedMode: 0
        inWeight: {x: 0.33333334, y: 0.33333334, z: 0.33333334, w: 0.33333334}
        outWeight: {x: 0.33333334, y: 0.33333334, z: 0.33333334, w: 0.33333334}
      m_PreInfinity: 2
      m_PostInfinity: 2
      m_RotationOrder: 4
    path: Armature/Bottom/Middle/Arm1_l/Arm2_l/Arm3_l
  m_CompressedRotationCurves: []
  m_EulerCurves: []
  m_PositionCurves:
  - curve:
      serializedVersion: 2
      m_Curve:
      - serializedVersion: 3
        time: 0
        value: {x: -0, y: 0, z: 0}
        inSlope: {x: 0, y: 0, z: 0}
        outSlope: {x: 0, y: 0, z: 0}
        tangentMode: 0
        weightedMode: 0
        inWeight: {x: 0.33333334, y: 0.33333334, z: 0.33333334}
        outWeight: {x: 0.33333334, y: 0.33333334, z: 0.33333334}
      - serializedVersion: 3
        time: 2.5
        value: {x: -0, y: 0, z: 0}
        inSlope: {x: 0, y: 0, z: 0}
        outSlope: {x: 0, y: 0, z: 0}
        tangentMode: 0
        weightedMode: 0
        inWeight: {x: 0.33333334, y: 0.33333334, z: 0.33333334}
        outWeight: {x: 0.33333334, y: 0.33333334, z: 0.33333334}
      m_PreInfinity: 2
      m_PostInfinity: 2
      m_RotationOrder: 4
    path: Armature
  - curve:
      serializedVersion: 2
      m_Curve:
      - serializedVersion: 3
        time: 0
        value: {x: -0, y: 0, z: 0}
        inSlope: {x: 0, y: 0, z: 0}
        outSlope: {x: 0, y: 0, z: 0}
        tangentMode: 0
        weightedMode: 0
        inWeight: {x: 0.33333334, y: 0.33333334, z: 0.33333334}
        outWeight: {x: 0.33333334, y: 0.33333334, z: 0.33333334}
      - serializedVersion: 3
        time: 2.5
        value: {x: -0, y: 0, z: 0}
        inSlope: {x: 0, y: 0, z: 0}
        outSlope: {x: 0, y: 0, z: 0}
        tangentMode: 0
        weightedMode: 0
        inWeight: {x: 0.33333334, y: 0.33333334, z: 0.33333334}
        outWeight: {x: 0.33333334, y: 0.33333334, z: 0.33333334}
      m_PreInfinity: 2
      m_PostInfinity: 2
      m_RotationOrder: 4
    path: Armature/Bottom
  - curve:
      serializedVersion: 2
      m_Curve:
      - serializedVersion: 3
        time: 0
        value: {x: -0, y: 0.01446355, z: 0}
        inSlope: {x: 0, y: 0, z: 0}
        outSlope: {x: 0, y: 0, z: 0}
        tangentMode: 0
        weightedMode: 0
        inWeight: {x: 0.33333334, y: 0.33333334, z: 0.33333334}
        outWeight: {x: 0.33333334, y: 0.33333334, z: 0.33333334}
      - serializedVersion: 3
        time: 2.5
        value: {x: -0, y: 0.01446355, z: 0}
        inSlope: {x: 0, y: 0, z: 0}
        outSlope: {x: 0, y: 0, z: 0}
        tangentMode: 0
        weightedMode: 0
        inWeight: {x: 0.33333334, y: 0.33333334, z: 0.33333334}
        outWeight: {x: 0.33333334, y: 0.33333334, z: 0.33333334}
      m_PreInfinity: 2
      m_PostInfinity: 2
      m_RotationOrder: 4
    path: Armature/Bottom/Middle
  - curve:
      serializedVersion: 2
      m_Curve:
      - serializedVersion: 3
        time: 0
        value: {x: 3.282912e-10, y: 0.011646111, z: -5.5879353e-11}
        inSlope: {x: 0, y: 0, z: 0}
        outSlope: {x: 0, y: 0, z: 0}
        tangentMode: 0
        weightedMode: 0
        inWeight: {x: 0.33333334, y: 0.33333334, z: 0.33333334}
        outWeight: {x: 0.33333334, y: 0.33333334, z: 0.33333334}
      - serializedVersion: 3
        time: 2.5
        value: {x: 3.282912e-10, y: 0.011646111, z: -5.5879353e-11}
        inSlope: {x: 0, y: 0, z: 0}
        outSlope: {x: 0, y: 0, z: 0}
        tangentMode: 0
        weightedMode: 0
        inWeight: {x: 0.33333334, y: 0.33333334, z: 0.33333334}
        outWeight: {x: 0.33333334, y: 0.33333334, z: 0.33333334}
      m_PreInfinity: 2
      m_PostInfinity: 2
      m_RotationOrder: 4
    path: Armature/Bottom/Middle/Top
  - curve:
      serializedVersion: 2
      m_Curve:
      - serializedVersion: 3
        time: 0
        value: {x: 0.008, y: 0.0025256814, z: 0}
        inSlope: {x: 0, y: 0, z: 0}
        outSlope: {x: 0, y: 0, z: 0}
        tangentMode: 0
        weightedMode: 0
        inWeight: {x: 0.33333334, y: 0.33333334, z: 0.33333334}
        outWeight: {x: 0.33333334, y: 0.33333334, z: 0.33333334}
      - serializedVersion: 3
        time: 2.5
        value: {x: 0.008, y: 0.0025256814, z: 0}
        inSlope: {x: 0, y: 0, z: 0}
        outSlope: {x: 0, y: 0, z: 0}
        tangentMode: 0
        weightedMode: 0
        inWeight: {x: 0.33333334, y: 0.33333334, z: 0.33333334}
        outWeight: {x: 0.33333334, y: 0.33333334, z: 0.33333334}
      m_PreInfinity: 2
      m_PostInfinity: 2
      m_RotationOrder: 4
    path: Armature/Bottom/Middle/Arm1_r
  - curve:
      serializedVersion: 2
      m_Curve:
      - serializedVersion: 3
        time: 0
        value: {x: -0.0000000011920929, y: 0.005397758, z: -2.5145708e-10}
        inSlope: {x: 0, y: 0, z: 0}
        outSlope: {x: 0, y: 0, z: 0}
        tangentMode: 0
        weightedMode: 0
        inWeight: {x: 0.33333334, y: 0.33333334, z: 0.33333334}
        outWeight: {x: 0.33333334, y: 0.33333334, z: 0.33333334}
      - serializedVersion: 3
        time: 2.5
        value: {x: -0.0000000011920929, y: 0.005397758, z: -2.5145708e-10}
        inSlope: {x: 0, y: 0, z: 0}
        outSlope: {x: 0, y: 0, z: 0}
        tangentMode: 0
        weightedMode: 0
        inWeight: {x: 0.33333334, y: 0.33333334, z: 0.33333334}
        outWeight: {x: 0.33333334, y: 0.33333334, z: 0.33333334}
      m_PreInfinity: 2
      m_PostInfinity: 2
      m_RotationOrder: 4
    path: Armature/Bottom/Middle/Arm1_r/Arm2_r
  - curve:
      serializedVersion: 2
      m_Curve:
      - serializedVersion: 3
        time: 0
        value: {x: 5.401671e-10, y: 0.0043787244, z: 3.0529917e-10}
        inSlope: {x: 0, y: 0, z: 0}
        outSlope: {x: 0, y: 0, z: 0}
        tangentMode: 0
        weightedMode: 0
        inWeight: {x: 0.33333334, y: 0.33333334, z: 0.33333334}
        outWeight: {x: 0.33333334, y: 0.33333334, z: 0.33333334}
      - serializedVersion: 3
        time: 2.5
        value: {x: 5.401671e-10, y: 0.0043787244, z: 3.0529917e-10}
        inSlope: {x: 0, y: 0, z: 0}
        outSlope: {x: 0, y: 0, z: 0}
        tangentMode: 0
        weightedMode: 0
        inWeight: {x: 0.33333334, y: 0.33333334, z: 0.33333334}
        outWeight: {x: 0.33333334, y: 0.33333334, z: 0.33333334}
      m_PreInfinity: 2
      m_PostInfinity: 2
      m_RotationOrder: 4
    path: Armature/Bottom/Middle/Arm1_r/Arm2_r/Arm3_r
  - curve:
      serializedVersion: 2
      m_Curve:
      - serializedVersion: 3
        time: 0
        value: {x: -0.008, y: 0.002525682, z: 1.11758706e-10}
        inSlope: {x: 0, y: 0, z: 0}
        outSlope: {x: 0, y: 0, z: 0}
        tangentMode: 0
        weightedMode: 0
        inWeight: {x: 0.33333334, y: 0.33333334, z: 0.33333334}
        outWeight: {x: 0.33333334, y: 0.33333334, z: 0.33333334}
      - serializedVersion: 3
        time: 2.5
        value: {x: -0.008, y: 0.002525682, z: 1.11758706e-10}
        inSlope: {x: 0, y: 0, z: 0}
        outSlope: {x: 0, y: 0, z: 0}
        tangentMode: 0
        weightedMode: 0
        inWeight: {x: 0.33333334, y: 0.33333334, z: 0.33333334}
        outWeight: {x: 0.33333334, y: 0.33333334, z: 0.33333334}
      m_PreInfinity: 2
      m_PostInfinity: 2
      m_RotationOrder: 4
    path: Armature/Bottom/Middle/Arm1_l
  - curve:
      serializedVersion: 2
      m_Curve:
      - serializedVersion: 3
        time: 0
        value: {x: 4.4703483e-10, y: 0.005397759, z: -9.3132255e-12}
        inSlope: {x: 0, y: 0, z: 0}
        outSlope: {x: 0, y: 0, z: 0}
        tangentMode: 0
        weightedMode: 0
        inWeight: {x: 0.33333334, y: 0.33333334, z: 0.33333334}
        outWeight: {x: 0.33333334, y: 0.33333334, z: 0.33333334}
      - serializedVersion: 3
        time: 2.5
        value: {x: 4.4703483e-10, y: 0.005397759, z: -9.3132255e-12}
        inSlope: {x: 0, y: 0, z: 0}
        outSlope: {x: 0, y: 0, z: 0}
        tangentMode: 0
        weightedMode: 0
        inWeight: {x: 0.33333334, y: 0.33333334, z: 0.33333334}
        outWeight: {x: 0.33333334, y: 0.33333334, z: 0.33333334}
      m_PreInfinity: 2
      m_PostInfinity: 2
      m_RotationOrder: 4
    path: Armature/Bottom/Middle/Arm1_l/Arm2_l
  - curve:
      serializedVersion: 2
      m_Curve:
      - serializedVersion: 3
        time: 0
        value: {x: 0.0000000017136335, y: 0.0043787253, z: -2.9802322e-10}
        inSlope: {x: 0, y: 0, z: 0}
        outSlope: {x: 0, y: 0, z: 0}
        tangentMode: 0
        weightedMode: 0
        inWeight: {x: 0.33333334, y: 0.33333334, z: 0.33333334}
        outWeight: {x: 0.33333334, y: 0.33333334, z: 0.33333334}
      - serializedVersion: 3
        time: 2.5
        value: {x: 0.0000000017136335, y: 0.0043787253, z: -2.9802322e-10}
        inSlope: {x: 0, y: 0, z: 0}
        outSlope: {x: 0, y: 0, z: 0}
        tangentMode: 0
        weightedMode: 0
        inWeight: {x: 0.33333334, y: 0.33333334, z: 0.33333334}
        outWeight: {x: 0.33333334, y: 0.33333334, z: 0.33333334}
      m_PreInfinity: 2
      m_PostInfinity: 2
      m_RotationOrder: 4
    path: Armature/Bottom/Middle/Arm1_l/Arm2_l/Arm3_l
  m_ScaleCurves:
  - curve:
      serializedVersion: 2
      m_Curve:
      - serializedVersion: 3
        time: 0
        value: {x: 0.9971123, y: 0.9971123, z: 0.9971123}
        inSlope: {x: -0.08311844, y: -0.08311844, z: -0.08311844}
        outSlope: {x: -0.08311844, y: -0.08311844, z: -0.08311844}
        tangentMode: 0
        weightedMode: 0
        inWeight: {x: 0.33333334, y: 0.33333334, z: 0.33333334}
        outWeight: {x: 0.33333334, y: 0.33333334, z: 0.33333334}
      - serializedVersion: 3
        time: 0.16666698
        value: {x: 0.9532903, y: 0.9532903, z: 0.9532903}
        inSlope: {x: -0.49799895, y: -0.49799895, z: -0.49799895}
        outSlope: {x: -0.49799895, y: -0.49799895, z: -0.49799895}
        tangentMode: 0
        weightedMode: 0
        inWeight: {x: 0.33333334, y: 0.33333334, z: 0.33333334}
        outWeight: {x: 0.33333334, y: 0.33333334, z: 0.33333334}
      - serializedVersion: 3
        time: 0.541667
        value: {x: 0.7347646, y: 0.7347646, z: 0.7347646}
        inSlope: {x: -0.4584766, y: -0.4584766, z: -0.4584766}
        outSlope: {x: -0.4584766, y: -0.4584766, z: -0.4584766}
        tangentMode: 0
        weightedMode: 0
        inWeight: {x: 0.33333334, y: 0.33333334, z: 0.33333334}
        outWeight: {x: 0.33333334, y: 0.33333334, z: 0.33333334}
      - serializedVersion: 3
        time: 1.333334
        value: {x: 0.46371594, y: 0.46371594, z: 0.46371594}
        inSlope: {x: -0.45990986, y: -0.45990986, z: -0.45990986}
        outSlope: {x: -0.45990986, y: -0.45990986, z: -0.45990986}
        tangentMode: 0
        weightedMode: 0
        inWeight: {x: 0.33333334, y: 0.33333334, z: 0.33333334}
        outWeight: {x: 0.33333334, y: 0.33333334, z: 0.33333334}
      - serializedVersion: 3
        time: 1.833334
        value: {x: 0.22965151, y: 0.22965151, z: 0.22965151}
        inSlope: {x: -0.37900612, y: -0.37900612, z: -0.37900612}
        outSlope: {x: -0.37900612, y: -0.37900612, z: -0.37900612}
        tangentMode: 0
        weightedMode: 0
        inWeight: {x: 0.33333334, y: 0.33333334, z: 0.33333334}
        outWeight: {x: 0.33333334, y: 0.33333334, z: 0.33333334}
      - serializedVersion: 3
        time: 2.458334
        value: {x: 0.10053064, y: 0.10053064, z: 0.10053064}
        inSlope: {x: -0.025393263, y: -0.025393263, z: -0.025393263}
        outSlope: {x: -0.025393263, y: -0.025393263, z: -0.025393263}
        tangentMode: 0
        weightedMode: 0
        inWeight: {x: 0.33333334, y: 0.33333334, z: 0.33333334}
        outWeight: {x: 0.33333334, y: 0.33333334, z: 0.33333334}
      - serializedVersion: 3
        time: 2.500001
        value: {x: 0.100000024, y: 0.100000024, z: 0.100000024}
        inSlope: {x: -0.012734674, y: -0.012734674, z: -0.012734674}
        outSlope: {x: -0.012734674, y: -0.012734674, z: -0.012734674}
        tangentMode: 0
        weightedMode: 0
        inWeight: {x: 0.33333334, y: 0.33333334, z: 0.33333334}
        outWeight: {x: 0.33333334, y: 0.33333334, z: 0.33333334}
      m_PreInfinity: 2
      m_PostInfinity: 2
      m_RotationOrder: 4
    path: Armature/Bottom
  - curve:
      serializedVersion: 2
      m_Curve:
      - serializedVersion: 3
        time: 0
        value: {x: 1, y: 0.99999994, z: 1}
        inSlope: {x: 0, y: 0, z: 0}
        outSlope: {x: 0, y: 0, z: 0}
        tangentMode: 0
        weightedMode: 0
        inWeight: {x: 0.33333334, y: 0.33333334, z: 0.33333334}
        outWeight: {x: 0.33333334, y: 0.33333334, z: 0.33333334}
      - serializedVersion: 3
        time: 2.500001
        value: {x: 1, y: 0.99999994, z: 1}
        inSlope: {x: 0, y: 0, z: 0}
        outSlope: {x: 0, y: 0, z: 0}
        tangentMode: 0
        weightedMode: 0
        inWeight: {x: 0.33333334, y: 0.33333334, z: 0.33333334}
        outWeight: {x: 0.33333334, y: 0.33333334, z: 0.33333334}
      m_PreInfinity: 2
      m_PostInfinity: 2
      m_RotationOrder: 4
    path: Armature/Bottom/Middle
  - curve:
      serializedVersion: 2
      m_Curve:
      - serializedVersion: 3
        time: 0
        value: {x: 1, y: 1, z: 1.0000001}
        inSlope: {x: 0, y: 0, z: 0}
        outSlope: {x: 0, y: 0, z: 0}
        tangentMode: 0
        weightedMode: 0
        inWeight: {x: 0.33333334, y: 0.33333334, z: 0.33333334}
        outWeight: {x: 0.33333334, y: 0.33333334, z: 0.33333334}
      - serializedVersion: 3
        time: 2.500001
        value: {x: 1, y: 1, z: 1.0000001}
        inSlope: {x: 0, y: 0, z: 0}
        outSlope: {x: 0, y: 0, z: 0}
        tangentMode: 0
        weightedMode: 0
        inWeight: {x: 0.33333334, y: 0.33333334, z: 0.33333334}
        outWeight: {x: 0.33333334, y: 0.33333334, z: 0.33333334}
      m_PreInfinity: 2
      m_PostInfinity: 2
      m_RotationOrder: 4
    path: Armature/Bottom/Middle/Top
  - curve:
      serializedVersion: 2
      m_Curve:
      - serializedVersion: 3
        time: 0
        value: {x: 1.0000002, y: 1.0000001, z: 1}
        inSlope: {x: 0, y: 0, z: 0}
        outSlope: {x: 0, y: 0, z: 0}
        tangentMode: 0
        weightedMode: 0
        inWeight: {x: 0.33333334, y: 0.33333334, z: 0.33333334}
        outWeight: {x: 0.33333334, y: 0.33333334, z: 0.33333334}
      - serializedVersion: 3
        time: 2.500001
        value: {x: 1.0000002, y: 1.0000001, z: 1}
        inSlope: {x: 0, y: 0, z: 0}
        outSlope: {x: 0, y: 0, z: 0}
        tangentMode: 0
        weightedMode: 0
        inWeight: {x: 0.33333334, y: 0.33333334, z: 0.33333334}
        outWeight: {x: 0.33333334, y: 0.33333334, z: 0.33333334}
      m_PreInfinity: 2
      m_PostInfinity: 2
      m_RotationOrder: 4
    path: Armature/Bottom/Middle/Arm1_r
  - curve:
      serializedVersion: 2
      m_Curve:
      - serializedVersion: 3
        time: 0
        value: {x: 1.0000001, y: 1.0000001, z: 1.0000001}
        inSlope: {x: 0, y: 0, z: 0}
        outSlope: {x: 0, y: 0, z: 0}
        tangentMode: 0
        weightedMode: 0
        inWeight: {x: 0.33333334, y: 0.33333334, z: 0.33333334}
        outWeight: {x: 0.33333334, y: 0.33333334, z: 0.33333334}
      - serializedVersion: 3
        time: 2.500001
        value: {x: 1.0000001, y: 1.0000001, z: 1.0000001}
        inSlope: {x: 0, y: 0, z: 0}
        outSlope: {x: 0, y: 0, z: 0}
        tangentMode: 0
        weightedMode: 0
        inWeight: {x: 0.33333334, y: 0.33333334, z: 0.33333334}
        outWeight: {x: 0.33333334, y: 0.33333334, z: 0.33333334}
      m_PreInfinity: 2
      m_PostInfinity: 2
      m_RotationOrder: 4
    path: Armature/Bottom/Middle/Arm1_r/Arm2_r
  - curve:
      serializedVersion: 2
      m_Curve:
      - serializedVersion: 3
        time: 0
        value: {x: 0.9999998, y: 1.0000001, z: 0.9999999}
        inSlope: {x: 0, y: 0, z: 0}
        outSlope: {x: 0, y: 0, z: 0}
        tangentMode: 0
        weightedMode: 0
        inWeight: {x: 0.33333334, y: 0.33333334, z: 0.33333334}
        outWeight: {x: 0.33333334, y: 0.33333334, z: 0.33333334}
      - serializedVersion: 3
        time: 2.500001
        value: {x: 0.9999998, y: 1.0000001, z: 0.9999999}
        inSlope: {x: 0, y: 0, z: 0}
        outSlope: {x: 0, y: 0, z: 0}
        tangentMode: 0
        weightedMode: 0
        inWeight: {x: 0.33333334, y: 0.33333334, z: 0.33333334}
        outWeight: {x: 0.33333334, y: 0.33333334, z: 0.33333334}
      m_PreInfinity: 2
      m_PostInfinity: 2
      m_RotationOrder: 4
    path: Armature/Bottom/Middle/Arm1_r/Arm2_r/Arm3_r
  - curve:
      serializedVersion: 2
      m_Curve:
      - serializedVersion: 3
        time: 0
        value: {x: 1, y: 1, z: 1}
        inSlope: {x: 0, y: 0, z: 0}
        outSlope: {x: 0, y: 0, z: 0}
        tangentMode: 0
        weightedMode: 0
        inWeight: {x: 0.33333334, y: 0.33333334, z: 0.33333334}
        outWeight: {x: 0.33333334, y: 0.33333334, z: 0.33333334}
      - serializedVersion: 3
        time: 2.500001
        value: {x: 1, y: 1, z: 1}
        inSlope: {x: 0, y: 0, z: 0}
        outSlope: {x: 0, y: 0, z: 0}
        tangentMode: 0
        weightedMode: 0
        inWeight: {x: 0.33333334, y: 0.33333334, z: 0.33333334}
        outWeight: {x: 0.33333334, y: 0.33333334, z: 0.33333334}
      m_PreInfinity: 2
      m_PostInfinity: 2
      m_RotationOrder: 4
    path: Armature/Bottom/Middle/Arm1_l/Arm2_l
  - curve:
      serializedVersion: 2
      m_Curve:
      - serializedVersion: 3
        time: 0
        value: {x: 1.0000001, y: 1.0000001, z: 1}
        inSlope: {x: 0, y: 0, z: 0}
        outSlope: {x: 0, y: 0, z: 0}
        tangentMode: 0
        weightedMode: 0
        inWeight: {x: 0.33333334, y: 0.33333334, z: 0.33333334}
        outWeight: {x: 0.33333334, y: 0.33333334, z: 0.33333334}
      - serializedVersion: 3
        time: 2.500001
        value: {x: 1.0000001, y: 1.0000001, z: 1}
        inSlope: {x: 0, y: 0, z: 0}
        outSlope: {x: 0, y: 0, z: 0}
        tangentMode: 0
        weightedMode: 0
        inWeight: {x: 0.33333334, y: 0.33333334, z: 0.33333334}
        outWeight: {x: 0.33333334, y: 0.33333334, z: 0.33333334}
      m_PreInfinity: 2
      m_PostInfinity: 2
      m_RotationOrder: 4
    path: Armature/Bottom/Middle/Arm1_l/Arm2_l/Arm3_l
  m_FloatCurves: []
  m_PPtrCurves: []
  m_SampleRate: 24
  m_WrapMode: 0
  m_Bounds:
    m_Center: {x: 0, y: 0, z: 0}
    m_Extent: {x: 0, y: 0, z: 0}
  m_ClipBindingConstant:
    genericBindings: []
    pptrCurveMapping: []
  m_AnimationClipSettings:
    serializedVersion: 2
    m_AdditiveReferencePoseClip: {fileID: 0}
    m_AdditiveReferencePoseTime: 0
    m_StartTime: 0
    m_StopTime: 2.500001
    m_OrientationOffsetY: 0
    m_Level: 0
    m_CycleOffset: 0
    m_HasAdditiveReferencePose: 0
    m_LoopTime: 0
    m_LoopBlend: 0
    m_LoopBlendOrientation: 0
    m_LoopBlendPositionY: 0
    m_LoopBlendPositionXZ: 0
    m_KeepOriginalOrientation: 0
    m_KeepOriginalPositionY: 1
    m_KeepOriginalPositionXZ: 0
    m_HeightFromFeet: 0
    m_Mirror: 0
  m_EditorCurves: []
  m_EulerEditorCurves: []
  m_HasGenericRootTransform: 0
  m_HasMotionFloatCurves: 0
  m_Events: []
