../Core/Src/main.c:102:5:main	40	static
../Core/Src/main.c:169:6:SystemClock_Config	88	static
../Core/Src/main.c:215:13:MX_GPIO_Init	40	static
../Core/Src/main.c:249:19:HAL_InitTick	16	static
../Core/Src/main.c:256:10:HAL_GetTick	16	static
../Core/Src/main.c:286:13:App_TaskCreate	40	static
../Core/Src/main.c:361:13:StartupTask	24	static
../Core/Src/main.c:399:13:Led_Task	16	static
../Core/Src/main.c:427:13:Switches_Task	16	static
../Core/Src/main.c:483:13:Digital_Clock_Task	16	static
../Core/Src/main.c:539:13:Show_Clock_Task	16	static
../Core/Src/main.c:565:6:UsbPrintf	104	static
../Core/Src/main.c:590:6:Error_Handler	4	static
