MODELDATA
MODELDATA_VERSION "v1998.8"
DESIGN "TP6_Top";

/* port drive, load, max capacitance and max transition in data file */
PORTDATA
P2: MAXTRANS(0.0);
P1: MAXTRANS(0.0);
Prueba2: MAXTRANS(0.0);
fc1: MAXTRANS(0.0);
P3: MAXTRANS(0.0);
CLK: MAXTRANS(0.0);
Reset: MAXTRANS(0.0);
fc3: MAXTRANS(0.0);
fc2: MAXTRANS(0.0);
Pi1: MAXTRANS(0.0);
Pi2: MAXTRANS(0.0);
Pi3: MAXTRANS(0.0);
Pl1: MAXTRANS(0.0);
Pl2: MAXTRANS(0.0);
Pl3: MAXTRANS(0.0);
Display<4>: MAXTRANS(0.0);
Display<5>: MAXTRANS(0.0);
Display<0>: MAXTRANS(0.0);
Display<2>: MAXTRANS(0.0);
Display<3>: MAXTRANS(0.0);
Display<6>: MAXTRANS(0.0);
MB: MAXTRANS(0.0);
MS: MAXTRANS(0.0);
Display<1>: MAXTRANS(0.0);
T: MAXTRANS(0.0);
ENDPORTDATA

/* timing arc data */
TIMINGDATA

ARCDATA
Prueba2_Display<0>_delay:
CELL_RISE(scalar) {
  VALUES("5");
}
CELL_FALL(scalar) {
  VALUES("5");
}
ENDARCDATA

ARCDATA
Prueba2_Display<2>_delay:
CELL_RISE(scalar) {
  VALUES("5");
}
CELL_FALL(scalar) {
  VALUES("5");
}
ENDARCDATA

ARCDATA
Prueba2_Display<3>_delay:
CELL_RISE(scalar) {
  VALUES("5");
}
CELL_FALL(scalar) {
  VALUES("5");
}
ENDARCDATA

ARCDATA
Prueba2_Display<4>_delay:
CELL_RISE(scalar) {
  VALUES("5");
}
CELL_FALL(scalar) {
  VALUES("5");
}
ENDARCDATA

ARCDATA
Prueba2_Display<5>_delay:
CELL_RISE(scalar) {
  VALUES("5");
}
CELL_FALL(scalar) {
  VALUES("5");
}
ENDARCDATA

ARCDATA
Prueba2_Display<6>_delay:
CELL_RISE(scalar) {
  VALUES("5");
}
CELL_FALL(scalar) {
  VALUES("5");
}
ENDARCDATA

ARCDATA
CLK_Pi1_delay:
CELL_RISE(scalar) {
  VALUES("6.9");
}
CELL_FALL(scalar) {
  VALUES("6.9");
}
ENDARCDATA

ARCDATA
CLK_Pi2_delay:
CELL_RISE(scalar) {
  VALUES("6.9");
}
CELL_FALL(scalar) {
  VALUES("6.9");
}
ENDARCDATA

ARCDATA
CLK_Pi3_delay:
CELL_RISE(scalar) {
  VALUES("6.9");
}
CELL_FALL(scalar) {
  VALUES("6.9");
}
ENDARCDATA

ARCDATA
CLK_Pl1_delay:
CELL_RISE(scalar) {
  VALUES("3.5");
}
CELL_FALL(scalar) {
  VALUES("3.5");
}
ENDARCDATA

ARCDATA
CLK_Pl2_delay:
CELL_RISE(scalar) {
  VALUES("3.5");
}
CELL_FALL(scalar) {
  VALUES("3.5");
}
ENDARCDATA

ARCDATA
CLK_Pl3_delay:
CELL_RISE(scalar) {
  VALUES("3.5");
}
CELL_FALL(scalar) {
  VALUES("3.5");
}
ENDARCDATA

ARCDATA
CLK_Display<4>_delay:
CELL_RISE(scalar) {
  VALUES("6.9");
}
CELL_FALL(scalar) {
  VALUES("6.9");
}
ENDARCDATA

ARCDATA
CLK_Display<5>_delay:
CELL_RISE(scalar) {
  VALUES("6.9");
}
CELL_FALL(scalar) {
  VALUES("6.9");
}
ENDARCDATA

ARCDATA
CLK_Display<0>_delay:
CELL_RISE(scalar) {
  VALUES("6.9");
}
CELL_FALL(scalar) {
  VALUES("6.9");
}
ENDARCDATA

ARCDATA
CLK_Display<2>_delay:
CELL_RISE(scalar) {
  VALUES("6.9");
}
CELL_FALL(scalar) {
  VALUES("6.9");
}
ENDARCDATA

ARCDATA
CLK_Display<3>_delay:
CELL_RISE(scalar) {
  VALUES("6.9");
}
CELL_FALL(scalar) {
  VALUES("6.9");
}
ENDARCDATA

ARCDATA
CLK_Display<6>_delay:
CELL_RISE(scalar) {
  VALUES("6.9");
}
CELL_FALL(scalar) {
  VALUES("6.9");
}
ENDARCDATA

ARCDATA
CLK_MB_delay:
CELL_RISE(scalar) {
  VALUES("6.9");
}
CELL_FALL(scalar) {
  VALUES("6.9");
}
ENDARCDATA

ARCDATA
CLK_MS_delay:
CELL_RISE(scalar) {
  VALUES("6.9");
}
CELL_FALL(scalar) {
  VALUES("6.9");
}
ENDARCDATA

ARCDATA
P1_CLK_setup:
CONSTRAINT(scalar) {
  VALUES("6.7");
}
ENDARCDATA

ARCDATA
P2_CLK_setup:
CONSTRAINT(scalar) {
  VALUES("6.7");
}
ENDARCDATA

ARCDATA
P3_CLK_setup:
CONSTRAINT(scalar) {
  VALUES("6.7");
}
ENDARCDATA

ARCDATA
Reset_CLK_setup:
CONSTRAINT(scalar) {
  VALUES("6.7");
}
ENDARCDATA

ARCDATA
fc1_CLK_setup:
CONSTRAINT(scalar) {
  VALUES("6");
}
ENDARCDATA

ARCDATA
fc2_CLK_setup:
CONSTRAINT(scalar) {
  VALUES("6.7");
}
ENDARCDATA

ARCDATA
fc3_CLK_setup:
CONSTRAINT(scalar) {
  VALUES("6");
}
ENDARCDATA

ARCDATA
P1_CLK_hold:
CONSTRAINT(scalar) {
  VALUES("-3");
}
ENDARCDATA

ARCDATA
P2_CLK_hold:
CONSTRAINT(scalar) {
  VALUES("-3");
}
ENDARCDATA

ARCDATA
P3_CLK_hold:
CONSTRAINT(scalar) {
  VALUES("-3");
}
ENDARCDATA

ARCDATA
Reset_CLK_hold:
CONSTRAINT(scalar) {
  VALUES("-3");
}
ENDARCDATA

ARCDATA
fc1_CLK_hold:
CONSTRAINT(scalar) {
  VALUES("-2.3");
}
ENDARCDATA

ARCDATA
fc2_CLK_hold:
CONSTRAINT(scalar) {
  VALUES("-3");
}
ENDARCDATA

ARCDATA
fc3_CLK_hold:
CONSTRAINT(scalar) {
  VALUES("-2.3");
}
ENDARCDATA

ENDTIMINGDATA
ENDMODELDATA
