 
cpldfit:  version P.20131013                        Xilinx Inc.
                                  Fitter Report
Design Name: AscensorTOP                         Date:  6-11-2022, 10:26PM
Device Used: XC9572XL-5-PC44
Fitting Status: Successful

*************************  Mapped Resource Summary  **************************

Macrocells     Product Terms    Function Block   Registers      Pins           
Used/Tot       Used/Tot         Inps Used/Tot    Used/Tot       Used/Tot       
46 /72  ( 64%) 143 /360  ( 40%) 69 /216 ( 32%)   23 /72  ( 32%) 21 /34  ( 62%)

** Function Block Resources **

Function    Mcells      FB Inps     Pterms      IO          
Block       Used/Tot    Used/Tot    Used/Tot    Used/Tot    
FB1           0/18        0/54        0/90       1/ 9
FB2          17/18       20/54       26/90       7/ 9
FB3          17/18       25/54       40/90       7/ 9
FB4          12/18       24/54       77/90       6/ 7
             -----       -----       -----      -----    
             46/72       69/216     143/360     21/34 

* - Resource is exhausted

** Global Control Resources **

Signal 'CLK' mapped onto global clock net GCK2.
Global output enable net(s) unused.
Global set/reset net(s) unused.

** Pin Resources **

Signal Type    Required     Mapped  |  Pin Type            Used    Total 
------------------------------------|------------------------------------
Input         :    9           9    |  I/O              :    17      28
Output        :   11          11    |  GCK/IO           :     1       3
Bidirectional :    0           0    |  GTS/IO           :     2       2
GCK           :    1           1    |  GSR/IO           :     1       1
GTS           :    0           0    |
GSR           :    0           0    |
                 ----        ----
        Total     21          21

** Power Data **

There are 46 macrocells in high performance mode (MCHP).
There are 0 macrocells in low power mode (MCLP).
End of Mapped Resource Summary
**************************  Errors and Warnings  ***************************

WARNING:Cpld - Unable to retrieve the path to the iSE Project Repository. Will
   use the default filename of 'AscensorTOP.ise'.
INFO:Cpld - Inferring BUFG constraint for signal 'CLK' based upon the LOC
   constraint 'P6'. It is recommended that you declare this BUFG explicitedly in
   your design. Note that for certain device families the output of a BUFG
   constraint can not drive a gated clock, and the BUFG constraint will be
   ignored.
*************************  Summary of Mapped Logic  ************************

** 11 Outputs **

Signal                                    Total Total Loc     Pin  Pin     Pin     Pwr  Slew Reg Init
Name                                      Pts   Inps          No.  Type    Use     Mode Rate State
T<0>                                      1     2     FB2_17  44   I/O     O       STD  FAST SET
MS                                        3     4     FB3_8   13   I/O     O       STD  FAST 
MB                                        3     4     FB3_9   14   I/O     O       STD  FAST 
DisplayOUT<6>                             5     10    FB3_11  18   I/O     O       STD  FAST 
DisplayOUT<5>                             4     6     FB3_14  19   I/O     O       STD  FAST 
DisplayOUT<4>                             5     8     FB3_15  20   I/O     O       STD  FAST 
DisplayOUT<2>                             4     7     FB3_16  24   I/O     O       STD  FAST 
DisplayOUT<3>                             1     2     FB3_17  22   I/O     O       STD  FAST 
DisplayOUT<1>                             4     8     FB4_2   25   I/O     O       STD  FAST 
DisplayOUT<0>                             5     9     FB4_5   26   I/O     O       STD  FAST 
T<1>                                      1     2     FB4_11  28   I/O     O       STD  FAST RESET

** 35 Buried Nodes **

Signal                                    Total Total Loc     Pwr  Reg Init
Name                                      Pts   Inps          Mode State
Pisos/puQ<2>                              1     2     FB2_2   STD  RESET
Pisos/puQ<1>                              1     2     FB2_3   STD  RESET
Pisos/puQ<0>                              1     2     FB2_4   STD  RESET
Pisos/Ir/Qus<1>                           1     1     FB2_5   STD  RESET
Pisos/Ir/Qus<0>                           1     2     FB2_6   STD  RESET
Pisos/Arriba/Qus<1>                       1     1     FB2_7   STD  RESET
Pisos/Arriba/Qus<0>                       1     2     FB2_8   STD  RESET
Pisos/Abajo/Qus<1>                        1     1     FB2_9   STD  RESET
Pisos/Abajo/Qus<0>                        1     2     FB2_10  STD  RESET
$OpTx$FX_DC$1                             1     2     FB2_11  STD  
Pisos/puD<2>/Pisos/puD<2>_RSTF            2     5     FB2_12  STD  
Pisos/puD<0>/Pisos/puD<0>_RSTF            2     4     FB2_13  STD  
Pisos/puD<2>                              2     2     FB2_14  STD  RESET
Pisos/puD<1>                              2     2     FB2_15  STD  RESET
Pisos/puD<0>                              2     2     FB2_16  STD  RESET
Pisos/puD<1>/Pisos/puD<1>_RSTF            5     6     FB2_18  STD  
RP<5>/RP<5>_SETF                          1     5     FB3_2   STD  
RP<4>/RP<4>_SETF                          1     5     FB3_3   STD  
RP<3>/RP<3>_SETF                          1     5     FB3_4   STD  
RP<2>/RP<2>_SETF                          1     5     FB3_5   STD  
RP<1>/RP<1>_SETF                          1     5     FB3_6   STD  
RP<5>                                     2     6     FB3_7   STD  RESET
RP<4>                                     2     6     FB3_10  STD  RESET
RP<3>                                     2     6     FB3_12  STD  RESET
RP<2>                                     2     6     FB3_13  STD  RESET
RP<1>                                     2     6     FB3_18  STD  RESET
Asc/AMS_and0001/Asc/AMS_and0001_D214_     1     4     FB4_3   STD  
Asc/AMB_and0002/Asc/AMB_and0002_D212_     1     2     FB4_6   STD  
Pisos/MPi/D_or0003/Pisos/MPi/D_or0003_D2  6     6     FB4_7   STD  
Asc/AQ<2>                                 12    13    FB4_9   STD  RESET
Asc/AMS_and0002/Asc/AMS_and0002_D210_     1     2     FB4_10  STD  
Asc/AMB_and0001/Asc/AMB_and0001_D213_     1     2     FB4_12  STD  
Asc/AQ<0>                                 15    14    FB4_13  STD  RESET
Asc/AQ<3>                                 17    15    FB4_16  STD  RESET
Asc/AQ<1>                                 13    12    FB4_18  STD  RESET

** 10 Inputs **

Signal                                    Loc     Pin  Pin     Pin     
Name                                              No.  Type    Use     
CLK                                       FB1_11  6    GCK/I/O GCK
Reset                                     FB2_2   35   I/O     I
fc<1>                                     FB2_6   37   I/O     I
fc<2>                                     FB2_8   38   I/O     I
fc<3>                                     FB2_9   39   GSR/I/O I
fc<4>                                     FB2_11  40   GTS/I/O I
fc<5>                                     FB2_14  42   GTS/I/O I
Abajo                                     FB4_8   27   I/O     I
Arriba                                    FB4_15  33   I/O     I
Ir                                        FB4_17  34   I/O     I

Legend:
Pin No. - ~ - User Assigned
**************************  Function Block Details  ************************
Legend:
Total Pt     - Total product terms used by the macrocell signal
Imp Pt       - Product terms imported from other macrocells
Exp Pt       - Product terms exported to other macrocells
               in direction shown
Unused Pt    - Unused local product terms remaining in macrocell
Loc          - Location where logic was mapped in device
Pin Type/Use - I  - Input             GCK - Global Clock
               O  - Output            GTS - Global Output Enable
              (b) - Buried macrocell  GSR - Global Set/Reset
X            - Signal used as input to the macrocell logic.
Pin No.      - ~  - User Assigned
*********************************** FB1  ***********************************
Number of function block inputs used/remaining:               0/54
Number of signals used by logic mapping into function block:  0
Signal              Total   Imp   Exp Unused  Loc     Pin   Pin     Pin
Name                Pt      Pt    Pt  Pt               #    Type    Use
(unused)              0       0     0   5     FB1_1         (b)     
(unused)              0       0     0   5     FB1_2   1     I/O     
(unused)              0       0     0   5     FB1_3         (b)     
(unused)              0       0     0   5     FB1_4         (b)     
(unused)              0       0     0   5     FB1_5   2     I/O     
(unused)              0       0     0   5     FB1_6   3     I/O     
(unused)              0       0     0   5     FB1_7         (b)     
(unused)              0       0     0   5     FB1_8   4     I/O     
(unused)              0       0     0   5     FB1_9   5     GCK/I/O 
(unused)              0       0     0   5     FB1_10        (b)     
(unused)              0       0     0   5     FB1_11  6     GCK/I/O GCK
(unused)              0       0     0   5     FB1_12        (b)     
(unused)              0       0     0   5     FB1_13        (b)     
(unused)              0       0     0   5     FB1_14  7     GCK/I/O 
(unused)              0       0     0   5     FB1_15  8     I/O     
(unused)              0       0     0   5     FB1_16        (b)     
(unused)              0       0     0   5     FB1_17  9     I/O     
(unused)              0       0     0   5     FB1_18        (b)     
*********************************** FB2  ***********************************
Number of function block inputs used/remaining:               20/34
Number of signals used by logic mapping into function block:  20
Signal              Total   Imp   Exp Unused  Loc     Pin   Pin     Pin
Name                Pt      Pt    Pt  Pt               #    Type    Use
(unused)              0       0     0   5     FB2_1         (b)     
Pisos/puQ<2>          1       0     0   4     FB2_2   35    I/O     I
Pisos/puQ<1>          1       0     0   4     FB2_3         (b)     (b)
Pisos/puQ<0>          1       0     0   4     FB2_4         (b)     (b)
Pisos/Ir/Qus<1>       1       0     0   4     FB2_5   36    I/O     (b)
Pisos/Ir/Qus<0>       1       0     0   4     FB2_6   37    I/O     I
Pisos/Arriba/Qus<1>   1       0     0   4     FB2_7         (b)     (b)
Pisos/Arriba/Qus<0>   1       0     0   4     FB2_8   38    I/O     I
Pisos/Abajo/Qus<1>    1       0     0   4     FB2_9   39    GSR/I/O I
Pisos/Abajo/Qus<0>    1       0     0   4     FB2_10        (b)     (b)
$OpTx$FX_DC$1         1       0     0   4     FB2_11  40    GTS/I/O I
Pisos/puD<2>/Pisos/puD<2>_RSTF
                      2       0     0   3     FB2_12        (b)     (b)
Pisos/puD<0>/Pisos/puD<0>_RSTF
                      2       0     0   3     FB2_13        (b)     (b)
Pisos/puD<2>          2       0     0   3     FB2_14  42    GTS/I/O I
Pisos/puD<1>          2       0     0   3     FB2_15  43    I/O     (b)
Pisos/puD<0>          2       0     0   3     FB2_16        (b)     (b)
T<0>                  1       0     0   4     FB2_17  44    I/O     O
Pisos/puD<1>/Pisos/puD<1>_RSTF
                      5       0     0   0     FB2_18        (b)     (b)

Signals Used by Logic in Function Block
  1: $OpTx$FX_DC$1         8: Pisos/Ir/Qus<1>                           15: Pisos/puD<2>/Pisos/puD<2>_RSTF 
  2: Abajo                 9: Pisos/MPi/D_or0003/Pisos/MPi/D_or0003_D2  16: Pisos/puQ<0> 
  3: Arriba               10: Pisos/puD<0>                              17: Pisos/puQ<1> 
  4: Ir                   11: Pisos/puD<0>/Pisos/puD<0>_RSTF            18: Pisos/puQ<2> 
  5: Pisos/Abajo/Qus<0>   12: Pisos/puD<1>                              19: Reset 
  6: Pisos/Abajo/Qus<1>   13: Pisos/puD<1>/Pisos/puD<1>_RSTF            20: T<1> 
  7: Pisos/Arriba/Qus<1>  14: Pisos/puD<2>                             

Signal                        1         2         3         4 FB
Name                0----+----0----+----0----+----0----+----0 Inputs
Pisos/puQ<2>         .............X....X..................... 2
Pisos/puQ<1>         ...........X......X..................... 2
Pisos/puQ<0>         .........X........X..................... 2
Pisos/Ir/Qus<1>      ...X.................................... 1
Pisos/Ir/Qus<0>      ...X...X................................ 2
Pisos/Arriba/Qus<1>  ..X..................................... 1
Pisos/Arriba/Qus<0>  ..X...X................................. 2
Pisos/Abajo/Qus<1>   .X...................................... 1
Pisos/Abajo/Qus<0>   .X...X.................................. 2
$OpTx$FX_DC$1        ....XX.................................. 2
Pisos/puD<2>/Pisos/puD<2>_RSTF 
                     X.......X......XXX...................... 5
Pisos/puD<0>/Pisos/puD<0>_RSTF 
                     ........X......XXX...................... 4
Pisos/puD<2>         ..........X...X......................... 2
Pisos/puD<1>         ............X.X......................... 2
Pisos/puD<0>         ........X.X............................. 2
T<0>                 ..................XX.................... 2
Pisos/puD<1>/Pisos/puD<1>_RSTF 
                     X.......X.X...X.XX...................... 6
                    0----+----1----+----2----+----3----+----4
                              0         0         0         0
*********************************** FB3  ***********************************
Number of function block inputs used/remaining:               25/29
Number of signals used by logic mapping into function block:  25
Signal              Total   Imp   Exp Unused  Loc     Pin   Pin     Pin
Name                Pt      Pt    Pt  Pt               #    Type    Use
(unused)              0       0     0   5     FB3_1         (b)     
RP<5>/RP<5>_SETF      1       0     0   4     FB3_2   11    I/O     (b)
RP<4>/RP<4>_SETF      1       0     0   4     FB3_3         (b)     (b)
RP<3>/RP<3>_SETF      1       0     0   4     FB3_4         (b)     (b)
RP<2>/RP<2>_SETF      1       0     0   4     FB3_5   12    I/O     (b)
RP<1>/RP<1>_SETF      1       0     0   4     FB3_6         (b)     (b)
RP<5>                 2       0     0   3     FB3_7         (b)     (b)
MS                    3       0     0   2     FB3_8   13    I/O     O
MB                    3       0     0   2     FB3_9   14    I/O     O
RP<4>                 2       0     0   3     FB3_10        (b)     (b)
DisplayOUT<6>         5       0     0   0     FB3_11  18    I/O     O
RP<3>                 2       0     0   3     FB3_12        (b)     (b)
RP<2>                 2       0     0   3     FB3_13        (b)     (b)
DisplayOUT<5>         4       0     0   1     FB3_14  19    I/O     O
DisplayOUT<4>         5       0     0   0     FB3_15  20    I/O     O
DisplayOUT<2>         4       0     0   1     FB3_16  24    I/O     O
DisplayOUT<3>         1       0     0   4     FB3_17  22    I/O     O
RP<1>                 2       0     0   3     FB3_18        (b)     (b)

Signals Used by Logic in Function Block
  1: Asc/AMB_and0001/Asc/AMB_and0001_D213_  10: DisplayOUT<1>     18: Pisos/puQ<1> 
  2: Asc/AMB_and0002/Asc/AMB_and0002_D212_  11: DisplayOUT<2>     19: Pisos/puQ<2> 
  3: Asc/AMS_and0001/Asc/AMS_and0001_D214_  12: DisplayOUT<4>     20: RP<1>/RP<1>_SETF 
  4: Asc/AMS_and0002/Asc/AMS_and0002_D210_  13: DisplayOUT<5>     21: RP<2>/RP<2>_SETF 
  5: Asc/AQ<0>                              14: DisplayOUT<6>     22: RP<3>/RP<3>_SETF 
  6: Asc/AQ<1>                              15: Pisos/Ir/Qus<0>   23: RP<4>/RP<4>_SETF 
  7: Asc/AQ<2>                              16: Pisos/Ir/Qus<1>   24: RP<5>/RP<5>_SETF 
  8: Asc/AQ<3>                              17: Pisos/puQ<0>      25: T<1> 
  9: DisplayOUT<0>                         

Signal                        1         2         3         4 FB
Name                0----+----0----+----0----+----0----+----0 Inputs
RP<5>/RP<5>_SETF     ..............XXXX.X.................... 5
RP<4>/RP<4>_SETF     ..............XXXXX..................... 5
RP<3>/RP<3>_SETF     ..............XXX.XX.................... 5
RP<2>/RP<2>_SETF     ..............XXXXX..................... 5
RP<1>/RP<1>_SETF     ..............XX.XX.X................... 5
RP<5>                ..............XXXX.X...X................ 6
MS                   ..XX.XX................................. 4
MB                   XX...X.X................................ 4
RP<4>                ..............XXXXX...X................. 6
DisplayOUT<6>        ....XXXXXXXX....X.......X............... 10
RP<3>                ..............XXX.XX.X.................. 6
RP<2>                ..............XXXXX.X................... 6
DisplayOUT<5>        ....XXXX..........X.....X............... 6
DisplayOUT<4>        ....XXXX.X..X...X.......X............... 8
DisplayOUT<2>        .....XXXX..XX...........X............... 7
DisplayOUT<3>        ..........X..X.......................... 2
RP<1>                ..............XX.XXXX................... 6
                    0----+----1----+----2----+----3----+----4
                              0         0         0         0
*********************************** FB4  ***********************************
Number of function block inputs used/remaining:               24/30
Number of signals used by logic mapping into function block:  24
Signal              Total   Imp   Exp Unused  Loc     Pin   Pin     Pin
Name                Pt      Pt    Pt  Pt               #    Type    Use
(unused)              0       0   /\5   0     FB4_1         (b)     (b)
DisplayOUT<1>         4       4<- /\5   0     FB4_2   25    I/O     O
Asc/AMS_and0001/Asc/AMS_and0001_D214_
                      1       0   /\4   0     FB4_3         (b)     (b)
(unused)              0       0     0   5     FB4_4         (b)     
DisplayOUT<0>         5       0     0   0     FB4_5   26    I/O     O
Asc/AMB_and0002/Asc/AMB_and0002_D212_
                      1       0   \/1   3     FB4_6         (b)     (b)
Pisos/MPi/D_or0003/Pisos/MPi/D_or0003_D2
                      6       1<-   0   0     FB4_7         (b)     (b)
(unused)              0       0   \/5   0     FB4_8   27    I/O     I
Asc/AQ<2>            12       7<-   0   0     FB4_9         (b)     (b)
Asc/AMS_and0002/Asc/AMS_and0002_D210_
                      1       0   /\2   2     FB4_10        (b)     (b)
T<1>                  1       0   \/1   3     FB4_11  28    I/O     O
Asc/AMB_and0001/Asc/AMB_and0001_D213_
                      1       1<- \/5   0     FB4_12        (b)     (b)
Asc/AQ<0>            15      10<-   0   0     FB4_13        (b)     (b)
(unused)              0       0   /\5   0     FB4_14  29    I/O     (b)
(unused)              0       0   \/5   0     FB4_15  33    I/O     I
Asc/AQ<3>            17      12<-   0   0     FB4_16        (b)     (b)
(unused)              0       0   /\5   0     FB4_17  34    I/O     I
Asc/AQ<1>            13      10<- /\2   0     FB4_18        (b)     (b)

Signals Used by Logic in Function Block
  1: $OpTx$FX_DC$1         9: Pisos/Arriba/Qus<1>  17: RP<5> 
  2: Asc/AQ<0>            10: Pisos/puQ<0>         18: Reset 
  3: Asc/AQ<1>            11: Pisos/puQ<1>         19: T<1> 
  4: Asc/AQ<2>            12: Pisos/puQ<2>         20: fc<1> 
  5: Asc/AQ<3>            13: RP<1>                21: fc<2> 
  6: DisplayOUT<1>        14: RP<2>                22: fc<3> 
  7: DisplayOUT<5>        15: RP<3>                23: fc<4> 
  8: Pisos/Arriba/Qus<0>  16: RP<4>                24: fc<5> 

Signal                        1         2         3         4 FB
Name                0----+----0----+----0----+----0----+----0 Inputs
DisplayOUT<1>        .XXXX.X..XX.......X..................... 8
Asc/AMS_and0001/Asc/AMS_and0001_D214_ 
                     .XXXX................................... 4
DisplayOUT<0>        .XXXXXX..XX.......X..................... 9
Asc/AMB_and0002/Asc/AMB_and0002_D212_ 
                     .X..X................................... 2
Pisos/MPi/D_or0003/Pisos/MPi/D_or0003_D2 
                     X......XXXXX............................ 6
Asc/AQ<2>            .XXXX.......XXXX.X..XXXX................ 13
Asc/AMS_and0002/Asc/AMS_and0002_D210_ 
                     .X.X.................................... 2
T<1>                 .................XX..................... 2
Asc/AMB_and0001/Asc/AMB_and0001_D213_ 
                     ...XX................................... 2
Asc/AQ<0>            .XXXX.......XXXXXX.XXXX................. 14
Asc/AQ<3>            .XXXX.......XXXXXX.XXXXX................ 15
Asc/AQ<1>            .XXXX.......XXXXXX..X.X................. 12
                    0----+----1----+----2----+----3----+----4
                              0         0         0         0
*******************************  Equations  ********************************

********** Mapped Logic **********


$OpTx$FX_DC$1 <= (Pisos/Abajo/Qus(1) AND NOT Pisos/Abajo/Qus(0));


Asc/AMB_and0001/Asc/AMB_and0001_D213_ <= (Asc/AQ(3) AND Asc/AQ(2));


Asc/AMB_and0002/Asc/AMB_and0002_D212_ <= (Asc/AQ(3) AND Asc/AQ(0));


Asc/AMS_and0001/Asc/AMS_and0001_D214_ <= (Asc/AQ(3) AND NOT Asc/AQ(2) AND NOT Asc/AQ(1) AND NOT Asc/AQ(0));


Asc/AMS_and0002/Asc/AMS_and0002_D210_ <= (Asc/AQ(2) AND Asc/AQ(0));

FDCPE_Asc/AQ0: FDCPE port map (Asc/AQ(0),Asc/AQ_D(0),CLK,'0','0');
Asc/AQ_D(0) <= ((NOT Reset AND NOT Asc/AQ(3) AND Asc/AQ(2) AND Asc/AQ(0))
	OR (NOT Reset AND NOT Asc/AQ(3) AND Asc/AQ(2) AND NOT Asc/AQ(1) AND 
	RP(1))
	OR (NOT Reset AND NOT Asc/AQ(3) AND NOT Asc/AQ(2) AND Asc/AQ(1) AND 
	RP(1))
	OR (NOT Reset AND NOT Asc/AQ(3) AND Asc/AQ(2) AND NOT Asc/AQ(1) AND 
	NOT RP(2) AND RP(3))
	OR (NOT Reset AND NOT Asc/AQ(3) AND Asc/AQ(1) AND Asc/AQ(0) AND 
	NOT RP(2) AND RP(3))
	OR (NOT Reset AND Asc/AQ(3) AND Asc/AQ(2) AND NOT Asc/AQ(1) AND 
	NOT Asc/AQ(0) AND fc(4))
	OR (NOT Reset AND Asc/AQ(3) AND NOT Asc/AQ(2) AND Asc/AQ(1) AND 
	Asc/AQ(0) AND NOT fc(3))
	OR (NOT Reset AND Asc/AQ(3) AND NOT Asc/AQ(2) AND Asc/AQ(1) AND 
	NOT Asc/AQ(0) AND fc(2))
	OR (NOT Reset AND Asc/AQ(3) AND NOT Asc/AQ(2) AND NOT Asc/AQ(1) AND 
	Asc/AQ(0) AND NOT fc(1))
	OR (NOT Reset AND NOT Asc/AQ(3) AND NOT Asc/AQ(2) AND NOT Asc/AQ(1) AND 
	NOT Asc/AQ(0) AND RP(2))
	OR (NOT Reset AND NOT Asc/AQ(3) AND Asc/AQ(0) AND RP(1))
	OR (NOT Reset AND NOT Asc/AQ(3) AND NOT Asc/AQ(2) AND NOT Asc/AQ(1) AND 
	NOT RP(3) AND RP(4))
	OR (NOT Reset AND NOT Asc/AQ(3) AND NOT Asc/AQ(1) AND Asc/AQ(0) AND 
	NOT RP(3) AND NOT RP(5))
	OR (NOT Reset AND NOT Asc/AQ(3) AND Asc/AQ(0) AND NOT RP(2) AND NOT RP(3) AND 
	NOT RP(5))
	OR (NOT Reset AND NOT Asc/AQ(3) AND NOT Asc/AQ(2) AND Asc/AQ(1) AND 
	NOT Asc/AQ(0) AND NOT RP(2) AND RP(4)));

FDCPE_Asc/AQ1: FDCPE port map (Asc/AQ(1),Asc/AQ_D(1),CLK,'0','0');
Asc/AQ_D(1) <= ((DisplayOUT_1_OBUF.EXP)
	OR (NOT Reset AND NOT Asc/AQ(3) AND Asc/AQ(2) AND Asc/AQ(1))
	OR (NOT Reset AND NOT Asc/AQ(3) AND Asc/AQ(1) AND NOT RP(1) AND RP(2))
	OR (NOT Reset AND NOT Asc/AQ(3) AND Asc/AQ(1) AND NOT RP(1) AND NOT RP(5))
	OR (NOT Reset AND NOT Asc/AQ(3) AND Asc/AQ(2) AND NOT Asc/AQ(0) AND 
	NOT RP(1) AND RP(2))
	OR (NOT Reset AND NOT Asc/AQ(3) AND Asc/AQ(1) AND NOT Asc/AQ(0) AND 
	NOT RP(1) AND RP(4))
	OR (NOT Reset AND NOT Asc/AQ(3) AND Asc/AQ(2) AND NOT Asc/AQ(0) AND 
	NOT RP(1) AND RP(3))
	OR (NOT Reset AND NOT Asc/AQ(3) AND NOT Asc/AQ(2) AND NOT Asc/AQ(1) AND 
	NOT Asc/AQ(0) AND NOT RP(2) AND RP(3))
	OR (NOT Reset AND NOT Asc/AQ(3) AND NOT Asc/AQ(2) AND NOT Asc/AQ(1) AND 
	NOT Asc/AQ(0) AND NOT RP(2) AND RP(4)));

FDCPE_Asc/AQ2: FDCPE port map (Asc/AQ(2),Asc/AQ_D(2),CLK,'0','0');
Asc/AQ_D(2) <= ((NOT Reset AND Asc/AQ(3) AND Asc/AQ(2) AND NOT Asc/AQ(1) AND 
	NOT Asc/AQ(0) AND NOT fc(4))
	OR (NOT Reset AND Asc/AQ(3) AND NOT Asc/AQ(2) AND NOT Asc/AQ(1) AND 
	NOT Asc/AQ(0) AND fc(5))
	OR (NOT Reset AND NOT Asc/AQ(3) AND Asc/AQ(2) AND NOT Asc/AQ(1) AND 
	Asc/AQ(0) AND NOT fc(2))
	OR (NOT Reset AND NOT Asc/AQ(3) AND NOT Asc/AQ(2) AND NOT Asc/AQ(1) AND 
	NOT RP(1) AND RP(3))
	OR (NOT Reset AND NOT Asc/AQ(3) AND Asc/AQ(2) AND NOT Asc/AQ(1) AND 
	NOT Asc/AQ(0) AND NOT RP(1) AND NOT RP(2) AND NOT RP(3))
	OR (NOT Reset AND NOT Asc/AQ(3) AND Asc/AQ(2) AND Asc/AQ(1) AND 
	Asc/AQ(0) AND NOT fc(4))
	OR (NOT Reset AND NOT Asc/AQ(3) AND Asc/AQ(2) AND Asc/AQ(1) AND 
	NOT Asc/AQ(0) AND NOT fc(3))
	OR (NOT Reset AND NOT Asc/AQ(3) AND NOT Asc/AQ(2) AND NOT Asc/AQ(1) AND 
	NOT Asc/AQ(0) AND RP(2))
	OR (NOT Reset AND NOT Asc/AQ(3) AND NOT Asc/AQ(2) AND NOT Asc/AQ(1) AND 
	NOT Asc/AQ(0) AND RP(3))
	OR (NOT Reset AND NOT Asc/AQ(3) AND NOT Asc/AQ(2) AND NOT Asc/AQ(1) AND 
	NOT Asc/AQ(0) AND RP(4))
	OR (NOT Reset AND NOT Asc/AQ(3) AND NOT Asc/AQ(2) AND NOT Asc/AQ(1) AND 
	NOT RP(1) AND RP(4))
	OR (NOT Reset AND NOT Asc/AQ(3) AND NOT Asc/AQ(2) AND NOT Asc/AQ(0) AND 
	NOT RP(1) AND NOT RP(2) AND RP(4)));

FDCPE_Asc/AQ3: FDCPE port map (Asc/AQ(3),Asc/AQ_D(3),CLK,'0','0');
Asc/AQ_D(3) <= ((NOT Reset AND NOT Asc/AQ(3) AND NOT Asc/AQ(2) AND Asc/AQ(0) AND 
	RP(1))
	OR (NOT Reset AND Asc/AQ(3) AND NOT Asc/AQ(2) AND NOT Asc/AQ(1) AND 
	NOT Asc/AQ(0) AND NOT fc(5))
	OR (NOT Reset AND NOT Asc/AQ(3) AND Asc/AQ(2) AND NOT Asc/AQ(1) AND 
	NOT Asc/AQ(0) AND RP(1))
	OR (NOT Reset AND NOT Asc/AQ(3) AND Asc/AQ(2) AND NOT Asc/AQ(1) AND 
	NOT Asc/AQ(0) AND RP(3))
	OR (NOT Reset AND NOT Asc/AQ(3) AND NOT Asc/AQ(2) AND Asc/AQ(1) AND 
	Asc/AQ(0) AND RP(3))
	OR (Asc/AQ(1).EXP)
	OR (NOT Reset AND Asc/AQ(3) AND NOT Asc/AQ(2) AND Asc/AQ(1) AND 
	Asc/AQ(0) AND NOT fc(3))
	OR (NOT Reset AND Asc/AQ(3) AND NOT Asc/AQ(2) AND Asc/AQ(1) AND 
	NOT Asc/AQ(0) AND NOT fc(2))
	OR (NOT Reset AND Asc/AQ(3) AND NOT Asc/AQ(2) AND NOT Asc/AQ(1) AND 
	Asc/AQ(0) AND NOT fc(1))
	OR (NOT Reset AND NOT Asc/AQ(3) AND Asc/AQ(2) AND NOT Asc/AQ(1) AND 
	NOT Asc/AQ(0) AND RP(2))
	OR (NOT Reset AND NOT Asc/AQ(3) AND Asc/AQ(2) AND NOT Asc/AQ(1) AND 
	NOT Asc/AQ(0) AND RP(4))
	OR (NOT Reset AND NOT Asc/AQ(3) AND NOT Asc/AQ(2) AND Asc/AQ(1) AND 
	RP(1))
	OR (NOT Reset AND NOT Asc/AQ(3) AND NOT Asc/AQ(2) AND Asc/AQ(1) AND 
	RP(2))
	OR (NOT Reset AND NOT Asc/AQ(3) AND NOT Asc/AQ(2) AND Asc/AQ(1) AND 
	Asc/AQ(0) AND RP(5))
	OR (NOT Reset AND NOT Asc/AQ(3) AND NOT Asc/AQ(2) AND Asc/AQ(1) AND 
	NOT RP(4) AND RP(5))
	OR (NOT Reset AND NOT Asc/AQ(3) AND NOT Asc/AQ(2) AND Asc/AQ(0) AND 
	NOT RP(3) AND NOT RP(4) AND RP(5)));


DisplayOUT(0) <= NOT (((T(1) AND NOT DisplayOUT(1) AND NOT DisplayOUT(5))
	OR (Asc/AQ(0) AND NOT DisplayOUT(1) AND NOT DisplayOUT(5))
	OR (T(1) AND NOT Pisos/puQ(1) AND NOT Pisos/puQ(0) AND 
	NOT DisplayOUT(1))
	OR (Asc/AQ(2) AND Asc/AQ(1) AND NOT DisplayOUT(1) AND 
	NOT DisplayOUT(5))
	OR (NOT T(1) AND NOT Asc/AQ(3) AND NOT Asc/AQ(1) AND NOT Asc/AQ(0) AND 
	NOT DisplayOUT(1))));


DisplayOUT(1) <= ((NOT T(1) AND NOT Asc/AQ(3) AND NOT DisplayOUT(5))
	OR (T(1) AND Pisos/puQ(1) AND Pisos/puQ(0) AND 
	DisplayOUT(5))
	OR (T(1) AND NOT Pisos/puQ(1) AND NOT Pisos/puQ(0) AND 
	NOT DisplayOUT(5))
	OR (NOT T(1) AND NOT Asc/AQ(3) AND NOT Asc/AQ(2) AND Asc/AQ(1) AND 
	Asc/AQ(0)));


DisplayOUT(2) <= ((DisplayOUT(0) AND NOT DisplayOUT(4))
	OR (NOT T(1) AND Asc/AQ(2) AND DisplayOUT(5))
	OR (NOT T(1) AND Asc/AQ(3) AND Asc/AQ(1) AND DisplayOUT(0))
	OR (NOT T(1) AND NOT Asc/AQ(1) AND DisplayOUT(0) AND 
	DisplayOUT(5)));


DisplayOUT(3) <= NOT ((NOT DisplayOUT(2) AND NOT DisplayOUT(6)));


DisplayOUT(4) <= NOT (((T(1) AND Pisos/puQ(0) AND NOT DisplayOUT(1))
	OR (T(1) AND NOT DisplayOUT(1) AND NOT DisplayOUT(5))
	OR (Asc/AQ(0) AND NOT DisplayOUT(1) AND NOT DisplayOUT(5))
	OR (Asc/AQ(2) AND Asc/AQ(1) AND NOT DisplayOUT(1) AND 
	NOT DisplayOUT(5))
	OR (NOT T(1) AND NOT Asc/AQ(3) AND NOT Asc/AQ(2) AND NOT Asc/AQ(1) AND 
	Asc/AQ(0) AND NOT DisplayOUT(1))));


DisplayOUT(5) <= NOT (((T(1) AND Pisos/puQ(2))
	OR (NOT T(1) AND Asc/AQ(3) AND Asc/AQ(2) AND Asc/AQ(1))
	OR (NOT T(1) AND Asc/AQ(3) AND Asc/AQ(2) AND Asc/AQ(0))
	OR (NOT T(1) AND NOT Asc/AQ(3) AND Asc/AQ(2) AND NOT Asc/AQ(1) AND 
	NOT Asc/AQ(0))));


DisplayOUT(6) <= ((DisplayOUT(2) AND NOT DisplayOUT(4))
	OR (T(1) AND NOT Pisos/puQ(0) AND DisplayOUT(0))
	OR (NOT T(1) AND NOT Asc/AQ(3) AND Asc/AQ(2))
	OR (NOT Asc/AQ(3) AND DisplayOUT(0) AND NOT DisplayOUT(1))
	OR (NOT Asc/AQ(2) AND NOT Asc/AQ(1) AND NOT Asc/AQ(0) AND 
	DisplayOUT(0) AND NOT DisplayOUT(1)));












MB <= (Asc/AQ(3) AND Asc/AQ(1))
	 XOR 
MB <= ((Asc/AMB_and0002/Asc/AMB_and0002_D212_ AND 
	NOT Asc/AMB_and0001/Asc/AMB_and0001_D213_)
	OR (NOT Asc/AMB_and0002/Asc/AMB_and0002_D212_ AND 
	Asc/AMB_and0001/Asc/AMB_and0001_D213_));


MS <= (Asc/AQ(2) AND Asc/AQ(1))
	 XOR 
MS <= ((Asc/AMS_and0002/Asc/AMS_and0002_D210_ AND 
	NOT Asc/AMS_and0001/Asc/AMS_and0001_D214_)
	OR (NOT Asc/AMS_and0002/Asc/AMS_and0002_D210_ AND 
	Asc/AMS_and0001/Asc/AMS_and0001_D214_));

FDCPE_Pisos/Abajo/Qus0: FDCPE port map (Pisos/Abajo/Qus(0),Pisos/Abajo/Qus_D(0),CLK,'0','0');
Pisos/Abajo/Qus_D(0) <= (Abajo AND Pisos/Abajo/Qus(1));

FDCPE_Pisos/Abajo/Qus1: FDCPE port map (Pisos/Abajo/Qus(1),Abajo,CLK,'0','0');

FDCPE_Pisos/Arriba/Qus0: FDCPE port map (Pisos/Arriba/Qus(0),Pisos/Arriba/Qus_D(0),CLK,'0','0');
Pisos/Arriba/Qus_D(0) <= (Arriba AND Pisos/Arriba/Qus(1));

FDCPE_Pisos/Arriba/Qus1: FDCPE port map (Pisos/Arriba/Qus(1),Arriba,CLK,'0','0');

FDCPE_Pisos/Ir/Qus0: FDCPE port map (Pisos/Ir/Qus(0),Pisos/Ir/Qus_D(0),CLK,'0','0');
Pisos/Ir/Qus_D(0) <= (Ir AND Pisos/Ir/Qus(1));

FDCPE_Pisos/Ir/Qus1: FDCPE port map (Pisos/Ir/Qus(1),Ir,CLK,'0','0');


Pisos/MPi/D_or0003/Pisos/MPi/D_or0003_D2 <= ((Pisos/puQ(2) AND NOT Pisos/puQ(1) AND NOT Pisos/puQ(0) AND 
	Pisos/Arriba/Qus(1) AND NOT Pisos/Arriba/Qus(0))
	OR (NOT Pisos/puQ(2) AND NOT Pisos/Arriba/Qus(1) AND 
	NOT $OpTx$FX_DC$1)
	OR (NOT Pisos/puQ(2) AND Pisos/Arriba/Qus(0) AND 
	NOT $OpTx$FX_DC$1)
	OR (Pisos/puQ(2) AND NOT Pisos/puQ(1) AND NOT Pisos/puQ(0) AND 
	NOT $OpTx$FX_DC$1)
	OR (NOT Pisos/puQ(2) AND NOT Pisos/puQ(1) AND NOT Pisos/puQ(0) AND 
	$OpTx$FX_DC$1)
	OR (NOT Pisos/puQ(2) AND Pisos/Arriba/Qus(1) AND 
	NOT Pisos/Arriba/Qus(0) AND $OpTx$FX_DC$1));


Pisos/puD(0)/Pisos/puD(0)_RSTF <= ((Pisos/puQ(0) AND 
	NOT Pisos/MPi/D_or0003/Pisos/MPi/D_or0003_D2)
	OR (Pisos/puQ(2) AND Pisos/puQ(1) AND 
	NOT Pisos/MPi/D_or0003/Pisos/MPi/D_or0003_D2));

FDCPE_Pisos/puD0: FDCPE port map (Pisos/puD(0),'0','0',Pisos/puD(0)/Pisos/puD(0)_RSTF,Pisos/puD_PRE(0));
Pisos/puD_PRE(0) <= (NOT Pisos/MPi/D_or0003/Pisos/MPi/D_or0003_D2 AND 
	NOT Pisos/puD(0)/Pisos/puD(0)_RSTF);

FDCPE_Pisos/puD1: FDCPE port map (Pisos/puD(1),'0','0',Pisos/puD(1)/Pisos/puD(1)_RSTF,Pisos/puD_PRE(1));
Pisos/puD_PRE(1) <= (NOT Pisos/puD(2)/Pisos/puD(2)_RSTF AND 
	NOT Pisos/puD(1)/Pisos/puD(1)_RSTF);


Pisos/puD(1)/Pisos/puD(1)_RSTF <= ((Pisos/puQ(2) AND Pisos/puD(0)/Pisos/puD(0)_RSTF)
	OR (Pisos/puD(0)/Pisos/puD(0)_RSTF AND 
	Pisos/puD(2)/Pisos/puD(2)_RSTF)
	OR (NOT Pisos/puQ(1) AND $OpTx$FX_DC$1 AND 
	Pisos/puD(0)/Pisos/puD(0)_RSTF)
	OR (NOT Pisos/puQ(2) AND NOT Pisos/puQ(1) AND 
	NOT Pisos/MPi/D_or0003/Pisos/MPi/D_or0003_D2 AND NOT Pisos/puD(0)/Pisos/puD(0)_RSTF)
	OR (Pisos/puQ(1) AND 
	NOT Pisos/MPi/D_or0003/Pisos/MPi/D_or0003_D2 AND $OpTx$FX_DC$1 AND NOT Pisos/puD(0)/Pisos/puD(0)_RSTF));

FDCPE_Pisos/puD2: FDCPE port map (Pisos/puD(2),'0','0',NOT Pisos/puD(2)/Pisos/puD(2)_RSTF,Pisos/puD_PRE(2));
Pisos/puD_PRE(2) <= (Pisos/puD(0)/Pisos/puD(0)_RSTF AND 
	Pisos/puD(2)/Pisos/puD(2)_RSTF);


Pisos/puD(2)/Pisos/puD(2)_RSTF <= ((Pisos/MPi/D_or0003/Pisos/MPi/D_or0003_D2)
	OR (NOT Pisos/puQ(2) AND Pisos/puQ(1) AND Pisos/puQ(0) AND 
	NOT $OpTx$FX_DC$1));

FDCPE_Pisos/puQ0: FDCPE port map (Pisos/puQ(0),Pisos/puQ_D(0),CLK,'0','0');
Pisos/puQ_D(0) <= (NOT Reset AND Pisos/puD(0));

FDCPE_Pisos/puQ1: FDCPE port map (Pisos/puQ(1),Pisos/puQ_D(1),CLK,'0','0');
Pisos/puQ_D(1) <= (NOT Reset AND Pisos/puD(1));

FDCPE_Pisos/puQ2: FDCPE port map (Pisos/puQ(2),Pisos/puQ_D(2),CLK,'0','0');
Pisos/puQ_D(2) <= (NOT Reset AND Pisos/puD(2));


RP(1)/RP(1)_SETF <= (NOT Pisos/puQ(2) AND NOT Pisos/puQ(1) AND Pisos/Ir/Qus(1) AND 
	NOT Pisos/Ir/Qus(0) AND NOT RP(2)/RP(2)_SETF);

FDCPE_RP1: FDCPE port map (RP(1),'0','0',RP_CLR(1),RP_PRE(1));
RP_CLR(1) <= (Pisos/Ir/Qus(1) AND NOT Pisos/Ir/Qus(0) AND 
	NOT RP(1)/RP(1)_SETF);
RP_PRE(1) <= (NOT Pisos/puQ(2) AND NOT Pisos/puQ(1) AND Pisos/Ir/Qus(1) AND 
	NOT Pisos/Ir/Qus(0) AND NOT RP(2)/RP(2)_SETF);


RP(2)/RP(2)_SETF <= (NOT Pisos/puQ(2) AND NOT Pisos/puQ(1) AND Pisos/puQ(0) AND 
	Pisos/Ir/Qus(1) AND NOT Pisos/Ir/Qus(0));

FDCPE_RP2: FDCPE port map (RP(2),'0','0',RP_CLR(2),RP_PRE(2));
RP_CLR(2) <= (Pisos/Ir/Qus(1) AND NOT Pisos/Ir/Qus(0) AND 
	NOT RP(2)/RP(2)_SETF);
RP_PRE(2) <= (NOT Pisos/puQ(2) AND NOT Pisos/puQ(1) AND Pisos/puQ(0) AND 
	Pisos/Ir/Qus(1) AND NOT Pisos/Ir/Qus(0));

FDCPE_RP3: FDCPE port map (RP(3),'0','0',RP_CLR(3),RP_PRE(3));
RP_CLR(3) <= (Pisos/Ir/Qus(1) AND NOT Pisos/Ir/Qus(0) AND 
	NOT RP(3)/RP(3)_SETF);
RP_PRE(3) <= (NOT Pisos/puQ(2) AND NOT Pisos/puQ(0) AND Pisos/Ir/Qus(1) AND 
	NOT Pisos/Ir/Qus(0) AND NOT RP(1)/RP(1)_SETF);


RP(3)/RP(3)_SETF <= (NOT Pisos/puQ(2) AND NOT Pisos/puQ(0) AND Pisos/Ir/Qus(1) AND 
	NOT Pisos/Ir/Qus(0) AND NOT RP(1)/RP(1)_SETF);

FDCPE_RP4: FDCPE port map (RP(4),'0','0',RP_CLR(4),RP_PRE(4));
RP_CLR(4) <= (Pisos/Ir/Qus(1) AND NOT Pisos/Ir/Qus(0) AND 
	NOT RP(4)/RP(4)_SETF);
RP_PRE(4) <= (NOT Pisos/puQ(2) AND Pisos/puQ(1) AND Pisos/puQ(0) AND 
	Pisos/Ir/Qus(1) AND NOT Pisos/Ir/Qus(0));


RP(4)/RP(4)_SETF <= (NOT Pisos/puQ(2) AND Pisos/puQ(1) AND Pisos/puQ(0) AND 
	Pisos/Ir/Qus(1) AND NOT Pisos/Ir/Qus(0));


RP(5)/RP(5)_SETF <= (NOT Pisos/puQ(1) AND NOT Pisos/puQ(0) AND Pisos/Ir/Qus(1) AND 
	NOT Pisos/Ir/Qus(0) AND NOT RP(1)/RP(1)_SETF);

FDCPE_RP5: FDCPE port map (RP(5),'0','0',RP_CLR(5),RP_PRE(5));
RP_CLR(5) <= (Pisos/Ir/Qus(1) AND NOT Pisos/Ir/Qus(0) AND 
	NOT RP(5)/RP(5)_SETF);
RP_PRE(5) <= (NOT Pisos/puQ(1) AND NOT Pisos/puQ(0) AND Pisos/Ir/Qus(1) AND 
	NOT Pisos/Ir/Qus(0) AND NOT RP(1)/RP(1)_SETF);

FDCPE_T0: FDCPE port map (T(0),T_D(0),CLK,'0','0');
T_D(0) <= (NOT Reset AND NOT T(1));

FDCPE_T1: FDCPE port map (T(1),T_D(1),CLK,'0','0');
T_D(1) <= (NOT Reset AND NOT T(1));

Register Legend:
 FDCPE (Q,D,C,CLR,PRE,CE); 
 FTCPE (Q,D,C,CLR,PRE,CE); 
 LDCP  (Q,D,G,CLR,PRE); 

******************************  Device Pin Out *****************************

Device : XC9572XL-5-PC44


   --------------------------------  
  /6  5  4  3  2  1  44 43 42 41 40 \
 | 7                             39 | 
 | 8                             38 | 
 | 9                             37 | 
 | 10                            36 | 
 | 11        XC9572XL-5-PC44     35 | 
 | 12                            34 | 
 | 13                            33 | 
 | 14                            32 | 
 | 15                            31 | 
 | 16                            30 | 
 | 17                            29 | 
 \ 18 19 20 21 22 23 24 25 26 27 28 /
   --------------------------------  


Pin Signal                         Pin Signal                        
No. Name                           No. Name                          
  1 KPR                              23 GND                           
  2 KPR                              24 DisplayOUT<2>                 
  3 KPR                              25 DisplayOUT<1>                 
  4 KPR                              26 DisplayOUT<0>                 
  5 KPR                              27 Abajo                         
  6 CLK                              28 T<1>                          
  7 KPR                              29 KPR                           
  8 KPR                              30 TDO                           
  9 KPR                              31 GND                           
 10 GND                              32 VCC                           
 11 KPR                              33 Arriba                        
 12 KPR                              34 Ir                            
 13 MS                               35 Reset                         
 14 MB                               36 KPR                           
 15 TDI                              37 fc<1>                         
 16 TMS                              38 fc<2>                         
 17 TCK                              39 fc<3>                         
 18 DisplayOUT<6>                    40 fc<4>                         
 19 DisplayOUT<5>                    41 VCC                           
 20 DisplayOUT<4>                    42 fc<5>                         
 21 VCC                              43 KPR                           
 22 DisplayOUT<3>                    44 T<0>                          


Legend :  NC  = Not Connected, unbonded pin
         PGND = Unused I/O configured as additional Ground pin
         TIE  = Unused I/O floating -- must tie to VCC, GND or other signal
         KPR  = Unused I/O with weak keeper (leave unconnected)
         VCC  = Dedicated Power Pin
         GND  = Dedicated Ground Pin
         TDI  = Test Data In, JTAG pin
         TDO  = Test Data Out, JTAG pin
         TCK  = Test Clock, JTAG pin
         TMS  = Test Mode Select, JTAG pin
  PROHIBITED  = User reserved pin
****************************  Compiler Options  ****************************

Following is a list of all global compiler options used by the fitter run.

Device(s) Specified                         : xc9572xl-5-PC44
Optimization Method                         : DENSITY
Multi-Level Logic Optimization              : ON
Ignore Timing Specifications                : OFF
Default Register Power Up Value             : LOW
Keep User Location Constraints              : ON
What-You-See-Is-What-You-Get                : OFF
Exhaustive Fitting                          : OFF
Keep Unused Inputs                          : OFF
Slew Rate                                   : FAST
Power Mode                                  : STD
Ground on Unused IOs                        : OFF
Set I/O Pin Termination                     : KEEPER
Global Clock Optimization                   : ON
Global Set/Reset Optimization               : ON
Global Ouput Enable Optimization            : ON
Input Limit                                 : 54
Pterm Limit                                 : 25
