<mxfile host="app.diagrams.net" modified="2024-03-07T17:34:39.588Z" agent="Mozilla/5.0 (Windows NT 10.0; Win64; x64) AppleWebKit/537.36 (KHTML, like Gecko) Chrome/122.0.0.0 Safari/537.36" etag="Sbigz2ncoU8IAko37uZa" version="24.0.1" type="google" pages="3">
  <diagram name="Diagrama C4-Contexto" id="aQulanBM-qaS2zbpMDNj">
    <mxGraphModel dx="2501" dy="2105" grid="1" gridSize="10" guides="1" tooltips="1" connect="1" arrows="1" fold="1" page="1" pageScale="1" pageWidth="827" pageHeight="1169" math="0" shadow="0">
      <root>
        <mxCell id="hfi5sVZmhGlCzbEA8KnR-0" />
        <mxCell id="hfi5sVZmhGlCzbEA8KnR-1" parent="hfi5sVZmhGlCzbEA8KnR-0" />
        <object placeholders="1" c4Name="Odoo WEB" c4Type="Software System" c4Description="Sistema Odoo WEB" label="&lt;font style=&quot;font-size: 16px&quot;&gt;&lt;b&gt;%c4Name%&lt;/b&gt;&lt;/font&gt;&lt;div&gt;[%c4Type%]&lt;/div&gt;&lt;br&gt;&lt;div&gt;&lt;font style=&quot;font-size: 11px&quot;&gt;&lt;font color=&quot;#cccccc&quot;&gt;%c4Description%&lt;/font&gt;&lt;/div&gt;" id="hfi5sVZmhGlCzbEA8KnR-2">
          <mxCell style="rounded=1;whiteSpace=wrap;html=1;labelBackgroundColor=none;fillColor=#1061B0;fontColor=#ffffff;align=center;arcSize=10;strokeColor=#0D5091;metaEdit=1;resizable=0;points=[[0.25,0,0],[0.5,0,0],[0.75,0,0],[1,0.25,0],[1,0.5,0],[1,0.75,0],[0.75,1,0],[0.5,1,0],[0.25,1,0],[0,0.75,0],[0,0.5,0],[0,0.25,0]];" parent="hfi5sVZmhGlCzbEA8KnR-1" vertex="1">
            <mxGeometry x="250" y="190" width="240" height="120" as="geometry" />
          </mxCell>
        </object>
        <object placeholders="1" c4Name="Sistema Facturación Electrónica" c4Type="Sistema Proveedor" c4Description="Proveedor local facturación electrónica" label="&lt;font style=&quot;font-size: 16px&quot;&gt;&lt;b&gt;%c4Name%&lt;/b&gt;&lt;/font&gt;&lt;div&gt;[%c4Type%]&lt;/div&gt;&lt;br&gt;&lt;div&gt;&lt;font style=&quot;font-size: 11px&quot;&gt;&lt;font color=&quot;#cccccc&quot;&gt;%c4Description%&lt;/font&gt;&lt;/div&gt;" id="hfi5sVZmhGlCzbEA8KnR-3">
          <mxCell style="rounded=1;whiteSpace=wrap;html=1;labelBackgroundColor=none;fillColor=#8C8496;fontColor=#ffffff;align=center;arcSize=10;strokeColor=#736782;metaEdit=1;resizable=0;points=[[0.25,0,0],[0.5,0,0],[0.75,0,0],[1,0.25,0],[1,0.5,0],[1,0.75,0],[0.75,1,0],[0.5,1,0],[0.25,1,0],[0,0.75,0],[0,0.5,0],[0,0.25,0]];" parent="hfi5sVZmhGlCzbEA8KnR-1" vertex="1">
            <mxGeometry x="-130" y="420" width="240" height="120" as="geometry" />
          </mxCell>
        </object>
        <object placeholders="1" c4Name="Usuarios Odoo" c4Type="Person" c4Description="Usuarios del Sistema" label="&lt;font style=&quot;font-size: 16px&quot;&gt;&lt;b&gt;%c4Name%&lt;/b&gt;&lt;/font&gt;&lt;div&gt;[%c4Type%]&lt;/div&gt;&lt;br&gt;&lt;div&gt;&lt;font style=&quot;font-size: 11px&quot;&gt;&lt;font color=&quot;#cccccc&quot;&gt;%c4Description%&lt;/font&gt;&lt;/div&gt;" id="hfi5sVZmhGlCzbEA8KnR-4">
          <mxCell style="html=1;fontSize=11;dashed=0;whiteSpace=wrap;fillColor=#083F75;strokeColor=#06315C;fontColor=#ffffff;shape=mxgraph.c4.person2;align=center;metaEdit=1;points=[[0.5,0,0],[1,0.5,0],[1,0.75,0],[0.75,1,0],[0.5,1,0],[0.25,1,0],[0,0.75,0],[0,0.5,0]];resizable=0;" parent="hfi5sVZmhGlCzbEA8KnR-1" vertex="1">
            <mxGeometry x="270" y="-140" width="200" height="180" as="geometry" />
          </mxCell>
        </object>
        <object placeholders="1" c4Name="Componente Manejo Redes Sociales" c4Type="Complementos" c4Description="Manejo Redes (Facebook y Whatsapp)" label="&lt;font style=&quot;font-size: 16px&quot;&gt;&lt;b&gt;%c4Name%&lt;/b&gt;&lt;/font&gt;&lt;div&gt;[%c4Type%]&lt;/div&gt;&lt;br&gt;&lt;div&gt;&lt;font style=&quot;font-size: 11px&quot;&gt;&lt;font color=&quot;#cccccc&quot;&gt;%c4Description%&lt;/font&gt;&lt;/div&gt;" id="hfi5sVZmhGlCzbEA8KnR-5">
          <mxCell style="rounded=1;whiteSpace=wrap;html=1;labelBackgroundColor=none;fillColor=#8C8496;fontColor=#ffffff;align=center;arcSize=10;strokeColor=#736782;metaEdit=1;resizable=0;points=[[0.25,0,0],[0.5,0,0],[0.75,0,0],[1,0.25,0],[1,0.5,0],[1,0.75,0],[0.75,1,0],[0.5,1,0],[0.25,1,0],[0,0.75,0],[0,0.5,0],[0,0.25,0]];" parent="hfi5sVZmhGlCzbEA8KnR-1" vertex="1">
            <mxGeometry x="258" y="440" width="240" height="120" as="geometry" />
          </mxCell>
        </object>
        <object placeholders="1" c4Name="Boton de pagos" c4Type="Boton Pagos del Banco" c4Description="Institucion Financiera" label="&lt;font style=&quot;font-size: 16px&quot;&gt;&lt;b&gt;%c4Name%&lt;/b&gt;&lt;/font&gt;&lt;div&gt;[%c4Type%]&lt;/div&gt;&lt;br&gt;&lt;div&gt;&lt;font style=&quot;font-size: 11px&quot;&gt;&lt;font color=&quot;#cccccc&quot;&gt;%c4Description%&lt;/font&gt;&lt;/div&gt;" id="hfi5sVZmhGlCzbEA8KnR-6">
          <mxCell style="rounded=1;whiteSpace=wrap;html=1;labelBackgroundColor=none;fillColor=#8C8496;fontColor=#ffffff;align=center;arcSize=10;strokeColor=#736782;metaEdit=1;resizable=0;points=[[0.25,0,0],[0.5,0,0],[0.75,0,0],[1,0.25,0],[1,0.5,0],[1,0.75,0],[0.75,1,0],[0.5,1,0],[0.25,1,0],[0,0.75,0],[0,0.5,0],[0,0.25,0]];" parent="hfi5sVZmhGlCzbEA8KnR-1" vertex="1">
            <mxGeometry x="710" y="380" width="240" height="120" as="geometry" />
          </mxCell>
        </object>
        <object placeholders="1" c4Type="Relationship" c4Description="Ventas, Manejo de Empleados, Facturación" label="&lt;div style=&quot;text-align: left&quot;&gt;&lt;div style=&quot;text-align: center&quot;&gt;&lt;b&gt;%c4Description%&lt;/b&gt;&lt;/div&gt;" id="hfi5sVZmhGlCzbEA8KnR-7">
          <mxCell style="endArrow=blockThin;html=1;fontSize=10;fontColor=#404040;strokeWidth=1;endFill=1;strokeColor=#828282;elbow=vertical;metaEdit=1;endSize=14;startSize=14;jumpStyle=arc;jumpSize=16;rounded=0;edgeStyle=orthogonalEdgeStyle;exitX=0.5;exitY=1;exitDx=0;exitDy=0;exitPerimeter=0;entryX=0.5;entryY=0;entryDx=0;entryDy=0;entryPerimeter=0;" parent="hfi5sVZmhGlCzbEA8KnR-1" source="hfi5sVZmhGlCzbEA8KnR-4" target="hfi5sVZmhGlCzbEA8KnR-2" edge="1">
            <mxGeometry x="0.0667" y="30" width="240" relative="1" as="geometry">
              <mxPoint x="330" y="200" as="sourcePoint" />
              <mxPoint x="570" y="200" as="targetPoint" />
              <mxPoint as="offset" />
            </mxGeometry>
          </mxCell>
        </object>
        <object placeholders="1" c4Type="Relationship" c4Description="Manejo de Redes (Facebook y Whatsapp)" label="&lt;div style=&quot;text-align: left&quot;&gt;&lt;div style=&quot;text-align: center&quot;&gt;&lt;b&gt;%c4Description%&lt;/b&gt;&lt;/div&gt;" id="hfi5sVZmhGlCzbEA8KnR-8">
          <mxCell style="endArrow=blockThin;html=1;fontSize=10;fontColor=#404040;strokeWidth=1;endFill=1;strokeColor=#828282;elbow=vertical;metaEdit=1;endSize=14;startSize=14;jumpStyle=arc;jumpSize=16;rounded=0;edgeStyle=orthogonalEdgeStyle;exitX=0.5;exitY=1;exitDx=0;exitDy=0;exitPerimeter=0;entryX=0.463;entryY=-0.037;entryDx=0;entryDy=0;entryPerimeter=0;" parent="hfi5sVZmhGlCzbEA8KnR-1" target="hfi5sVZmhGlCzbEA8KnR-5" edge="1">
            <mxGeometry width="240" relative="1" as="geometry">
              <mxPoint x="369.33" y="310" as="sourcePoint" />
              <mxPoint x="369.33" y="460" as="targetPoint" />
              <mxPoint as="offset" />
            </mxGeometry>
          </mxCell>
        </object>
        <object placeholders="1" c4Type="Relationship" c4Technology="" c4Description="Enviar datos para facturación electrónica" label="&lt;div style=&quot;text-align: left&quot;&gt;&lt;div style=&quot;text-align: center&quot;&gt;&lt;b&gt;%c4Description%&lt;/b&gt;&lt;/div&gt;&lt;div style=&quot;text-align: center&quot;&gt;[%c4Technology%]&lt;/div&gt;&lt;/div&gt;" id="hfi5sVZmhGlCzbEA8KnR-10">
          <mxCell style="endArrow=blockThin;html=1;fontSize=10;fontColor=#404040;strokeWidth=1;endFill=1;strokeColor=#828282;elbow=vertical;metaEdit=1;endSize=14;startSize=14;jumpStyle=arc;jumpSize=16;rounded=0;edgeStyle=orthogonalEdgeStyle;exitX=0;exitY=0.5;exitDx=0;exitDy=0;exitPerimeter=0;" parent="hfi5sVZmhGlCzbEA8KnR-1" source="hfi5sVZmhGlCzbEA8KnR-2" target="hfi5sVZmhGlCzbEA8KnR-3" edge="1">
            <mxGeometry x="0.4194" y="-30" width="240" relative="1" as="geometry">
              <mxPoint x="490" y="300" as="sourcePoint" />
              <mxPoint x="730" y="300" as="targetPoint" />
              <mxPoint as="offset" />
            </mxGeometry>
          </mxCell>
        </object>
        <object placeholders="1" c4Name="Diagrama Contexto Integración Odoo" c4Type="SystemScopeBoundary" c4Description="Diagrama Contexto Integración Odoo" label="&lt;font style=&quot;font-size: 16px&quot;&gt;&lt;b&gt;&lt;div style=&quot;text-align: left&quot;&gt;%c4Name%&lt;/div&gt;&lt;/b&gt;&lt;/font&gt;&lt;div style=&quot;text-align: left&quot;&gt;%c4Description%&lt;/div&gt;" id="hfi5sVZmhGlCzbEA8KnR-13">
          <mxCell style="text;html=1;strokeColor=default;fillColor=none;align=left;verticalAlign=top;whiteSpace=wrap;rounded=0;metaEdit=1;allowArrows=0;resizable=1;rotatable=0;connectable=0;recursiveResize=0;expand=0;pointerEvents=0;points=[[0.25,0,0],[0.5,0,0],[0.75,0,0],[1,0.25,0],[1,0.5,0],[1,0.75,0],[0.75,1,0],[0.5,1,0],[0.25,1,0],[0,0.75,0],[0,0.5,0],[0,0.25,0]];" parent="hfi5sVZmhGlCzbEA8KnR-1" vertex="1">
            <mxGeometry x="-200" y="-220" width="1170" height="850" as="geometry" />
          </mxCell>
        </object>
        <object placeholders="1" c4Type="Relationship" c4Technology="e.g. JSON/HTTP" c4Description="Recibir pagos con TC y TD" label="&lt;div style=&quot;text-align: left&quot;&gt;&lt;div style=&quot;text-align: center&quot;&gt;&lt;b&gt;%c4Description%&lt;/b&gt;&lt;/div&gt;&lt;div style=&quot;text-align: center&quot;&gt;[%c4Technology%]&lt;/div&gt;&lt;/div&gt;" id="EyeoyARGJ1FsyVj8pd5j-1">
          <mxCell style="endArrow=blockThin;html=1;fontSize=10;fontColor=#404040;strokeWidth=1;endFill=1;strokeColor=#828282;elbow=vertical;metaEdit=1;endSize=14;startSize=14;jumpStyle=arc;jumpSize=16;rounded=0;edgeStyle=orthogonalEdgeStyle;" parent="hfi5sVZmhGlCzbEA8KnR-1" source="hfi5sVZmhGlCzbEA8KnR-2" edge="1">
            <mxGeometry x="0.4194" y="-30" width="240" relative="1" as="geometry">
              <mxPoint x="1087" y="210" as="sourcePoint" />
              <mxPoint x="827" y="380" as="targetPoint" />
              <mxPoint as="offset" />
            </mxGeometry>
          </mxCell>
        </object>
      </root>
    </mxGraphModel>
  </diagram>
  <diagram name="Diagrama C4-Contenedor" id="ZcuHHaMOu8wCtrsDjzIe">
    <mxGraphModel dx="1674" dy="2105" grid="1" gridSize="10" guides="1" tooltips="1" connect="1" arrows="1" fold="1" page="1" pageScale="1" pageWidth="827" pageHeight="1169" math="0" shadow="0">
      <root>
        <mxCell id="-lDIsB3-adEhukLgf9ZX-0" />
        <mxCell id="-lDIsB3-adEhukLgf9ZX-1" parent="-lDIsB3-adEhukLgf9ZX-0" />
        <object placeholders="1" c4Name="Pagina Web Oddo" c4Type="Container" c4Technology="Python, JavaScript" c4Description="Pagina Web para ingreso al Odoo" label="&lt;font style=&quot;font-size: 16px&quot;&gt;&lt;b&gt;%c4Name%&lt;/b&gt;&lt;/font&gt;&lt;div&gt;[%c4Type%: %c4Technology%]&lt;/div&gt;&lt;br&gt;&lt;div&gt;&lt;font style=&quot;font-size: 11px&quot;&gt;&lt;font color=&quot;#E6E6E6&quot;&gt;%c4Description%&lt;/font&gt;&lt;/div&gt;" id="-lDIsB3-adEhukLgf9ZX-3">
          <mxCell style="rounded=1;whiteSpace=wrap;html=1;fontSize=11;labelBackgroundColor=none;fillColor=#23A2D9;fontColor=#ffffff;align=center;arcSize=10;strokeColor=#0E7DAD;metaEdit=1;resizable=0;points=[[0.25,0,0],[0.5,0,0],[0.75,0,0],[1,0.25,0],[1,0.5,0],[1,0.75,0],[0.75,1,0],[0.5,1,0],[0.25,1,0],[0,0.75,0],[0,0.5,0],[0,0.25,0]];" parent="-lDIsB3-adEhukLgf9ZX-1" vertex="1">
            <mxGeometry x="20" y="310" width="240" height="120" as="geometry" />
          </mxCell>
        </object>
        <mxCell id="-lDIsB3-adEhukLgf9ZX-5" value="Ingreso (https)" style="edgeStyle=none;html=1;startArrow=block;endArrow=none;startSize=12;verticalAlign=bottom;dashed=1;labelBackgroundColor=none;rounded=0;entryX=0.048;entryY=0.914;entryDx=0;entryDy=0;entryPerimeter=0;exitX=0.5;exitY=0;exitDx=0;exitDy=0;exitPerimeter=0;startFill=1;" parent="-lDIsB3-adEhukLgf9ZX-1" source="-lDIsB3-adEhukLgf9ZX-3" target="vMdRkhXVXesA4k0sx_kw-0" edge="1">
          <mxGeometry x="0.2083" y="-19" width="160" relative="1" as="geometry">
            <mxPoint x="320" y="290" as="sourcePoint" />
            <mxPoint x="316" y="142.01999999999998" as="targetPoint" />
            <mxPoint y="1" as="offset" />
          </mxGeometry>
        </mxCell>
        <object placeholders="1" c4Type="Data Base" c4Container="Container" c4Technology="PostgreSQL" c4Description="Base de datos para consulta, registro, validación de identidad de sistema Odoo" label="&lt;font style=&quot;font-size: 16px&quot;&gt;&lt;b&gt;%c4Type%&lt;/b&gt;&lt;/font&gt;&lt;div&gt;[%c4Container%:&amp;nbsp;%c4Technology%]&lt;/div&gt;&lt;br&gt;&lt;div&gt;&lt;font style=&quot;font-size: 11px&quot;&gt;&lt;font color=&quot;#E6E6E6&quot;&gt;%c4Description%&lt;/font&gt;&lt;/div&gt;" id="-lDIsB3-adEhukLgf9ZX-7">
          <mxCell style="shape=cylinder3;size=15;whiteSpace=wrap;html=1;boundedLbl=1;rounded=0;labelBackgroundColor=none;fillColor=#23A2D9;fontSize=12;fontColor=#ffffff;align=center;strokeColor=#0E7DAD;metaEdit=1;points=[[0.5,0,0],[1,0.25,0],[1,0.5,0],[1,0.75,0],[0.5,1,0],[0,0.75,0],[0,0.5,0],[0,0.25,0]];resizable=0;" parent="-lDIsB3-adEhukLgf9ZX-1" vertex="1">
            <mxGeometry x="740" y="310" width="240" height="120" as="geometry" />
          </mxCell>
        </object>
        <mxCell id="-lDIsB3-adEhukLgf9ZX-8" value="Registro y &lt;br&gt;Consulta a la BD" style="edgeStyle=none;html=1;startArrow=block;endArrow=none;startSize=12;verticalAlign=bottom;dashed=1;labelBackgroundColor=none;rounded=0;exitX=0;exitY=0.583;exitDx=0;exitDy=0;exitPerimeter=0;startFill=1;entryX=1.006;entryY=0.567;entryDx=0;entryDy=0;entryPerimeter=0;fontSize=13;" parent="-lDIsB3-adEhukLgf9ZX-1" source="-lDIsB3-adEhukLgf9ZX-7" target="vMdRkhXVXesA4k0sx_kw-1" edge="1">
          <mxGeometry x="0.0005" width="160" relative="1" as="geometry">
            <mxPoint x="340" y="510" as="sourcePoint" />
            <mxPoint x="610" y="380" as="targetPoint" />
            <mxPoint as="offset" />
          </mxGeometry>
        </mxCell>
        <object placeholders="1" c4Name="Apache Camel" c4Type="Framework de Integración" c4Technology="Java" c4Description="Apache Camel Framework" label="&lt;font style=&quot;font-size: 16px&quot;&gt;&lt;b&gt;%c4Name%&lt;/b&gt;&lt;/font&gt;&lt;div&gt;[%c4Type%: %c4Technology%]&lt;/div&gt;&lt;br&gt;&lt;div&gt;&lt;font style=&quot;font-size: 11px&quot;&gt;&lt;font color=&quot;#E6E6E6&quot;&gt;%c4Description%&lt;/font&gt;&lt;/div&gt;" id="-lDIsB3-adEhukLgf9ZX-11">
          <mxCell style="rounded=1;whiteSpace=wrap;html=1;fontSize=11;labelBackgroundColor=none;fillColor=#23A2D9;fontColor=#ffffff;align=center;arcSize=10;strokeColor=#0E7DAD;metaEdit=1;resizable=0;points=[[0.25,0,0],[0.5,0,0],[0.75,0,0],[1,0.25,0],[1,0.5,0],[1,0.75,0],[0.75,1,0],[0.5,1,0],[0.25,1,0],[0,0.75,0],[0,0.5,0],[0,0.25,0]];" parent="-lDIsB3-adEhukLgf9ZX-1" vertex="1">
            <mxGeometry x="395" y="600" width="240" height="120" as="geometry" />
          </mxCell>
        </object>
        <mxCell id="-lDIsB3-adEhukLgf9ZX-14" value="Devuelve Información solicitada" style="edgeStyle=none;html=1;startArrow=block;endArrow=none;startSize=12;verticalAlign=bottom;dashed=1;labelBackgroundColor=none;rounded=0;entryX=0.75;entryY=0;entryDx=0;entryDy=0;entryPerimeter=0;exitX=0.631;exitY=1.004;exitDx=0;exitDy=0;exitPerimeter=0;startFill=1;fontSize=13;" parent="-lDIsB3-adEhukLgf9ZX-1" source="vMdRkhXVXesA4k0sx_kw-1" target="-lDIsB3-adEhukLgf9ZX-11" edge="1">
          <mxGeometry x="-0.0065" y="100" width="160" relative="1" as="geometry">
            <mxPoint x="552.4" y="427.48" as="sourcePoint" />
            <mxPoint x="529.9999999999999" y="560" as="targetPoint" />
            <mxPoint as="offset" />
          </mxGeometry>
        </mxCell>
        <object placeholders="1" c4Name="Diagrama Contenedor ERP Odoo" c4Type="SystemScopeBoundary" c4Application="Diagrama Contenedor ERP Odoo" label="&lt;font style=&quot;font-size: 16px&quot;&gt;&lt;b&gt;&lt;div style=&quot;text-align: left&quot;&gt;%c4Name%&lt;/div&gt;&lt;/b&gt;&lt;/font&gt;&lt;div style=&quot;text-align: left&quot;&gt;[%c4Application%]&lt;/div&gt;" id="-lDIsB3-adEhukLgf9ZX-15">
          <mxCell style="rounded=1;fontSize=11;whiteSpace=wrap;html=1;dashed=1;arcSize=20;fillColor=none;strokeColor=#666666;fontColor=#333333;labelBackgroundColor=none;align=left;verticalAlign=bottom;labelBorderColor=none;spacingTop=0;spacing=10;dashPattern=8 4;metaEdit=1;rotatable=0;perimeter=rectanglePerimeter;noLabel=0;labelPadding=0;allowArrows=0;connectable=0;expand=0;recursiveResize=0;editable=1;pointerEvents=0;absoluteArcSize=1;points=[[0.25,0,0],[0.5,0,0],[0.75,0,0],[1,0.25,0],[1,0.5,0],[1,0.75,0],[0.75,1,0],[0.5,1,0],[0.25,1,0],[0,0.75,0],[0,0.5,0],[0,0.25,0]];" parent="-lDIsB3-adEhukLgf9ZX-1" vertex="1">
            <mxGeometry x="20" y="270" width="1010" height="650" as="geometry" />
          </mxCell>
        </object>
        <object placeholders="1" c4Name="Boton de Pagos" c4Type="Software System" c4Description="Boton Pagos Institución Financiera" label="&lt;font style=&quot;font-size: 16px&quot;&gt;&lt;b&gt;%c4Name%&lt;/b&gt;&lt;/font&gt;&lt;div&gt;[%c4Type%]&lt;/div&gt;&lt;br&gt;&lt;div&gt;&lt;font style=&quot;font-size: 11px&quot;&gt;&lt;font color=&quot;#cccccc&quot;&gt;%c4Description%&lt;/font&gt;&lt;/div&gt;" id="-lDIsB3-adEhukLgf9ZX-17">
          <mxCell style="rounded=1;whiteSpace=wrap;html=1;labelBackgroundColor=none;fillColor=#8C8496;fontColor=#ffffff;align=center;arcSize=10;strokeColor=#736782;metaEdit=1;resizable=0;points=[[0.25,0,0],[0.5,0,0],[0.75,0,0],[1,0.25,0],[1,0.5,0],[1,0.75,0],[0.75,1,0],[0.5,1,0],[0.25,1,0],[0,0.75,0],[0,0.5,0],[0,0.25,0]];" parent="-lDIsB3-adEhukLgf9ZX-1" vertex="1">
            <mxGeometry x="30" y="500" width="240" height="120" as="geometry" />
          </mxCell>
        </object>
        <object placeholders="1" c4Name="Facturación electrónica" c4Type="Software System" c4Description="Sistema Facturación proveedor externo" label="&lt;font style=&quot;font-size: 16px&quot;&gt;&lt;b&gt;%c4Name%&lt;/b&gt;&lt;/font&gt;&lt;div&gt;[%c4Type%]&lt;/div&gt;&lt;br&gt;&lt;div&gt;&lt;font style=&quot;font-size: 11px&quot;&gt;&lt;font color=&quot;#cccccc&quot;&gt;%c4Description%&lt;/font&gt;&lt;/div&gt;" id="-lDIsB3-adEhukLgf9ZX-18">
          <mxCell style="rounded=1;whiteSpace=wrap;html=1;labelBackgroundColor=none;fillColor=#8C8496;fontColor=#ffffff;align=center;arcSize=10;strokeColor=#736782;metaEdit=1;resizable=0;points=[[0.25,0,0],[0.5,0,0],[0.75,0,0],[1,0.25,0],[1,0.5,0],[1,0.75,0],[0.75,1,0],[0.5,1,0],[0.25,1,0],[0,0.75,0],[0,0.5,0],[0,0.25,0]];" parent="-lDIsB3-adEhukLgf9ZX-1" vertex="1">
            <mxGeometry x="30" y="710" width="240" height="120" as="geometry" />
          </mxCell>
        </object>
        <mxCell id="-lDIsB3-adEhukLgf9ZX-19" value="camel-rest-starter" style="edgeStyle=none;html=1;startArrow=block;endArrow=none;startSize=12;verticalAlign=bottom;dashed=1;labelBackgroundColor=none;rounded=0;exitX=1;exitY=0.5;exitDx=0;exitDy=0;exitPerimeter=0;startFill=1;entryX=0;entryY=0.25;entryDx=0;entryDy=0;entryPerimeter=0;fontSize=13;" parent="-lDIsB3-adEhukLgf9ZX-1" source="-lDIsB3-adEhukLgf9ZX-17" target="-lDIsB3-adEhukLgf9ZX-11" edge="1">
          <mxGeometry x="-0.011" y="17" width="160" relative="1" as="geometry">
            <mxPoint x="860" y="570" as="sourcePoint" />
            <mxPoint x="630" y="630" as="targetPoint" />
            <mxPoint as="offset" />
          </mxGeometry>
        </mxCell>
        <mxCell id="-lDIsB3-adEhukLgf9ZX-20" value="camel-http" style="edgeStyle=none;html=1;startArrow=block;endArrow=none;startSize=12;verticalAlign=bottom;dashed=1;labelBackgroundColor=none;rounded=0;exitX=1.008;exitY=0.367;exitDx=0;exitDy=0;exitPerimeter=0;startFill=1;entryX=0.002;entryY=0.625;entryDx=0;entryDy=0;entryPerimeter=0;fontSize=13;" parent="-lDIsB3-adEhukLgf9ZX-1" source="-lDIsB3-adEhukLgf9ZX-18" target="-lDIsB3-adEhukLgf9ZX-11" edge="1">
          <mxGeometry x="-0.1149" y="-25" width="160" relative="1" as="geometry">
            <mxPoint x="340" y="950" as="sourcePoint" />
            <mxPoint x="390" y="670" as="targetPoint" />
            <mxPoint as="offset" />
          </mxGeometry>
        </mxCell>
        <object placeholders="1" c4Name="WhatsApp" c4Type="Software System" c4Description="Red Social WhatsApp" label="&lt;font style=&quot;font-size: 16px&quot;&gt;&lt;b&gt;%c4Name%&lt;/b&gt;&lt;/font&gt;&lt;div&gt;[%c4Type%]&lt;/div&gt;&lt;br&gt;&lt;div&gt;&lt;font style=&quot;font-size: 11px&quot;&gt;&lt;font color=&quot;#cccccc&quot;&gt;%c4Description%&lt;/font&gt;&lt;/div&gt;" id="-lDIsB3-adEhukLgf9ZX-21">
          <mxCell style="rounded=1;whiteSpace=wrap;html=1;labelBackgroundColor=none;fillColor=#8C8496;fontColor=#ffffff;align=center;arcSize=10;strokeColor=#736782;metaEdit=1;resizable=0;points=[[0.25,0,0],[0.5,0,0],[0.75,0,0],[1,0.25,0],[1,0.5,0],[1,0.75,0],[0.75,1,0],[0.5,1,0],[0.25,1,0],[0,0.75,0],[0,0.5,0],[0,0.25,0]];" parent="-lDIsB3-adEhukLgf9ZX-1" vertex="1">
            <mxGeometry x="760" y="680" width="240" height="120" as="geometry" />
          </mxCell>
        </object>
        <object placeholders="1" c4Name="Facebook" c4Type="Software System" c4Description="Red Social Facebook" label="&lt;font style=&quot;font-size: 16px&quot;&gt;&lt;b&gt;%c4Name%&lt;/b&gt;&lt;/font&gt;&lt;div&gt;[%c4Type%]&lt;/div&gt;&lt;br&gt;&lt;div&gt;&lt;font style=&quot;font-size: 11px&quot;&gt;&lt;font color=&quot;#cccccc&quot;&gt;%c4Description%&lt;/font&gt;&lt;/div&gt;" id="-lDIsB3-adEhukLgf9ZX-22">
          <mxCell style="rounded=1;whiteSpace=wrap;html=1;labelBackgroundColor=none;fillColor=#8C8496;fontColor=#ffffff;align=center;arcSize=10;strokeColor=#736782;metaEdit=1;resizable=0;points=[[0.25,0,0],[0.5,0,0],[0.75,0,0],[1,0.25,0],[1,0.5,0],[1,0.75,0],[0.75,1,0],[0.5,1,0],[0.25,1,0],[0,0.75,0],[0,0.5,0],[0,0.25,0]];" parent="-lDIsB3-adEhukLgf9ZX-1" vertex="1">
            <mxGeometry x="770" y="525" width="240" height="120" as="geometry" />
          </mxCell>
        </object>
        <mxCell id="-lDIsB3-adEhukLgf9ZX-23" value="camel-facebook" style="edgeStyle=none;html=1;startArrow=block;endArrow=none;startSize=12;verticalAlign=bottom;dashed=1;labelBackgroundColor=none;rounded=0;exitX=-0.023;exitY=0.363;exitDx=0;exitDy=0;exitPerimeter=0;startFill=1;entryX=1;entryY=0.25;entryDx=0;entryDy=0;entryPerimeter=0;fontSize=13;" parent="-lDIsB3-adEhukLgf9ZX-1" source="-lDIsB3-adEhukLgf9ZX-22" target="-lDIsB3-adEhukLgf9ZX-11" edge="1">
          <mxGeometry x="0.0075" y="-22" width="160" relative="1" as="geometry">
            <mxPoint x="390" y="1030" as="sourcePoint" />
            <mxPoint x="470" y="910" as="targetPoint" />
            <mxPoint as="offset" />
          </mxGeometry>
        </mxCell>
        <mxCell id="-lDIsB3-adEhukLgf9ZX-24" value="camel-whatsapp" style="edgeStyle=none;html=1;startArrow=block;endArrow=none;startSize=12;verticalAlign=bottom;dashed=1;labelBackgroundColor=none;rounded=0;exitX=0.004;exitY=0.388;exitDx=0;exitDy=0;exitPerimeter=0;startFill=1;entryX=1;entryY=0.5;entryDx=0;entryDy=0;entryPerimeter=0;fontSize=13;" parent="-lDIsB3-adEhukLgf9ZX-1" source="-lDIsB3-adEhukLgf9ZX-21" target="-lDIsB3-adEhukLgf9ZX-11" edge="1">
          <mxGeometry x="-0.1931" y="-23" width="160" relative="1" as="geometry">
            <mxPoint x="390" y="1030" as="sourcePoint" />
            <mxPoint x="290" y="700" as="targetPoint" />
            <mxPoint as="offset" />
          </mxGeometry>
        </mxCell>
        <mxCell id="-lDIsB3-adEhukLgf9ZX-30" value="" style="edgeStyle=none;html=1;startArrow=block;endArrow=none;startSize=12;verticalAlign=bottom;dashed=1;labelBackgroundColor=none;rounded=0;entryX=1;entryY=0.588;entryDx=0;entryDy=0;entryPerimeter=0;startFill=1;exitX=0.002;exitY=0.588;exitDx=0;exitDy=0;exitPerimeter=0;" parent="-lDIsB3-adEhukLgf9ZX-1" source="vMdRkhXVXesA4k0sx_kw-1" target="-lDIsB3-adEhukLgf9ZX-3" edge="1">
          <mxGeometry width="160" relative="1" as="geometry">
            <mxPoint x="320" y="370" as="sourcePoint" />
            <mxPoint x="410" y="480" as="targetPoint" />
          </mxGeometry>
        </mxCell>
        <mxCell id="qBFNL5BBxlX2cQH9Al6T-0" value="HTTPS" style="edgeLabel;html=1;align=center;verticalAlign=middle;resizable=0;points=[];fontSize=13;" parent="-lDIsB3-adEhukLgf9ZX-30" vertex="1" connectable="0">
          <mxGeometry x="0.0495" y="-8" relative="1" as="geometry">
            <mxPoint as="offset" />
          </mxGeometry>
        </mxCell>
        <object placeholders="1" c4Name="Usuarios Odoo" c4Type="Person" c4Description="Usuarios del Sistema" label="&lt;font style=&quot;font-size: 16px&quot;&gt;&lt;b&gt;%c4Name%&lt;/b&gt;&lt;/font&gt;&lt;div&gt;[%c4Type%]&lt;/div&gt;&lt;br&gt;&lt;div&gt;&lt;font style=&quot;font-size: 11px&quot;&gt;&lt;font color=&quot;#cccccc&quot;&gt;%c4Description%&lt;/font&gt;&lt;/div&gt;" id="vMdRkhXVXesA4k0sx_kw-0">
          <mxCell style="html=1;fontSize=11;dashed=0;whiteSpace=wrap;fillColor=#083F75;strokeColor=#06315C;fontColor=#ffffff;shape=mxgraph.c4.person2;align=center;metaEdit=1;points=[[0.5,0,0],[1,0.5,0],[1,0.75,0],[0.75,1,0],[0.5,1,0],[0.25,1,0],[0,0.75,0],[0,0.5,0]];resizable=0;" parent="-lDIsB3-adEhukLgf9ZX-1" vertex="1">
            <mxGeometry x="290" y="-10" width="200" height="180" as="geometry" />
          </mxCell>
        </object>
        <object placeholders="1" c4Name="Servidor Odoo" c4Type="Container" c4Technology="" c4Description="Servidor ERP ODOO" label="&lt;font style=&quot;font-size: 16px&quot;&gt;&lt;b&gt;%c4Name%&lt;/b&gt;&lt;/font&gt;&lt;div&gt;[%c4Type%: %c4Technology%]&lt;/div&gt;&lt;br&gt;&lt;div&gt;&lt;font style=&quot;font-size: 11px&quot;&gt;&lt;font color=&quot;#E6E6E6&quot;&gt;%c4Description%&lt;/font&gt;&lt;/div&gt;" id="vMdRkhXVXesA4k0sx_kw-1">
          <mxCell style="rounded=1;whiteSpace=wrap;html=1;fontSize=11;labelBackgroundColor=none;fillColor=#23A2D9;fontColor=#ffffff;align=center;arcSize=10;strokeColor=#0E7DAD;metaEdit=1;resizable=0;points=[[0.25,0,0],[0.5,0,0],[0.75,0,0],[1,0.25,0],[1,0.5,0],[1,0.75,0],[0.75,1,0],[0.5,1,0],[0.25,1,0],[0,0.75,0],[0,0.5,0],[0,0.25,0]];" parent="-lDIsB3-adEhukLgf9ZX-1" vertex="1">
            <mxGeometry x="370" y="310" width="240" height="120" as="geometry" />
          </mxCell>
        </object>
        <mxCell id="vMdRkhXVXesA4k0sx_kw-2" value="Comexión mediante HTTPS" style="edgeStyle=none;html=1;startArrow=block;endArrow=none;startSize=12;verticalAlign=bottom;dashed=1;labelBackgroundColor=none;rounded=0;exitX=0.183;exitY=-0.012;exitDx=0;exitDy=0;exitPerimeter=0;startFill=1;entryX=0.544;entryY=0.992;entryDx=0;entryDy=0;entryPerimeter=0;fontSize=13;" parent="-lDIsB3-adEhukLgf9ZX-1" source="-lDIsB3-adEhukLgf9ZX-11" target="vMdRkhXVXesA4k0sx_kw-1" edge="1">
          <mxGeometry x="-0.1634" y="41" width="160" relative="1" as="geometry">
            <mxPoint x="702" y="440" as="sourcePoint" />
            <mxPoint x="660" y="580" as="targetPoint" />
            <mxPoint as="offset" />
          </mxGeometry>
        </mxCell>
      </root>
    </mxGraphModel>
  </diagram>
  <diagram name="Diagrama C4-Componente" id="j78OUeCK73BZALlSyp7K">
    <mxGraphModel dx="2501" dy="936" grid="1" gridSize="10" guides="1" tooltips="1" connect="1" arrows="1" fold="1" page="1" pageScale="1" pageWidth="827" pageHeight="1169" math="0" shadow="0">
      <root>
        <mxCell id="wPMBU0aHOdNjjrVcCQsU-0" />
        <mxCell id="wPMBU0aHOdNjjrVcCQsU-1" parent="wPMBU0aHOdNjjrVcCQsU-0" />
        <mxCell id="wPMBU0aHOdNjjrVcCQsU-2" value="" style="edgeStyle=orthogonalEdgeStyle;rounded=0;orthogonalLoop=1;jettySize=auto;html=1;" parent="wPMBU0aHOdNjjrVcCQsU-1" source="wPMBU0aHOdNjjrVcCQsU-3" target="wPMBU0aHOdNjjrVcCQsU-4" edge="1">
          <mxGeometry relative="1" as="geometry" />
        </mxCell>
        <object placeholders="1" c4Name="Componente Vista" c4Type="Componente" c4Description="Componente Vista" label="&lt;font style=&quot;font-size: 16px&quot;&gt;&lt;b&gt;%c4Name%&lt;/b&gt;&lt;/font&gt;&lt;div&gt;[%c4Type%]&lt;/div&gt;&lt;br&gt;&lt;div&gt;&lt;font style=&quot;font-size: 11px&quot;&gt;&lt;font color=&quot;#cccccc&quot;&gt;%c4Description%&lt;/font&gt;&lt;/div&gt;" id="wPMBU0aHOdNjjrVcCQsU-3">
          <mxCell style="rounded=1;whiteSpace=wrap;html=1;labelBackgroundColor=none;fillColor=#1061B0;fontColor=#ffffff;align=center;arcSize=10;strokeColor=#0D5091;metaEdit=1;resizable=0;points=[[0.25,0,0],[0.5,0,0],[0.75,0,0],[1,0.25,0],[1,0.5,0],[1,0.75,0],[0.75,1,0],[0.5,1,0],[0.25,1,0],[0,0.75,0],[0,0.5,0],[0,0.25,0]];" parent="wPMBU0aHOdNjjrVcCQsU-1" vertex="1">
            <mxGeometry y="220" width="240" height="120" as="geometry" />
          </mxCell>
        </object>
        <object placeholders="1" c4Name="Componente Seguridad" c4Type="Software System" c4Description="Componente Seguridad" label="&lt;font style=&quot;font-size: 16px&quot;&gt;&lt;b&gt;%c4Name%&lt;/b&gt;&lt;/font&gt;&lt;div&gt;[%c4Type%]&lt;/div&gt;&lt;br&gt;&lt;div&gt;&lt;font style=&quot;font-size: 11px&quot;&gt;&lt;font color=&quot;#cccccc&quot;&gt;%c4Description%&lt;/font&gt;&lt;/div&gt;" id="wPMBU0aHOdNjjrVcCQsU-4">
          <mxCell style="rounded=1;whiteSpace=wrap;html=1;labelBackgroundColor=none;fillColor=#1061B0;fontColor=#ffffff;align=center;arcSize=10;strokeColor=#0D5091;metaEdit=1;resizable=0;points=[[0.25,0,0],[0.5,0,0],[0.75,0,0],[1,0.25,0],[1,0.5,0],[1,0.75,0],[0.75,1,0],[0.5,1,0],[0.25,1,0],[0,0.75,0],[0,0.5,0],[0,0.25,0]];" parent="wPMBU0aHOdNjjrVcCQsU-1" vertex="1">
            <mxGeometry y="400" width="240" height="120" as="geometry" />
          </mxCell>
        </object>
        <object placeholders="1" c4Type="BD" c4Container="Base de Datos" c4Technology="PostgreSQL" c4Description="Base de datos" label="&lt;font style=&quot;font-size: 16px&quot;&gt;&lt;b&gt;%c4Type%&lt;/b&gt;&lt;/font&gt;&lt;div&gt;[%c4Container%:&amp;nbsp;%c4Technology%]&lt;/div&gt;&lt;br&gt;&lt;div&gt;&lt;font style=&quot;font-size: 11px&quot;&gt;&lt;font color=&quot;#E6E6E6&quot;&gt;%c4Description%&lt;/font&gt;&lt;/div&gt;" id="wPMBU0aHOdNjjrVcCQsU-7">
          <mxCell style="shape=cylinder3;size=15;whiteSpace=wrap;html=1;boundedLbl=1;rounded=0;labelBackgroundColor=none;fillColor=#0050ef;fontSize=12;fontColor=#ffffff;align=center;strokeColor=#001DBC;metaEdit=1;points=[[0.5,0,0],[1,0.25,0],[1,0.5,0],[1,0.75,0],[0.5,1,0],[0,0.75,0],[0,0.5,0],[0,0.25,0]];resizable=0;" parent="wPMBU0aHOdNjjrVcCQsU-1" vertex="1">
            <mxGeometry x="100" y="990" width="240" height="120" as="geometry" />
          </mxCell>
        </object>
        <object placeholders="1" c4Name="Diagrama Componente Integración Odoo" c4Type="SystemScopeBoundary" c4Application="Diagrama Componente Integración Odoo" label="&lt;font style=&quot;font-size: 16px&quot;&gt;&lt;b&gt;&lt;div style=&quot;text-align: left&quot;&gt;%c4Name%&lt;/div&gt;&lt;/b&gt;&lt;/font&gt;&lt;div style=&quot;text-align: left&quot;&gt;[%c4Application%]&lt;/div&gt;" id="wPMBU0aHOdNjjrVcCQsU-9">
          <mxCell style="rounded=1;fontSize=11;whiteSpace=wrap;html=1;dashed=1;arcSize=20;fillColor=none;strokeColor=#666666;fontColor=#333333;labelBackgroundColor=none;align=left;verticalAlign=bottom;labelBorderColor=none;spacingTop=0;spacing=10;dashPattern=8 4;metaEdit=1;rotatable=0;perimeter=rectanglePerimeter;noLabel=0;labelPadding=0;allowArrows=0;connectable=0;expand=0;recursiveResize=0;editable=1;pointerEvents=0;absoluteArcSize=1;points=[[0.25,0,0],[0.5,0,0],[0.75,0,0],[1,0.25,0],[1,0.5,0],[1,0.75,0],[0.75,1,0],[0.5,1,0],[0.25,1,0],[0,0.75,0],[0,0.5,0],[0,0.25,0]];" parent="wPMBU0aHOdNjjrVcCQsU-1" vertex="1">
            <mxGeometry x="-50" y="200" width="1280" height="730" as="geometry" />
          </mxCell>
        </object>
        <object placeholders="1" c4Type="Odoo WEB" c4Container="Container" c4Technology="Python" c4Description="odoo WEB para ventas compras" label="&lt;font style=&quot;font-size: 16px&quot;&gt;&lt;b&gt;%c4Type%&lt;/b&gt;&lt;/font&gt;&lt;div&gt;[%c4Container%:&amp;nbsp;%c4Technology%]&lt;/div&gt;&lt;br&gt;&lt;div&gt;&lt;font style=&quot;font-size: 11px&quot;&gt;&lt;font color=&quot;#E6E6E6&quot;&gt;%c4Description%&lt;/font&gt;&lt;/div&gt;" id="wPMBU0aHOdNjjrVcCQsU-11">
          <mxCell style="shape=mxgraph.c4.webBrowserContainer2;whiteSpace=wrap;html=1;boundedLbl=1;rounded=0;labelBackgroundColor=none;strokeColor=#118ACD;fillColor=#23A2D9;strokeColor=#118ACD;strokeColor2=#0E7DAD;fontSize=12;fontColor=#ffffff;align=center;metaEdit=1;points=[[0.5,0,0],[1,0.25,0],[1,0.5,0],[1,0.75,0],[0.5,1,0],[0,0.75,0],[0,0.5,0],[0,0.25,0]];resizable=0;" parent="wPMBU0aHOdNjjrVcCQsU-1" vertex="1">
            <mxGeometry width="240" height="160" as="geometry" />
          </mxCell>
        </object>
        <object placeholders="1" c4Name="Componente Manejo Redes Sociales" c4Type="Component" c4Description="Componente Manejo Redes Sociales" label="&lt;font style=&quot;font-size: 16px&quot;&gt;&lt;b&gt;%c4Name%&lt;/b&gt;&lt;/font&gt;&lt;div&gt;[%c4Type%]&lt;/div&gt;&lt;br&gt;&lt;div&gt;&lt;font style=&quot;font-size: 11px&quot;&gt;&lt;font color=&quot;#cccccc&quot;&gt;%c4Description%&lt;/font&gt;&lt;/div&gt;" id="wPMBU0aHOdNjjrVcCQsU-12">
          <mxCell style="rounded=1;whiteSpace=wrap;html=1;labelBackgroundColor=none;fillColor=#1061B0;fontColor=#ffffff;align=center;arcSize=10;strokeColor=#0D5091;metaEdit=1;resizable=0;points=[[0.25,0,0],[0.5,0,0],[0.75,0,0],[1,0.25,0],[1,0.5,0],[1,0.75,0],[0.75,1,0],[0.5,1,0],[0.25,1,0],[0,0.75,0],[0,0.5,0],[0,0.25,0]];" parent="wPMBU0aHOdNjjrVcCQsU-1" vertex="1">
            <mxGeometry x="430" y="230" width="240" height="120" as="geometry" />
          </mxCell>
        </object>
        <object placeholders="1" c4Name="Componente Manejo Facturacion" c4Type="Component" c4Description="Componente Manejo Facturacion" label="&lt;font style=&quot;font-size: 16px&quot;&gt;&lt;b&gt;%c4Name%&lt;/b&gt;&lt;/font&gt;&lt;div&gt;[%c4Type%]&lt;/div&gt;&lt;br&gt;&lt;div&gt;&lt;font style=&quot;font-size: 11px&quot;&gt;&lt;font color=&quot;#cccccc&quot;&gt;%c4Description%&lt;/font&gt;&lt;/div&gt;" id="wPMBU0aHOdNjjrVcCQsU-13">
          <mxCell style="rounded=1;whiteSpace=wrap;html=1;labelBackgroundColor=none;fillColor=#1061B0;fontColor=#ffffff;align=center;arcSize=10;strokeColor=#0D5091;metaEdit=1;resizable=0;points=[[0.25,0,0],[0.5,0,0],[0.75,0,0],[1,0.25,0],[1,0.5,0],[1,0.75,0],[0.75,1,0],[0.5,1,0],[0.25,1,0],[0,0.75,0],[0,0.5,0],[0,0.25,0]];" parent="wPMBU0aHOdNjjrVcCQsU-1" vertex="1">
            <mxGeometry x="690" y="230" width="240" height="120" as="geometry" />
          </mxCell>
        </object>
        <mxCell id="wPMBU0aHOdNjjrVcCQsU-14" value="Usa" style="edgeStyle=none;html=1;startArrow=block;endArrow=none;startSize=12;verticalAlign=bottom;dashed=1;labelBackgroundColor=none;rounded=0;entryX=0.448;entryY=1.004;entryDx=0;entryDy=0;entryPerimeter=0;exitX=0.5;exitY=0;exitDx=0;exitDy=0;exitPerimeter=0;startFill=1;" parent="wPMBU0aHOdNjjrVcCQsU-1" source="wPMBU0aHOdNjjrVcCQsU-3" edge="1">
          <mxGeometry width="160" relative="1" as="geometry">
            <mxPoint x="380" y="320" as="sourcePoint" />
            <mxPoint x="117.51999999999998" y="150.48000000000002" as="targetPoint" />
          </mxGeometry>
        </mxCell>
        <mxCell id="wPMBU0aHOdNjjrVcCQsU-15" value="&lt;font style=&quot;font-size: 13px;&quot;&gt;Usa&lt;/font&gt;" style="edgeStyle=none;html=1;startArrow=block;endArrow=none;startSize=12;verticalAlign=bottom;dashed=1;labelBackgroundColor=none;rounded=0;startFill=1;" parent="wPMBU0aHOdNjjrVcCQsU-1" source="wPMBU0aHOdNjjrVcCQsU-4" edge="1">
          <mxGeometry x="0.3333" y="-20" width="160" relative="1" as="geometry">
            <mxPoint x="130" y="230" as="sourcePoint" />
            <mxPoint x="120" y="340" as="targetPoint" />
            <mxPoint as="offset" />
          </mxGeometry>
        </mxCell>
        <mxCell id="wPMBU0aHOdNjjrVcCQsU-17" value="Usa" style="edgeStyle=none;html=1;startArrow=block;endArrow=none;startSize=12;verticalAlign=bottom;dashed=1;labelBackgroundColor=none;rounded=0;startFill=1;exitX=0.004;exitY=0.383;exitDx=0;exitDy=0;exitPerimeter=0;fontSize=13;" parent="wPMBU0aHOdNjjrVcCQsU-1" source="wPMBU0aHOdNjjrVcCQsU-7" target="wPMBU0aHOdNjjrVcCQsU-4" edge="1">
          <mxGeometry x="-0.0826" y="-21" width="160" relative="1" as="geometry">
            <mxPoint x="119.32999999999998" y="750" as="sourcePoint" />
            <mxPoint x="119.32999999999998" y="690" as="targetPoint" />
            <mxPoint as="offset" />
          </mxGeometry>
        </mxCell>
        <mxCell id="wPMBU0aHOdNjjrVcCQsU-18" value="Usa" style="edgeStyle=none;html=1;startArrow=block;endArrow=none;startSize=12;verticalAlign=bottom;dashed=1;labelBackgroundColor=none;rounded=0;startFill=1;exitX=1;exitY=0.25;exitDx=0;exitDy=0;exitPerimeter=0;entryX=0.5;entryY=1;entryDx=0;entryDy=0;entryPerimeter=0;fontSize=13;" parent="wPMBU0aHOdNjjrVcCQsU-1" source="wPMBU0aHOdNjjrVcCQsU-7" target="wPMBU0aHOdNjjrVcCQsU-13" edge="1">
          <mxGeometry width="160" relative="1" as="geometry">
            <mxPoint x="251" y="846" as="sourcePoint" />
            <mxPoint x="129.32999999999998" y="700" as="targetPoint" />
          </mxGeometry>
        </mxCell>
        <mxCell id="wPMBU0aHOdNjjrVcCQsU-19" value="Usa" style="edgeStyle=none;html=1;startArrow=block;endArrow=none;startSize=12;verticalAlign=bottom;dashed=1;labelBackgroundColor=none;rounded=0;exitX=0.5;exitY=0;exitDx=0;exitDy=0;exitPerimeter=0;startFill=1;entryX=0.99;entryY=0.884;entryDx=0;entryDy=0;entryPerimeter=0;" parent="wPMBU0aHOdNjjrVcCQsU-1" source="wPMBU0aHOdNjjrVcCQsU-12" target="wPMBU0aHOdNjjrVcCQsU-11" edge="1">
          <mxGeometry width="160" relative="1" as="geometry">
            <mxPoint x="549.3299999999999" y="210" as="sourcePoint" />
            <mxPoint x="549" y="80" as="targetPoint" />
            <mxPoint as="offset" />
            <Array as="points">
              <mxPoint x="550" y="140" />
            </Array>
          </mxGeometry>
        </mxCell>
        <mxCell id="wPMBU0aHOdNjjrVcCQsU-20" value="Usa" style="edgeStyle=none;html=1;startArrow=block;endArrow=none;startSize=12;verticalAlign=bottom;dashed=1;labelBackgroundColor=none;rounded=0;entryX=0.25;entryY=1;entryDx=0;entryDy=0;entryPerimeter=0;startFill=1;exitX=0.417;exitY=0.042;exitDx=0;exitDy=0;exitPerimeter=0;fontSize=13;" parent="wPMBU0aHOdNjjrVcCQsU-1" source="wPMBU0aHOdNjjrVcCQsU-7" target="wPMBU0aHOdNjjrVcCQsU-12" edge="1">
          <mxGeometry width="160" relative="1" as="geometry">
            <mxPoint x="559" y="399" as="sourcePoint" />
            <mxPoint x="559.3299999999999" y="349" as="targetPoint" />
          </mxGeometry>
        </mxCell>
        <object placeholders="1" c4Name="Boton de Pagos Institucio Fiananciera" c4Type="Software System" c4Description="Boton de pagos" label="&lt;font style=&quot;font-size: 16px&quot;&gt;&lt;b&gt;%c4Name%&lt;/b&gt;&lt;/font&gt;&lt;div&gt;[%c4Type%]&lt;/div&gt;&lt;br&gt;&lt;div&gt;&lt;font style=&quot;font-size: 11px&quot;&gt;&lt;font color=&quot;#cccccc&quot;&gt;%c4Description%&lt;/font&gt;&lt;/div&gt;" id="wPMBU0aHOdNjjrVcCQsU-23">
          <mxCell style="rounded=1;whiteSpace=wrap;html=1;labelBackgroundColor=none;fillColor=#8C8496;fontColor=#ffffff;align=center;arcSize=10;strokeColor=#736782;metaEdit=1;resizable=0;points=[[0.25,0,0],[0.5,0,0],[0.75,0,0],[1,0.25,0],[1,0.5,0],[1,0.75,0],[0.75,1,0],[0.5,1,0],[0.25,1,0],[0,0.75,0],[0,0.5,0],[0,0.25,0]];" parent="wPMBU0aHOdNjjrVcCQsU-1" vertex="1">
            <mxGeometry x="1210" y="990" width="240" height="120" as="geometry" />
          </mxCell>
        </object>
        <object placeholders="1" c4Name="Facturación electrónica Proveedor" c4Type="Software System" c4Description="Facturación Electronica" label="&lt;font style=&quot;font-size: 16px&quot;&gt;&lt;b&gt;%c4Name%&lt;/b&gt;&lt;/font&gt;&lt;div&gt;[%c4Type%]&lt;/div&gt;&lt;br&gt;&lt;div&gt;&lt;font style=&quot;font-size: 11px&quot;&gt;&lt;font color=&quot;#cccccc&quot;&gt;%c4Description%&lt;/font&gt;&lt;/div&gt;" id="wPMBU0aHOdNjjrVcCQsU-24">
          <mxCell style="rounded=1;whiteSpace=wrap;html=1;labelBackgroundColor=none;fillColor=#8C8496;fontColor=#ffffff;align=center;arcSize=10;strokeColor=#736782;metaEdit=1;resizable=0;points=[[0.25,0,0],[0.5,0,0],[0.75,0,0],[1,0.25,0],[1,0.5,0],[1,0.75,0],[0.75,1,0],[0.5,1,0],[0.25,1,0],[0,0.75,0],[0,0.5,0],[0,0.25,0]];" parent="wPMBU0aHOdNjjrVcCQsU-1" vertex="1">
            <mxGeometry x="1470" y="990" width="240" height="120" as="geometry" />
          </mxCell>
        </object>
        <object placeholders="1" c4Name="WhatsApp" c4Type="Software System" c4Description="Red Social WhatsApp" label="&lt;font style=&quot;font-size: 16px&quot;&gt;&lt;b&gt;%c4Name%&lt;/b&gt;&lt;/font&gt;&lt;div&gt;[%c4Type%]&lt;/div&gt;&lt;br&gt;&lt;div&gt;&lt;font style=&quot;font-size: 11px&quot;&gt;&lt;font color=&quot;#cccccc&quot;&gt;%c4Description%&lt;/font&gt;&lt;/div&gt;" id="wPMBU0aHOdNjjrVcCQsU-25">
          <mxCell style="rounded=1;whiteSpace=wrap;html=1;labelBackgroundColor=none;fillColor=#8C8496;fontColor=#ffffff;align=center;arcSize=10;strokeColor=#736782;metaEdit=1;resizable=0;points=[[0.25,0,0],[0.5,0,0],[0.75,0,0],[1,0.25,0],[1,0.5,0],[1,0.75,0],[0.75,1,0],[0.5,1,0],[0.25,1,0],[0,0.75,0],[0,0.5,0],[0,0.25,0]];" parent="wPMBU0aHOdNjjrVcCQsU-1" vertex="1">
            <mxGeometry x="950" y="990" width="240" height="120" as="geometry" />
          </mxCell>
        </object>
        <object placeholders="1" c4Name="Facebook" c4Type="Software System" c4Description="Red Social Facebook" label="&lt;font style=&quot;font-size: 16px&quot;&gt;&lt;b&gt;%c4Name%&lt;/b&gt;&lt;/font&gt;&lt;div&gt;[%c4Type%]&lt;/div&gt;&lt;br&gt;&lt;div&gt;&lt;font style=&quot;font-size: 11px&quot;&gt;&lt;font color=&quot;#cccccc&quot;&gt;%c4Description%&lt;/font&gt;&lt;/div&gt;" id="wPMBU0aHOdNjjrVcCQsU-26">
          <mxCell style="rounded=1;whiteSpace=wrap;html=1;labelBackgroundColor=none;fillColor=#8C8496;fontColor=#ffffff;align=center;arcSize=10;strokeColor=#736782;metaEdit=1;resizable=0;points=[[0.25,0,0],[0.5,0,0],[0.75,0,0],[1,0.25,0],[1,0.5,0],[1,0.75,0],[0.75,1,0],[0.5,1,0],[0.25,1,0],[0,0.75,0],[0,0.5,0],[0,0.25,0]];" parent="wPMBU0aHOdNjjrVcCQsU-1" vertex="1">
            <mxGeometry x="680" y="1000" width="240" height="120" as="geometry" />
          </mxCell>
        </object>
        <mxCell id="wPMBU0aHOdNjjrVcCQsU-34" value="Usa API" style="edgeStyle=none;html=1;startArrow=block;endArrow=none;startSize=12;verticalAlign=bottom;dashed=1;labelBackgroundColor=none;rounded=0;exitX=0.5;exitY=0;exitDx=0;exitDy=0;exitPerimeter=0;startFill=1;entryX=0.5;entryY=1;entryDx=0;entryDy=0;entryPerimeter=0;fontSize=13;" parent="wPMBU0aHOdNjjrVcCQsU-1" source="wPMBU0aHOdNjjrVcCQsU-26" target="3SucCGDhLkkwkRkmOv5v-8" edge="1">
          <mxGeometry x="-0.0909" y="20" width="160" relative="1" as="geometry">
            <mxPoint x="1680" y="170" as="sourcePoint" />
            <mxPoint x="1510" y="320" as="targetPoint" />
            <mxPoint as="offset" />
          </mxGeometry>
        </mxCell>
        <mxCell id="3SucCGDhLkkwkRkmOv5v-0" value="Usa" style="edgeStyle=none;html=1;startArrow=block;endArrow=none;startSize=12;verticalAlign=bottom;dashed=1;labelBackgroundColor=none;rounded=0;startFill=1;" parent="wPMBU0aHOdNjjrVcCQsU-1" edge="1">
          <mxGeometry width="160" relative="1" as="geometry">
            <mxPoint x="816.217391304348" y="230" as="sourcePoint" />
            <mxPoint x="240" y="100" as="targetPoint" />
            <mxPoint as="offset" />
            <Array as="points">
              <mxPoint x="816" y="100" />
            </Array>
          </mxGeometry>
        </mxCell>
        <mxCell id="3SucCGDhLkkwkRkmOv5v-1" value="Usa" style="edgeStyle=none;html=1;startArrow=block;endArrow=none;startSize=12;verticalAlign=bottom;dashed=1;labelBackgroundColor=none;rounded=0;startFill=1;entryX=1;entryY=0.313;entryDx=0;entryDy=0;entryPerimeter=0;exitX=0.456;exitY=0;exitDx=0;exitDy=0;exitPerimeter=0;" parent="wPMBU0aHOdNjjrVcCQsU-1" source="3SucCGDhLkkwkRkmOv5v-2" target="wPMBU0aHOdNjjrVcCQsU-11" edge="1">
          <mxGeometry width="160" relative="1" as="geometry">
            <mxPoint x="1060" y="220" as="sourcePoint" />
            <mxPoint x="250" y="50" as="targetPoint" />
            <mxPoint as="offset" />
            <Array as="points">
              <mxPoint x="1059.52" y="50" />
            </Array>
          </mxGeometry>
        </mxCell>
        <object placeholders="1" c4Name="Componente Manejo Facturacion" c4Type="Component" c4Description="Componente Manejo Facturacion" label="&lt;font style=&quot;font-size: 16px&quot;&gt;&lt;b&gt;%c4Name%&lt;/b&gt;&lt;/font&gt;&lt;div&gt;[%c4Type%]&lt;/div&gt;&lt;br&gt;&lt;div&gt;&lt;font style=&quot;font-size: 11px&quot;&gt;&lt;font color=&quot;#cccccc&quot;&gt;%c4Description%&lt;/font&gt;&lt;/div&gt;" id="3SucCGDhLkkwkRkmOv5v-2">
          <mxCell style="rounded=1;whiteSpace=wrap;html=1;labelBackgroundColor=none;fillColor=#1061B0;fontColor=#ffffff;align=center;arcSize=10;strokeColor=#0D5091;metaEdit=1;resizable=0;points=[[0.25,0,0],[0.5,0,0],[0.75,0,0],[1,0.25,0],[1,0.5,0],[1,0.75,0],[0.75,1,0],[0.5,1,0],[0.25,1,0],[0,0.75,0],[0,0.5,0],[0,0.25,0]];" parent="wPMBU0aHOdNjjrVcCQsU-1" vertex="1">
            <mxGeometry x="950" y="230" width="240" height="120" as="geometry" />
          </mxCell>
        </object>
        <mxCell id="3SucCGDhLkkwkRkmOv5v-3" value="Usa" style="edgeStyle=none;html=1;startArrow=block;endArrow=none;startSize=12;verticalAlign=bottom;dashed=1;labelBackgroundColor=none;rounded=0;startFill=1;exitX=1;exitY=0.25;exitDx=0;exitDy=0;exitPerimeter=0;entryX=0.169;entryY=0.988;entryDx=0;entryDy=0;entryPerimeter=0;fontSize=13;" parent="wPMBU0aHOdNjjrVcCQsU-1" target="3SucCGDhLkkwkRkmOv5v-2" edge="1">
          <mxGeometry width="160" relative="1" as="geometry">
            <mxPoint x="350" y="1030" as="sourcePoint" />
            <mxPoint x="1070" y="350" as="targetPoint" />
          </mxGeometry>
        </mxCell>
        <object placeholders="1" c4Name="Apache Camel" c4Type="Component" c4Description="Apache Camel" label="&lt;font style=&quot;font-size: 16px&quot;&gt;&lt;b&gt;%c4Name%&lt;/b&gt;&lt;/font&gt;&lt;div&gt;[%c4Type%]&lt;/div&gt;&lt;br&gt;&lt;div&gt;&lt;font style=&quot;font-size: 11px&quot;&gt;&lt;font color=&quot;#cccccc&quot;&gt;%c4Description%&lt;/font&gt;&lt;/div&gt;" id="3SucCGDhLkkwkRkmOv5v-4">
          <mxCell style="rounded=1;whiteSpace=wrap;html=1;labelBackgroundColor=none;fillColor=#1061B0;fontColor=#ffffff;align=center;arcSize=10;strokeColor=#0D5091;metaEdit=1;resizable=0;points=[[0.25,0,0],[0.5,0,0],[0.75,0,0],[1,0.25,0],[1,0.5,0],[1,0.75,0],[0.75,1,0],[0.5,1,0],[0.25,1,0],[0,0.75,0],[0,0.5,0],[0,0.25,0]];" parent="wPMBU0aHOdNjjrVcCQsU-1" vertex="1">
            <mxGeometry x="900" y="585" width="240" height="120" as="geometry" />
          </mxCell>
        </object>
        <mxCell id="3SucCGDhLkkwkRkmOv5v-5" value="Usa" style="edgeStyle=none;html=1;startArrow=block;endArrow=none;startSize=12;verticalAlign=bottom;dashed=1;labelBackgroundColor=none;rounded=0;entryX=0.66;entryY=1;entryDx=0;entryDy=0;entryPerimeter=0;startFill=1;fontSize=13;" parent="wPMBU0aHOdNjjrVcCQsU-1" source="3SucCGDhLkkwkRkmOv5v-4" target="wPMBU0aHOdNjjrVcCQsU-12" edge="1">
          <mxGeometry width="160" relative="1" as="geometry">
            <mxPoint x="210" y="1005" as="sourcePoint" />
            <mxPoint x="569.3299999999999" y="359" as="targetPoint" />
          </mxGeometry>
        </mxCell>
        <mxCell id="3SucCGDhLkkwkRkmOv5v-6" value="Usa" style="edgeStyle=none;html=1;startArrow=block;endArrow=none;startSize=12;verticalAlign=bottom;dashed=1;labelBackgroundColor=none;rounded=0;entryX=0.621;entryY=1;entryDx=0;entryDy=0;entryPerimeter=0;startFill=1;exitX=0.5;exitY=0;exitDx=0;exitDy=0;exitPerimeter=0;fontSize=13;" parent="wPMBU0aHOdNjjrVcCQsU-1" source="3SucCGDhLkkwkRkmOv5v-4" target="wPMBU0aHOdNjjrVcCQsU-13" edge="1">
          <mxGeometry width="160" relative="1" as="geometry">
            <mxPoint x="1180" y="578" as="sourcePoint" />
            <mxPoint x="820" y="342" as="targetPoint" />
          </mxGeometry>
        </mxCell>
        <mxCell id="3SucCGDhLkkwkRkmOv5v-7" value="Usa" style="edgeStyle=none;html=1;startArrow=block;endArrow=none;startSize=12;verticalAlign=bottom;dashed=1;labelBackgroundColor=none;rounded=0;entryX=0.825;entryY=1;entryDx=0;entryDy=0;entryPerimeter=0;startFill=1;exitX=0.696;exitY=0.017;exitDx=0;exitDy=0;exitPerimeter=0;fontSize=13;" parent="wPMBU0aHOdNjjrVcCQsU-1" source="3SucCGDhLkkwkRkmOv5v-4" target="3SucCGDhLkkwkRkmOv5v-2" edge="1">
          <mxGeometry width="160" relative="1" as="geometry">
            <mxPoint x="1060" y="605" as="sourcePoint" />
            <mxPoint x="1148" y="360" as="targetPoint" />
          </mxGeometry>
        </mxCell>
        <object placeholders="1" c4Name="camel-facebook" c4Type="Component" c4Description="Componente" label="&lt;font style=&quot;font-size: 16px&quot;&gt;&lt;b&gt;%c4Name%&lt;/b&gt;&lt;/font&gt;&lt;div&gt;[%c4Type%]&lt;/div&gt;&lt;br&gt;&lt;div&gt;&lt;font style=&quot;font-size: 11px&quot;&gt;&lt;font color=&quot;#cccccc&quot;&gt;%c4Description%&lt;/font&gt;&lt;/div&gt;" id="3SucCGDhLkkwkRkmOv5v-8">
          <mxCell style="rounded=1;whiteSpace=wrap;html=1;labelBackgroundColor=none;fillColor=#60a917;fontColor=#ffffff;align=center;arcSize=10;strokeColor=#2D7600;metaEdit=1;resizable=0;points=[[0.25,0,0],[0.5,0,0],[0.75,0,0],[1,0.25,0],[1,0.5,0],[1,0.75,0],[0.75,1,0],[0.5,1,0],[0.25,1,0],[0,0.75,0],[0,0.5,0],[0,0.25,0]];" parent="wPMBU0aHOdNjjrVcCQsU-1" vertex="1">
            <mxGeometry x="680" y="770" width="240" height="120" as="geometry" />
          </mxCell>
        </object>
        <object placeholders="1" c4Name="camel-whatsapp" c4Type="Component" c4Description="Componente" label="&lt;font style=&quot;font-size: 16px&quot;&gt;&lt;b&gt;%c4Name%&lt;/b&gt;&lt;/font&gt;&lt;div&gt;[%c4Type%]&lt;/div&gt;&lt;br&gt;&lt;div&gt;&lt;font style=&quot;font-size: 11px&quot;&gt;&lt;font color=&quot;#cccccc&quot;&gt;%c4Description%&lt;/font&gt;&lt;/div&gt;" id="3SucCGDhLkkwkRkmOv5v-9">
          <mxCell style="rounded=1;whiteSpace=wrap;html=1;labelBackgroundColor=none;fillColor=#60a917;fontColor=#ffffff;align=center;arcSize=10;strokeColor=#2D7600;metaEdit=1;resizable=0;points=[[0.25,0,0],[0.5,0,0],[0.75,0,0],[1,0.25,0],[1,0.5,0],[1,0.75,0],[0.75,1,0],[0.5,1,0],[0.25,1,0],[0,0.75,0],[0,0.5,0],[0,0.25,0]];" parent="wPMBU0aHOdNjjrVcCQsU-1" vertex="1">
            <mxGeometry x="940" y="770" width="240" height="120" as="geometry" />
          </mxCell>
        </object>
        <object placeholders="1" c4Name="camel-rest-started" c4Type="Component" c4Description="Componente" label="&lt;font style=&quot;font-size: 16px&quot;&gt;&lt;b&gt;%c4Name%&lt;/b&gt;&lt;/font&gt;&lt;div&gt;[%c4Type%]&lt;/div&gt;&lt;br&gt;&lt;div&gt;&lt;font style=&quot;font-size: 11px&quot;&gt;&lt;font color=&quot;#cccccc&quot;&gt;%c4Description%&lt;/font&gt;&lt;/div&gt;" id="3SucCGDhLkkwkRkmOv5v-10">
          <mxCell style="rounded=1;whiteSpace=wrap;html=1;labelBackgroundColor=none;fillColor=#60a917;fontColor=#ffffff;align=center;arcSize=10;strokeColor=#2D7600;metaEdit=1;resizable=0;points=[[0.25,0,0],[0.5,0,0],[0.75,0,0],[1,0.25,0],[1,0.5,0],[1,0.75,0],[0.75,1,0],[0.5,1,0],[0.25,1,0],[0,0.75,0],[0,0.5,0],[0,0.25,0]];" parent="wPMBU0aHOdNjjrVcCQsU-1" vertex="1">
            <mxGeometry x="1210" y="770" width="240" height="120" as="geometry" />
          </mxCell>
        </object>
        <object placeholders="1" c4Name="camel-http" c4Type="Component" c4Description="Componente" label="&lt;font style=&quot;font-size: 16px&quot;&gt;&lt;b&gt;%c4Name%&lt;/b&gt;&lt;/font&gt;&lt;div&gt;[%c4Type%]&lt;/div&gt;&lt;br&gt;&lt;div&gt;&lt;font style=&quot;font-size: 11px&quot;&gt;&lt;font color=&quot;#cccccc&quot;&gt;%c4Description%&lt;/font&gt;&lt;/div&gt;" id="3SucCGDhLkkwkRkmOv5v-11">
          <mxCell style="rounded=1;whiteSpace=wrap;html=1;labelBackgroundColor=none;fillColor=#60a917;fontColor=#ffffff;align=center;arcSize=10;strokeColor=#2D7600;metaEdit=1;resizable=0;points=[[0.25,0,0],[0.5,0,0],[0.75,0,0],[1,0.25,0],[1,0.5,0],[1,0.75,0],[0.75,1,0],[0.5,1,0],[0.25,1,0],[0,0.75,0],[0,0.5,0],[0,0.25,0]];" parent="wPMBU0aHOdNjjrVcCQsU-1" vertex="1">
            <mxGeometry x="1470" y="770" width="240" height="120" as="geometry" />
          </mxCell>
        </object>
        <mxCell id="3SucCGDhLkkwkRkmOv5v-12" value="Usa" style="edgeStyle=none;html=1;startArrow=block;endArrow=none;startSize=12;verticalAlign=bottom;dashed=1;labelBackgroundColor=none;rounded=0;startFill=1;exitX=0.607;exitY=-0.034;exitDx=0;exitDy=0;exitPerimeter=0;entryX=0.999;entryY=0.954;entryDx=0;entryDy=0;entryPerimeter=0;fontSize=13;" parent="wPMBU0aHOdNjjrVcCQsU-1" source="3SucCGDhLkkwkRkmOv5v-11" target="3SucCGDhLkkwkRkmOv5v-4" edge="1">
          <mxGeometry width="160" relative="1" as="geometry">
            <mxPoint x="1077" y="597" as="sourcePoint" />
            <mxPoint x="1690" y="690" as="targetPoint" />
          </mxGeometry>
        </mxCell>
        <mxCell id="3SucCGDhLkkwkRkmOv5v-13" value="Usa" style="edgeStyle=none;html=1;startArrow=block;endArrow=none;startSize=12;verticalAlign=bottom;dashed=1;labelBackgroundColor=none;rounded=0;startFill=1;exitX=0.5;exitY=0;exitDx=0;exitDy=0;exitPerimeter=0;entryX=0.678;entryY=1.007;entryDx=0;entryDy=0;entryPerimeter=0;fontSize=13;" parent="wPMBU0aHOdNjjrVcCQsU-1" source="3SucCGDhLkkwkRkmOv5v-10" target="3SucCGDhLkkwkRkmOv5v-4" edge="1">
          <mxGeometry width="160" relative="1" as="geometry">
            <mxPoint x="1626" y="776" as="sourcePoint" />
            <mxPoint x="1150" y="709" as="targetPoint" />
          </mxGeometry>
        </mxCell>
        <mxCell id="3SucCGDhLkkwkRkmOv5v-14" value="Usa" style="edgeStyle=none;html=1;startArrow=block;endArrow=none;startSize=12;verticalAlign=bottom;dashed=1;labelBackgroundColor=none;rounded=0;startFill=1;entryX=0.437;entryY=1.007;entryDx=0;entryDy=0;entryPerimeter=0;fontSize=13;" parent="wPMBU0aHOdNjjrVcCQsU-1" source="3SucCGDhLkkwkRkmOv5v-9" target="3SucCGDhLkkwkRkmOv5v-4" edge="1">
          <mxGeometry width="160" relative="1" as="geometry">
            <mxPoint x="1340" y="780" as="sourcePoint" />
            <mxPoint x="1073" y="716" as="targetPoint" />
          </mxGeometry>
        </mxCell>
        <mxCell id="3SucCGDhLkkwkRkmOv5v-16" value="Usa" style="edgeStyle=none;html=1;startArrow=block;endArrow=none;startSize=12;verticalAlign=bottom;dashed=1;labelBackgroundColor=none;rounded=0;startFill=1;exitX=0.345;exitY=0.001;exitDx=0;exitDy=0;exitPerimeter=0;entryX=0;entryY=0.75;entryDx=0;entryDy=0;entryPerimeter=0;fontSize=13;" parent="wPMBU0aHOdNjjrVcCQsU-1" source="3SucCGDhLkkwkRkmOv5v-8" target="3SucCGDhLkkwkRkmOv5v-4" edge="1">
          <mxGeometry width="160" relative="1" as="geometry">
            <mxPoint x="1020" y="780" as="sourcePoint" />
            <mxPoint x="753" y="716" as="targetPoint" />
          </mxGeometry>
        </mxCell>
        <mxCell id="3SucCGDhLkkwkRkmOv5v-17" value="Usa API" style="edgeStyle=none;html=1;startArrow=block;endArrow=none;startSize=12;verticalAlign=bottom;dashed=1;labelBackgroundColor=none;rounded=0;exitX=0.5;exitY=0;exitDx=0;exitDy=0;exitPerimeter=0;startFill=1;entryX=0.5;entryY=1;entryDx=0;entryDy=0;entryPerimeter=0;fontSize=13;" parent="wPMBU0aHOdNjjrVcCQsU-1" edge="1">
          <mxGeometry x="-0.0909" y="20" width="160" relative="1" as="geometry">
            <mxPoint x="1090" y="1000" as="sourcePoint" />
            <mxPoint x="1090" y="890" as="targetPoint" />
            <mxPoint as="offset" />
          </mxGeometry>
        </mxCell>
        <mxCell id="3SucCGDhLkkwkRkmOv5v-18" value="Envia Pago" style="edgeStyle=none;html=1;startArrow=none;endArrow=classic;verticalAlign=bottom;dashed=1;labelBackgroundColor=none;rounded=0;exitX=0.5;exitY=0;exitDx=0;exitDy=0;exitPerimeter=0;startFill=0;entryX=0.5;entryY=1;entryDx=0;entryDy=0;entryPerimeter=0;fontSize=13;endFill=1;" parent="wPMBU0aHOdNjjrVcCQsU-1" edge="1">
          <mxGeometry x="-0.0909" y="20" width="160" relative="1" as="geometry">
            <mxPoint x="1350" y="1000" as="sourcePoint" />
            <mxPoint x="1350" y="890" as="targetPoint" />
            <mxPoint as="offset" />
          </mxGeometry>
        </mxCell>
        <mxCell id="3SucCGDhLkkwkRkmOv5v-19" value="Envia Datos" style="edgeStyle=none;html=1;startArrow=block;endArrow=none;startSize=12;verticalAlign=bottom;dashed=1;labelBackgroundColor=none;rounded=0;startFill=1;entryX=0.5;entryY=1;entryDx=0;entryDy=0;entryPerimeter=0;fontSize=13;" parent="wPMBU0aHOdNjjrVcCQsU-1" edge="1">
          <mxGeometry x="-0.0909" y="20" width="160" relative="1" as="geometry">
            <mxPoint x="1590" y="1000" as="sourcePoint" />
            <mxPoint x="1589.5" y="890" as="targetPoint" />
            <mxPoint as="offset" />
          </mxGeometry>
        </mxCell>
      </root>
    </mxGraphModel>
  </diagram>
</mxfile>
