org\apache\camel\learn\MySpringBean.class
org\apache\camel\learn\Persona.class
org\apache\camel\learn\PersonaRouter.class
org\apache\camel\learn\MyService.class
org\apache\camel\learn\MySpringBootApplication.class
org\apache\camel\learn\CreatePersonProcesor.class
