{
  "targets": [
    { "extname": ".mjs", "module": "esnext", "moduleResolution": "bundler", "verbatimModuleSyntax": true },
    { "extname": ".js", "module": "commonjs", "moduleResolution": "node", "verbatimModuleSyntax": false }
  ],
  "projects": ["."]
}
