[
  {
    "coordinate": {
      "latitude": 25,
      "longitude": 79
    }
  },
  {
    "coordinate": {
      "latitude": 30.524698,
      "longitude": 78.6655507
    }
  },
  {
    "coordinate": {
      "latitude": 30.5230786,
      "longitude": 78.634
    }
  },
  {
    "coordinate": {
      "latitude": 12,
      "longitude": 78
    }
  }
]
