#include <stdio.h>
#include <iostream>
#include <fstream>
#include <windows.h>
#include <locale.h>
#include <limits>
#include <string> 
using namespace std;
char translation (char c)
{
char rus[] = {"?,?,?,?,?,?"};
char eng[] = {"a,b,v,g,d,e"};
rus[1]='?';
rus[2]='?';
rus[3]='?';
rus[4]='?';
rus[5]='?';
rus[6]='?';
eng[1]='a';
eng[2]='b';
eng[3]='v';
eng[4]='g';
eng[5]='d';
eng[6]='e';
    for (int i=1; rus[i] != '\0' ;i++)
    {
        if (c==rus[i]) c=eng[i];
    } 
return c;
}
 
int main()
{
FILE *fi,*fo;
fi=fopen("start.txt","rb");
fo=fopen("finish.txt","wb");
SetConsoleCP (1251); 
SetConsoleOutputCP (1251);
char rus[] = {"?,?,?,?,?,?"};
char eng[] = {"a,b,v,g,d,e"};
int k;
int i=0;
while (!feof(fi))
for(int c=0; !feof(fi); (c = getc(fi)))
{
k=translation(c);
fputc(k,fo);
    }
}