Id  subject  teacher  name       name                  rnumber
--  -------  -------  ---------  --------------------  -------
1   1        1        English    Klavdia Palicarpovna  104    
1   1        1        English    Klavdia Palicarpovna  125    
1   1        1        English    Klavdia Palicarpovna  402    
1   1        1        English    Klavdia Palicarpovna  305    
2   1        2        English    Viktor Ivanovich      104    
2   1        2        English    Viktor Ivanovich      125    
2   1        2        English    Viktor Ivanovich      402    
2   1        2        English    Viktor Ivanovich      305    
3   2        1        Geography  Klavdia Palicarpovna  125    
4   3        1        Phisics    Klavdia Palicarpovna  402    
5   3        2        Phisics    Viktor Ivanovich      402    
6   3        3        Phisics    Leonid Efimuch        402    
