Id  SUBJECT    Id:1  FIO                   Id:2  Number
--  ---------  ----  --------------------  ----  ------
1   English    1     Klavdia Policarpovna  1     104   
1   English    1     Klavdia Policarpovna  2     125   
1   English    1     Klavdia Policarpovna  3     402   
1   English    1     Klavdia Policarpovna  4     305   
2   Geography  1     Klavdia Policarpovna  2     125   
3   Phisics    1     Klavdia Policarpovna  3     402   
3   Phisics    3     Leonid Efimuch        3     402   
1   English    2     Viktor Ivanovich      1     104   
1   English    2     Viktor Ivanovich      2     125   
1   English    2     Viktor Ivanovich      3     402   
1   English    2     Viktor Ivanovich      4     305   
3   Phisics    2     Viktor Ivanovich      3     402   
