<svg width="17" height="16" viewBox="0 0 17 16" fill="none" xmlns="http://www.w3.org/2000/svg">
<path d="M6.5 12L10.5 8L6.5 4" stroke="#046DB6" stroke-width="1.33333" stroke-linecap="round" stroke-linejoin="round"/>
</svg>
