{
  "info": {
    "_postman_id": "a30dddd9-fdf0-4608-bc07-6d9f8438fe8f",
    "name": "Simple Books",
    "schema": "https://schema.getpostman.com/json/collection/v2.0.0/collection.json"
  },
  "item": [
    {
      "name": "Status",
      "event": [
        {
          "listen": "test",
          "script": {
            "id": "6a5c7910-9f3c-4bcb-b72f-e8a9991592dc",
            "exec": [
              "\r",
              "pm.test(\"Response status code is 200\", function () {\r",
              "    pm.expect(pm.response.code).to.equal(200);\r",
              "});\r",
              "\r",
              "var responseData = pm.response.json();\r",
              "\r",
              "pm.test(\"Status should be OK\", function (){\r",
              "    pm.expect(responseData.status).to.eql(\"OK\");\r",
              "});\r",
              "\r",
              "postman.setNextRequest(\"List of books\");\r",
              "\r",
              "\r",
              "\r",
              "pm.test(\"Response body has the required field 'status'\", function () {\r",
              "  const responseData = pm.response.json();\r",
              "  \r",
              "  pm.expect(responseData).to.be.an('object');\r",
              "  pm.expect(responseData.status).to.exist;\r",
              "});\r",
              "\r",
              "\r",
              "pm.test(\"Status field should not be empty\", function () {\r",
              "  const responseData = pm.response.json();\r",
              "  pm.expect(responseData.status).to.exist.and.to.not.be.empty;\r",
              "});\r",
              "\r",
              "\r",
              "pm.test(\"Status field is of type string\", function () {\r",
              "    const responseData = pm.response.json();\r",
              "    \r",
              "    pm.expect(responseData.status).to.be.a('string');\r",
              "});\r",
              "\r",
              ""
            ],
            "type": "text/javascript"
          }
        }
      ],
      "id": "9687d2e6-570c-4cad-8b1f-806dbf927971",
      "protocolProfileBehavior": {
        "disableBodyPruning": true
      },
      "request": {
        "method": "GET",
        "header": [],
        "url": "{{baseUrl}}/status/"
      },
      "response": []
    },
    {
      "name": "List of books",
      "event": [
        {
          "listen": "test",
          "script": {
            "id": "0520da8e-6fe4-429b-9eea-d9f26fe58875",
            "exec": [
              "pm.test(\"Response status code is 200\", function () {\r",
              "    pm.expect(pm.response.code).to.equal(200);\r",
              "});\r",
              "\r",
              "const response = pm.response.json();\r",
              "\r",
              "const nonFictionBooks = response.filter((book) => book.available === true);\r",
              "const book = nonFictionBooks[0];\r",
              "\r",
              "if (book){\r",
              "    pm.globals.set(\"bookId\", book.id);\r",
              "}\r",
              "\r",
              "pm.test(\"Book found\", () => {\r",
              "    pm.expect(book).to.be.an('object');\r",
              "    pm.expect(book.available).to.be.true;\r",
              "    pm.expect(book.type).to.eql(\"non-fiction\");\r",
              "});\r",
              "\r",
              "\r",
              ""
            ],
            "type": "text/javascript"
          }
        }
      ],
      "id": "6eedc5a0-e96a-4102-bf45-6eddc3121cbb",
      "protocolProfileBehavior": {
        "disableBodyPruning": true
      },
      "request": {
        "method": "GET",
        "header": [],
        "url": {
          "raw": "{{baseUrl}}/books?type=non-fiction",
          "host": [
            "{{baseUrl}}"
          ],
          "path": [
            "books"
          ],
          "query": [
            {
              "key": "type",
              "value": "non-fiction"
            },
            {
              "key": "limit",
              "value": "20",
              "disabled": true
            }
          ]
        }
      },
      "response": []
    },
    {
      "name": "Single book",
      "event": [
        {
          "listen": "test",
          "script": {
            "id": "5e932e10-5f43-4b5c-ac9e-8fef093e9c3f",
            "exec": [
              "pm.test(\"Response status code is 200\", function () {\r",
              "    pm.expect(pm.response.code).to.equal(200);\r",
              "});\r",
              "\r",
              "const book = pm.response.json();\r",
              "\r",
              "pm.test(\"Is in stock\", function () {\r",
              "    pm.expect(book[\"current-stock\"]).to.be.above(0);\r",
              "});"
            ],
            "type": "text/javascript"
          }
        }
      ],
      "id": "e3421ed1-2c65-4d0c-acbe-7de909368b63",
      "protocolProfileBehavior": {
        "disableBodyPruning": true
      },
      "request": {
        "method": "GET",
        "header": [],
        "url": {
          "raw": "{{baseUrl}}/books/:bookId",
          "host": [
            "{{baseUrl}}"
          ],
          "path": [
            "books",
            ":bookId"
          ],
          "variable": [
            {
              "key": "bookId",
              "value": "{{bookId}}"
            }
          ]
        }
      },
      "response": []
    },
    {
      "name": "Order book",
      "event": [
        {
          "listen": "test",
          "script": {
            "id": "0c61c42a-a769-4d94-a68d-647edd235e79",
            "exec": [
              "pm.test(\"Response status code is 201\", function () {\r",
              "    pm.expect(pm.response.code).to.equal(201);\r",
              "});\r",
              "\r",
              "const response = pm.response.json();\r",
              "console.log(response.orderId);\r",
              "pm.globals.set(\"orderId\", response.orderId);\r",
              ""
            ],
            "type": "text/javascript"
          }
        }
      ],
      "id": "ec80e145-5f44-4bbf-a615-56736ee1684c",
      "protocolProfileBehavior": {
        "disableBodyPruning": true
      },
      "request": {
        "auth": {
          "type": "bearer",
          "bearer": {
            "token": "{{accessToken}}"
          }
        },
        "method": "POST",
        "header": [],
        "body": {
          "mode": "raw",
          "raw": "{\r\n  \"bookId\": {{bookId}},\r\n  \"customerName\": \"{{$randomFullName}}\"\r\n}",
          "options": {
            "raw": {
              "language": "json"
            }
          }
        },
        "url": "{{baseUrl}}/orders"
      },
      "response": []
    },
    {
      "name": "Orders",
      "event": [
        {
          "listen": "test",
          "script": {
            "id": "83a508a6-3bf2-4a7f-927d-d38b798ada6d",
            "exec": [
              "pm.test(\"Response status code is 200\", function () {\r",
              "    pm.expect(pm.response.code).to.equal(200);\r",
              "});"
            ],
            "type": "text/javascript"
          }
        }
      ],
      "id": "9733b2d9-bfd8-4fa1-ba79-135c03effa82",
      "protocolProfileBehavior": {
        "disableBodyPruning": true
      },
      "request": {
        "auth": {
          "type": "bearer",
          "bearer": {
            "token": "{{accessToken}}"
          }
        },
        "method": "GET",
        "header": [],
        "url": "{{baseUrl}}/orders"
      },
      "response": []
    },
    {
      "name": "Single order",
      "event": [
        {
          "listen": "test",
          "script": {
            "id": "f5a7472d-a507-4d12-b37e-bd07d585ea99",
            "exec": [
              "pm.test(\"Response status code is 200\", function () {\r",
              "    pm.expect(pm.response.code).to.equal(200);\r",
              "});"
            ],
            "type": "text/javascript"
          }
        }
      ],
      "id": "18270371-6d35-4032-8df1-e5c7800f8bdf",
      "protocolProfileBehavior": {
        "disableBodyPruning": true
      },
      "request": {
        "auth": {
          "type": "bearer",
          "bearer": {
            "token": "{{accessToken}}"
          }
        },
        "method": "GET",
        "header": [],
        "url": {
          "raw": "{{baseUrl}}/orders/:orderId",
          "host": [
            "{{baseUrl}}"
          ],
          "path": [
            "orders",
            ":orderId"
          ],
          "variable": [
            {
              "key": "orderId",
              "value": "{{orderId}}"
            }
          ]
        }
      },
      "response": []
    },
    {
      "name": "Update order",
      "event": [
        {
          "listen": "test",
          "script": {
            "id": "aae717ff-896a-40a4-84ef-849c3c96fbfb",
            "exec": [
              "pm.test(\"Response status code is 204\", function () {\r",
              "    pm.expect(pm.response.code).to.equal(204);\r",
              "});"
            ],
            "type": "text/javascript"
          }
        }
      ],
      "id": "833e7e64-570a-4eb0-8f7b-a65226d3c9e3",
      "protocolProfileBehavior": {
        "disableBodyPruning": true
      },
      "request": {
        "auth": {
          "type": "bearer",
          "bearer": {
            "token": "{{accessToken}}"
          }
        },
        "method": "PATCH",
        "header": [],
        "body": {
          "mode": "raw",
          "raw": "{\r\n  \"customerName\": \"Philip {{$randomLastName}}\"\r\n}",
          "options": {
            "raw": {
              "language": "json"
            }
          }
        },
        "url": {
          "raw": "{{baseUrl}}/orders/:orderId",
          "host": [
            "{{baseUrl}}"
          ],
          "path": [
            "orders",
            ":orderId"
          ],
          "variable": [
            {
              "key": "orderId",
              "value": "{{orderId}}"
            }
          ]
        }
      },
      "response": []
    },
    {
      "name": "Single order",
      "event": [
        {
          "listen": "test",
          "script": {
            "id": "57efc21b-ae86-4800-85a9-e2bb2476cd99",
            "exec": [
              "pm.test(\"Response status code is 204\", function () {\r",
              "    pm.expect(pm.response.code).to.equal(204);\r",
              "});\r",
              "\r",
              "postman.setNextRequest(null);"
            ],
            "type": "text/javascript"
          }
        }
      ],
      "id": "24c3ab35-5da0-4af1-af47-fcf450d51480",
      "protocolProfileBehavior": {
        "disableBodyPruning": true
      },
      "request": {
        "auth": {
          "type": "bearer",
          "bearer": {
            "token": "{{accessToken}}"
          }
        },
        "method": "DELETE",
        "header": [],
        "url": {
          "raw": "{{baseUrl}}/orders/:orderId",
          "host": [
            "{{baseUrl}}"
          ],
          "path": [
            "orders",
            ":orderId"
          ],
          "variable": [
            {
              "key": "orderId",
              "value": "{{orderId}}"
            }
          ]
        }
      },
      "response": []
    },
    {
      "name": "Register API client",
      "event": [
        {
          "listen": "test",
          "script": {
            "id": "8aadca41-08ac-4c33-8909-fe751dac940c",
            "exec": [
              "pm.test(\"Response status code is 201\", function () {\r",
              "    pm.expect(pm.response.code).to.equal(201);\r",
              "});"
            ],
            "type": "text/javascript"
          }
        }
      ],
      "id": "a779fd44-3977-4da1-837c-64837611a48a",
      "protocolProfileBehavior": {
        "disableBodyPruning": true
      },
      "request": {
        "method": "POST",
        "header": [],
        "body": {
          "mode": "raw",
          "raw": "{\r\n   \"clientName\": \"Agnes\",\r\n   \"clientEmail\": \"agnesra@example.com\"\r\n}",
          "options": {
            "raw": {
              "language": "json"
            }
          }
        },
        "url": "{{baseUrl}}/api-clients"
      },
      "response": []
    }
  ],
  "auth": {
    "type": "bearer",
    "bearer": {}
  },
  "event": [
    {
      "listen": "prerequest",
      "script": {
        "id": "4497bebb-e749-4a34-afc6-80155e241d13",
        "type": "text/javascript",
        "exec": [
          ""
        ]
      }
    },
    {
      "listen": "test",
      "script": {
        "id": "755c45e0-6fca-4329-babc-561f4212db09",
        "type": "text/javascript",
        "exec": [
          ""
        ]
      }
    }
  ],
  "variable": [
    {
      "key": "baseUrl",
      "value": "https://simple-books-api.glitch.me"
    },
    {
      "key": "accessToken",
      "value": "7a288d64286d77da2de3326a4685bff613622dbe98defe7d79a3788b1bac3326",
      "type": "string"
    }
  ]
}