{
  "app_name": "Flutter_mvvm_example",
  "login": "Login",
  "email": "Email",
  "password": "Password",
  "submit": "Submit",
  "check_internet_connection": "Please Check your internet connection",
  "error_try_again": "Error in Service, try again",
  "dark_mode": "Dark Mode"
}
