[
    {
        "clouds": 100,
        "temp_max": 12.61,
        "temp_min": 12.61,
        "wind_speed": 3.2
    },
    {
        "clouds": 59,
        "temp_max": 13.94,
        "temp_min": 13.94,
        "wind_speed": 1.93
    },
    {
        "clouds": 57,
        "temp_max": 15.15,
        "temp_min": 15.15,
        "wind_speed": 2.19
    },
    {
        "clouds": 21,
        "temp_max": 14.84,
        "temp_min": 14.84,
        "wind_speed": 0.89
    },
    {
        "clouds": 27,
        "temp_max": 15.28,
        "temp_min": 14.71,
        "wind_speed": 1.97
    },
    {
        "clouds": 20,
        "temp_max": 15.17,
        "temp_min": 15.11,
        "wind_speed": 3.6
    },
    {
        "clouds": 100,
        "temp_max": 15.88,
        "temp_min": 15.88,
        "wind_speed": 6.05
    },
    {
        "clouds": 100,
        "temp_max": 12,
        "temp_min": 12,
        "wind_speed": 4.57
    },
    {
        "clouds": 50,
        "temp_max": 17.13,
        "temp_min": 17.13,
        "wind_speed": 7.36
    },
    {
        "clouds": 83,
        "temp_max": 19.12,
        "temp_min": 18.22,
        "wind_speed": 6.15
    }
]