<?xml version="1.0" encoding="UTF-8"?>
<!-- Generator: Adobe Illustrator 22.0.1, SVG Export Plug-In . SVG Version: 6.00 Build 0)  -->
<svg version="1.1" id="Calque_1" xmlns="http://www.w3.org/2000/svg" xmlns:xlink="http://www.w3.org/1999/xlink" x="0px" y="0px" viewBox="0 0 473.2 473.2" enable-background="new 0 0 473.2 473.2" xml:space="preserve">
<g>
	<g>
		<g>
			<path fill="#1475A1" d="M291.6,208.7 M291.6,208.7c-18.1,18.1-40.2,27.1-66.2,27.1c-26,0-48.2-9-66.5-27.1l0,0     c16.4-18.1,40-29.5,66.4-29.5C251.6,179.3,275.3,190.6,291.6,208.7"/>
			<path fill="#1475A1" d="M185.8,147.2c-12.9,19.6-27.7,32.1-44.5,37.5c-6.5-13-9.8-27.3-9.8-42.8c0-26,9.1-48.3,27.4-66.8     C173.9,60,191.9,51,212.8,48.4C212.8,87.3,203.8,120.2,185.8,147.2z"/>
			<path fill="#1475A1" d="M237.8,48.4c20.8,2.7,38.8,11.6,53.9,26.8c18.2,18.6,27.4,40.9,27.4,66.8c0,15.5-3.3,29.7-9.8,42.8     c-16.8-5.5-31.7-18-44.6-37.5C246.8,120.2,237.8,87.3,237.8,48.4z"/>
		</g>
		<g>
			<path fill="#5FA5C1" d="M243.9,356.1 M243.9,356.1c-6.6-24.7-3.5-48.4,9.5-70.9c13-22.6,31.9-37.3,56.7-44.1l0,0     c7.5,23.2,5.6,49.4-7.6,72.2C289.4,336.1,267.7,351,243.9,356.1"/>
			<path fill="#5FA5C1" d="M350,295.1c-10.5-20.9-14-40-10.3-57.3c14.5,0.9,28.5,5.1,41.9,12.8c22.5,13,37.3,32,44.3,57     c5.6,20.7,4.4,40.7-3.7,60.1C388.4,348.3,364.4,324.1,350,295.1z"/>
			<path fill="#5FA5C1" d="M409.7,389.5c-12.7,16.7-29.4,27.9-50.1,33.4c-25.2,6.5-49.1,3.3-71.6-9.6c-13.4-7.7-24.1-17.7-32.2-29.8     c13.1-11.9,31.4-18.5,54.7-19.9C342.9,361.4,376,370,409.7,389.5z"/>
		</g>
		<g>
			<path fill="#B6D3DB" d="M139.9,241.1 M139.9,241.1c24.7,6.6,43.6,21.2,56.6,43.7c13.1,22.5,16.4,46.3,9.9,71.2v0     c-23.9-5.1-45.6-19.9-58.8-42.6C134.5,290.5,132.5,264.3,139.9,241.1"/>
			<path fill="#B6D3DB" d="M139.8,363.5c23.4,1.3,41.6,7.9,54.8,19.7c-8,12.2-18.7,22.1-32.1,29.9c-22.5,13-46.3,16.3-71.5,9.8     c-20.7-5.5-37.4-16.6-50.2-33.3C74.4,370.2,107.4,361.5,139.8,363.5z"/>
			<path fill="#B6D3DB" d="M28.2,368c-8.1-19.4-9.4-39.4-3.9-60.1c6.9-25.1,21.6-44.2,44.1-57.2c13.4-7.8,27.4-12.1,41.9-13     c3.7,17.3,0.3,36.4-10.1,57.4C85.9,324.2,61.9,348.5,28.2,368z"/>
		</g>
	</g>
</g>
</svg>