<?xml version="1.0" encoding="UTF-8" standalone="no"?>
<svg
   version="1.1"
   viewBox="0 0 33.333332 33.333331"
   width="100"
   height="100"
   stroke="#1971c2"
   xmlns="http://www.w3.org/2000/svg"
   xmlns:svg="http://www.w3.org/2000/svg">
  <path
     d="m 33.178817,33.115434 c -0.510845,-0.679625 -1.153675,-2.643157 -3.069743,-4.074672 -1.916067,-1.429975 -7.021438,-3.756383 -8.42666,-4.508279 m 11.496403,8.582951 c -0.510845,-0.679625 -1.153675,-2.643157 -3.069743,-4.074672 -1.916067,-1.429975 -7.021438,-3.756383 -8.42666,-4.508279"
     stroke-width="0.30903"
     fill="none"
     id="path2"
     inkscape:label="right_s"
     style="stroke-linecap:round" />
  <path
     d="M 11.046947,23.953717 C 10.602866,22.688265 8.6914569,19.697608 8.3793582,16.360984 8.0672596,13.025907 7.8281394,6.6386659 9.1743552,3.9370815 10.522124,1.2370348 13.973841,0.14686782 16.459761,0.15455587 c 2.485914,0.007688 6.265256,0.97023323 7.631659,3.82711633 1.366404,2.8568834 0.967354,9.9114478 0.568299,13.3157218 -0.397494,3.405809 -2.465729,5.925954 -2.95795,7.111459 M 11.046947,23.953717 C 10.602866,22.688265 8.6914569,19.697608 8.3793582,16.360984 8.0672596,13.025907 7.8281394,6.6386659 9.1743552,3.9370815 10.522124,1.2370348 13.973841,0.14686782 16.459761,0.15455587 c 2.485914,0.007688 6.265256,0.97023323 7.631659,3.82711633 1.366404,2.8568834 0.967354,9.9114478 0.568299,13.3157218 -0.397494,3.405809 -2.465729,5.925954 -2.95795,7.111459"
     stroke="#1971c2"
     stroke-width="0.30903"
     fill="none"
     id="path4"
     inkscape:label="head"
     style="stroke-linecap:round" />
  <path
     d="m 0.154515,33.178817 c 0.34625858,-0.621195 0.25930575,-2.203395 2.0791039,-3.727173 1.8197983,-1.52531 7.3676988,-4.515967 8.8396861,-5.420082 m -10.91879,9.147255 c 0.34625858,-0.621195 0.25930575,-2.203395 2.0791039,-3.727173 1.8197983,-1.52531 7.3676988,-4.515967 8.8396861,-5.420082"
     stroke="#1971c2"
     stroke-width="0.30903"
     fill="none"
     id="path1"
     inkscape:label="left_s"
     style="stroke-linecap:round" />
</svg>
