<?xml version="1.0" encoding="utf-8"?>
<!-- Generator: Adobe Illustrator 22.0.1, SVG Export Plug-In . SVG Version: 6.00 Build 0)  -->
<svg version="1.1" id="Layer_1" xmlns="http://www.w3.org/2000/svg" xmlns:xlink="http://www.w3.org/1999/xlink" x="0px" y="0px"
	 viewBox="0 0 512 512" enable-background="new 0 0 512 512" xml:space="preserve">
<g>
	<g>
		<path fill="#1375A1" d="M270.9,302.9c-10.6-14.9-27.5-24.1-45.7-24.8c-0.4,0-0.8-0.1-1.2-0.1c-23.1,0-42.3-17.5-44.9-39.9
			c6.7-4.9,12.8-11,18.3-18.4c11-14.9,18.2-33.5,20.8-53.7c0.8-0.9,1.5-1.9,2-3.1c4.7-11.1,7-23,7-35.2c0-47.2-35.7-85.6-79.6-85.6
			c-11.3,0-22.4,2.6-32.8,7.7c-3.9,0.3-7.7,1-11.4,2.1c-36.7,10.6-57.4,55-46.2,98.9c1.1,4.4,2.6,8.8,4.3,12.9
			c0.5,1.1,1.1,2.1,1.9,3c4.2,31,18.9,56.8,39,71.4c-2.6,22.5-21.7,40-44.9,40c-0.4,0-0.7,0-1.1,0.1C25.2,279.3,0,305.1,0,336.8
			v63.1c0,5.9,4.8,10.7,10.7,10.7h188.5c5.9,0,10.7-4.8,10.7-10.7s-4.8-10.7-10.7-10.7H21.3v-52.5c0-20.6,16.7-37.3,37.3-37.3
			c0.4,0,0.7,0,1.1-0.1c7.7-0.2,15-1.8,21.9-4.4l50.5,72.9c2,2.9,5.3,4.6,8.8,4.6s6.8-1.7,8.8-4.6l50.5-72.9
			c6.8,2.6,14.2,4.2,21.9,4.4c0.3,0,0.7,0.1,1.1,0.1c12.1,0,23.5,5.9,30.5,15.8c2.1,2.9,5.4,4.5,8.7,4.5c2.1,0,4.3-0.6,6.1-2
			C273.2,314.4,274.3,307.7,270.9,302.9z M109.5,72.4c2.8-0.8,5.8-1.3,8.8-1.4c1.6-0.1,3.1-0.5,4.5-1.2c7.9-4.2,16.3-6.3,24.9-6.3
			c31.5,0,57.2,27.7,58.2,62.2c-6.4-4.8-14.4-7.7-23-7.7h-55.8c-2.8,0-5.4-0.9-7.6-2.5c-1.9-1.4-3.4-3.3-4.2-5.5
			c-2-5-7-8.1-12.4-7.8c-5.4,0.3-10,4.1-11.3,9.4c-2.7,10.5-7.8,20.2-14.7,28.5C71.3,109,85.2,79.4,109.5,72.4z M84.5,162.7
			c9.3-8.5,16.9-18.9,22.1-30.3c0,0,0.1,0.1,0.1,0.1c5.9,4.4,13,6.8,20.4,6.8h55.8c6.7,0,12.5,3.9,15.2,9.6
			c-0.1,22.2-6.4,42.9-17.8,58.3c-10.8,14.6-24.8,22.6-39.5,22.6c-13.6,0-26.8-7-37.2-19.8C93.5,197.6,86.8,181,84.5,162.7z
			 M140.8,343L100,284.1c10.9-9.1,18.9-21.6,22.3-35.9c5.9,1.9,12.1,2.8,18.5,2.8c6.3,0,12.5-1,18.5-2.8
			c3.4,14.3,11.4,26.8,22.3,35.9L140.8,343z"/>
	</g>
</g>
<g>
	<g>
		<path fill="#1375A1" d="M455.4,337.5c-0.3,0-0.7-0.1-1.1-0.1c-23.2,0-42.3-17.5-44.9-40c13.1-9.5,23.8-23.8,30.9-41.1
			c1,3.3,3.6,6,7,7.1c1,0.3,2.1,0.5,3.2,0.5c3.2,0,6.4-1.5,8.4-4.1c14.9-19.1,22.6-44,21.8-70c-0.8-25.6-9.8-49.6-25.3-67.6
			c-15.9-18.4-36.8-28.7-59-28.9c-1.2,0-4.1,0.1-4.6,0.1c-11.4-5.2-23.5-7.6-35.9-7.2c-25.6,0.8-49.2,13.6-66.4,36
			c-16.7,21.7-25.4,50.1-24.4,79.9c0.2,5,0.6,9.7,1.2,14.1c1.7,12.7,5.2,24.8,10.4,36.1c1.6,3.6,5.1,6,9.1,6.2
			c3.9,0.2,7.7-1.7,9.7-5.1c0.9-1.4,2-3.2,3.2-4.9c4.8,14.4,12,27.4,21.3,37.7c3.9,4.4,8.2,8.2,12.7,11.4c-2.6,22.5-21.7,40-44.9,40
			c-0.4,0-0.7,0-1.1,0.1c-31.4,1.1-56.6,27-56.6,58.6v63.1c0,5.9,4.8,10.7,10.7,10.7h260.3c5.9,0,10.7-4.8,10.7-10.7v-63.1
			C512,364.4,486.8,338.6,455.4,337.5z M290.1,225.6c-1.1-4.1-1.9-8.3-2.5-12.6c-0.5-3.7-0.9-7.6-1-11.8c-0.8-24.8,6.3-48.3,20-66.2
			c13.2-17.2,31-27,50.1-27.6c0.6,0,14.4-0.8,28.4,6.3c1.6,0.8,3.4,1.2,5.1,1.1c0.2,0,5.7-0.3,5.8-0.3c16,0.1,31.4,7.7,43.2,21.5
			c12.3,14.3,19.5,33.6,20.1,54.3c0.4,11.2-1.2,22.2-4.6,32.2c-1-2.7-2.1-5.3-3.4-7.9c-10.3-21.9-27.6-38.9-48.8-47.8
			c-2.7-1.1-5.7-1.1-8.4,0c-2.7,1.2-4.8,3.4-5.8,6.1c-1.4,3.8-3.1,7.6-5.1,11.1c-5.6,10-16.8,15.9-29.4,15.5c-1.9-0.1-3.8-0.1-5.7,0
			c-9.2,0.3-18.2,2.1-26.8,5.2C313.3,208,299,216,290.1,225.6z M316.4,231.4c4-2.7,8.3-4.9,12.9-6.6c6.3-2.4,13.1-3.7,20-3.9
			c1.4,0,2.8,0,4.2,0c20.6,0.7,39.2-9.4,48.7-26.4c0.6-1,1.2-2.1,1.7-3.2c9.7,6,18,14.4,24.3,24.7c-0.1,0.3-0.1,0.6-0.1,1
			c-1.6,20.2-8.6,38.8-19.7,52.3C397.9,282,384.7,289,371.1,289C346,289,323.7,265.2,316.4,231.4z M352.7,307.5
			c6,1.9,12.2,2.9,18.5,2.9c6.4,0,12.6-1,18.6-2.9c4.3,18.2,16,33.5,31.8,42.5c-6.2,22.3-26.6,38.3-50.3,38.3
			c-23.7,0-44.2-16-50.3-38.3C336.6,341,348.4,325.7,352.7,307.5z M490.7,448.5h-239v-52.5c0-20.6,16.7-37.3,37.3-37.3
			c0.4,0,0.7,0,1.1-0.1c3.7-0.1,7.3-0.5,10.8-1.2c9.3,30.4,37.6,52.1,70.3,52.1s61.1-21.7,70.3-52.1c3.5,0.7,7.1,1.1,10.8,1.2
			c0.3,0,0.7,0.1,1.1,0.1c20.6,0,37.3,16.7,37.3,37.3V448.5z"/>
	</g>
</g>
</svg>
