French
<CATEGORIES>
Nb : <E>, s, p 
Gen : <E>, m, f
Temps : W, P, Y, G, K, I, J, S, T, F, C
Pers : <E>, 1, 2, 3
<CLASSES> 
noun : (Nb,<var>),(Gen,<fixed>)
adj:(Nb,<var>),(Gen,<var>)
v : (Temps,<var>), (Pers,<var>), (Nb,<var>),(Gen,<var>)
adv: 

