<?xml version="1.0" encoding="utf-8"?>
<!-- Generator: Adobe Illustrator 16.0.0, SVG Export Plug-In . SVG Version: 6.00 Build 0)  -->
<!DOCTYPE svg PUBLIC "-//W3C//DTD SVG 1.1//EN" "http://www.w3.org/Graphics/SVG/1.1/DTD/svg11.dtd">
<svg version="1.1" id="Layer_1" xmlns="http://www.w3.org/2000/svg" xmlns:xlink="http://www.w3.org/1999/xlink" x="0px" y="0px"
	 width="521px" height="499.68px" viewBox="0 0 521 499.68" enable-background="new 0 0 521 499.68" xml:space="preserve">
<rect x="0.083" y="-0.16" fill="#F9A51A" width="520.834" height="500"/>
<g>
	<defs>
		<rect id="SVGID_1_" x="0.083" y="-0.16" width="520.833" height="500"/>
	</defs>
	<clipPath id="SVGID_2_">
		<use xlink:href="#SVGID_1_"  overflow="visible"/>
	</clipPath>
	<path clip-path="url(#SVGID_2_)" fill="#231F20" d="M116.321,429.23c0,0,22.935-13.982,26.956-27.311c2.668-8.84,0-22.766,0-22.766
		s-122.361-6.457-122.361-86.846s81.512-106.531,160.759-106.531c79.246,0,154.405,41.137,154.405,99.406
		c0,58.268-62.083,98.299-148.684,98.299C187.396,383.482,170.245,427.596,116.321,429.23"/>
	<path clip-path="url(#SVGID_2_)" fill="#FFFFFF" d="M224.156,179.24c0,0,72.074,10.986,104.54,53.952
		c24.857,32.898,27.495,72.642-4.865,110.925c0,0,37.579,8.018,68.623,0c31.046-8.018,40.849-16.348,40.849-16.348
		s32.219,3.701,40.845,37.74c0,0,13.855-16.984,0-43.297c-4.611-8.756-10.617-13.879-10.617-13.879s80.127-98.803-25.33-172.391
		C344.798,70.769,224.156,122.869,224.156,179.24"/>
</g>
</svg>
