<?xml version="1.0" encoding="utf-8"?>
<!-- Generator: Adobe Illustrator 16.0.0, SVG Export Plug-In . SVG Version: 6.00 Build 0)  -->
<!DOCTYPE svg PUBLIC "-//W3C//DTD SVG 1.1//EN" "http://www.w3.org/Graphics/SVG/1.1/DTD/svg11.dtd">
<svg version="1.1" id="Layer_1" xmlns="http://www.w3.org/2000/svg" xmlns:xlink="http://www.w3.org/1999/xlink" x="0px" y="0px"
	 width="521px" height="499.68px" viewBox="0 0 521 499.68" enable-background="new 0 0 521 499.68" xml:space="preserve">
<rect x="-0.097" fill="#A9C9B8" width="521.097" height="499.498"/>
<g>
	<defs>
		<rect id="SVGID_1_" x="-0.097" width="520.503" height="499.68"/>
	</defs>
	<clipPath id="SVGID_2_">
		<use xlink:href="#SVGID_1_"  overflow="visible"/>
	</clipPath>
	<path clip-path="url(#SVGID_2_)" fill="#929497" d="M75.359,356.908v-221.59c0,0-2.934-27.889,21.278-27.889h327.259
		c0,0,23.483,2.203,23.483,28.613v220.866H75.359z"/>
</g>
<rect x="102.513" y="135.311" fill="#FFFFFF" width="317.71" height="192.982"/>
<g>
	<defs>
		<rect id="SVGID_3_" x="-0.097" width="520.503" height="499.68"/>
	</defs>
	<clipPath id="SVGID_4_">
		<use xlink:href="#SVGID_3_"  overflow="visible"/>
	</clipPath>
	<path clip-path="url(#SVGID_4_)" fill="#929497" d="M17.392,370.855h178.303c0,0-2.934,14.68,15.409,14.68h96.127
		c0,0,12.478-2.21,12.478-12.471h176.097c0,0-2.196,37.411-38.89,37.411H52.614C52.614,410.476,17.392,406.804,17.392,370.855"/>
	<path clip-path="url(#SVGID_4_)" fill="#929497" d="M250.111,328.049c-1.769,3.309-5.106,3.984-8.126,1.764
		c-3.542-2.591-7.012-5.314-10.742-7.577c-2.304-1.397-3.138-3.525-3.874-5.708c-0.681-1.978-0.874-4.133-1.118-6.248
		c-0.332-2.86-0.674-5.733-0.708-8.608c-0.028-2.113,0.457-4.215,0.674-6.33c0.278-2.738,0.457-5.476,0.789-8.214
		c0.125-0.962,0.461-1.979,0.966-2.805c0.973-1.6,0.311-2.738-0.935-3.552c-2.383-1.559-4.867-2.942-7.33-4.419
		c-1.993,0.583-2.644,2.236-3.263,3.89c-0.173,0.461-2.138,15.331-2.274,22.299c-0.044,2.236,1.123,4.499,1.816,7.075
		c-0.715,1.193-1.816,1.3-3.179,0.121c-2.511-2.168-3.595-5.041-4.026-8.214c-0.332-2.346,0.662-23.923,2.952-28.384
		c0.325-1.454-0.508-2.458-1.595-3.176c-1.993-1.32-4.033-2.555-6.059-3.802c-1.25-0.773-2.332-0.379-2.756,0.901
		c-4.219,11.81-3.263,24.661-2.894,27.507c0.139,1.083,0.339,2.154,0.59,3.755c-1.342-0.136-2.457,0.081-3.131-0.367
		c-7.669-5.23-15.253-10.56-22.88-15.847c-2.061-1.422-4.111-2.845-6.206-4.227c-2.497-1.654-3.687-3.836-3.687-6.978
		c-0.014-4.637-0.559-9.272-0.664-13.928c-0.112-5.131-0.285-10.288,1.979-15.168c0.274-0.603-0.329-2.02-0.938-2.541
		c-1.915-1.613-3.934-3.125-6.093-4.378c-1.345-0.787-2.789-0.366-3.324,1.349c-1.061,3.321-2.498,6.614-2.941,10.031
		c-0.82,6.452,0.478,12.742,2.876,18.794c0.424,1.049,0.586,2.202,0.482,3.495c-5.547-2.567-9.807-6.126-11.792-11.976
		c-1.956-5.787-2.789-11.704-2.292-17.803c0.125-1.477,0.278-3.002,0.766-4.392c1.207-3.395,2.444-6.791,3.982-10.044
		c1.403-2.974,5.13-3.604,7.834-1.754c8.065,5.516,16.13,11.019,24.27,16.434c6.655,4.447,13.487,8.663,20.126,13.141
		c8.726,5.891,17.295,12.003,26.011,17.888c6.65,4.495,13.451,8.737,20.13,13.185c2.073,1.396,4.015,2.995,5.869,4.677
		c1.735,1.571,2.067,3.307,0.979,5.72c-2.151,4.742-4.276,9.624-3.636,15.085c0.179,1.479,0.379,2.97,0.729,4.42
		c0.81,3.389,4.435,9.218,4.47,8.62c0.166-3.441,2.728-4.675,5.266-5.719c4.595-1.871,9.278-3.539,13.984-5.152
		c5.863-2.02,11.814-3.794,17.663-5.855c6.235-2.194,12.354-4.688,18.569-6.911c5.272-1.886,10.647-3.525,15.941-5.383
		c3.633-1.287,7.155-2.873,10.789-4.146c6.14-2.13,12.301-4.095,18.448-6.183c1.051-0.353,1.979-1.028,3.001-1.45
		c2.942-1.191,6.229,0.259,7.354,3.215c1.003,2.67-0.285,5.422-3.267,6.6c-6.365,2.495-12.634,5.327-19.166,7.306
		c-6.711,2.047-13.162,4.649-19.737,6.968c-7.982,2.833-15.967,5.64-23.938,8.486c-6.232,2.222-12.429,4.554-18.677,6.723
		c-6.239,2.168-12.569,4.107-18.8,6.303c-2.291,0.812-4.101,0.529-5.835-1.085C253.089,325.067,250.7,326.952,250.111,328.049"/>
	<path clip-path="url(#SVGID_4_)" fill="#929497" d="M171.11,215.927c2.026,1.6,72.01,48.446,77.024,52.186
		c4.057,3.037,7.608,5.405,12.999,2.326c7.297-2.799,77.862-26.899,78.303-27.361c0.149-1.545-18.062-12.524-20.657-14.158
		c-3.219-2.013-3.348-3.769-0.358-6.174c1.558-1.254,4.506-1.85,6.012-3.28c4.621,3.104,20.751,13.772,25.306,16.794
		c2.101,1.389,4.324,2.576,6.302,4.1c4.461,3.458,2.333,7.415-1.361,9.231c-2.982,1.458-6.323,2.163-9.482,3.254
		c-3.401,1.198-6.756,2.473-10.172,3.673c-3.639,1.309-7.292,2.576-10.959,3.836c-3.741,1.302-7.509,2.548-11.291,3.855
		c-3.523,1.22-7.048,2.495-10.586,3.715c-3.877,1.341-7.767,2.65-11.644,3.958c-3.675,1.243-7.34,2.478-10.993,3.724
		c-3.525,1.207-7.034,2.467-10.545,3.701c-4.344,1.504-8.615,3.294-13.054,4.39c-1.694,0.435-4.104-0.216-5.652-1.205
		c-7.903-5.07-92.23-61.799-94.195-63.121c-1.953-1.328-3.41-2.921-3.013-5.544c0.383-2.589,2.152-4.033,4.338-4.798
		c9.169-3.22,45.035-15.466,47.248-16.307c2.061-0.792,3.853,0.102,4.053,2.271c0.159,1.844-1.021,3.734-1.312,5.543
		c-0.47,2.772-2.958,3.619-5.19,4.386C198.619,206.168,174.476,214.653,171.11,215.927"/>
	<path clip-path="url(#SVGID_4_)" fill="#929497" d="M256.627,298.525c6.218-2.208,12.528-4.173,18.794-6.26
		c2.241-0.76,4.449-1.627,6.68-2.428c5.516-2.007,11.038-4.012,16.55-6.005c6.472-2.345,12.932-4.662,19.382-7.021
		c5.749-2.102,11.469-4.267,17.23-6.306c5.529-1.967,11.101-3.782,16.65-5.681c0.116-0.048,0.218-0.149,0.332-0.169
		c1.411-0.381,3.146-1.308,3.863,0.712c0.739,2.045-1.125,2.188-2.501,2.8c-9.033,3.991-18.475,6.881-27.787,10.093
		c-6.012,2.062-11.894,4.419-17.871,6.548c-5.855,2.087-11.778,3.985-17.629,6.032c-5.184,1.843-10.309,3.795-15.481,5.665
		c-4.22,1.518-16.212,5.829-17.886,6.656C255.059,304.083,255.051,299.095,256.627,298.525"/>
	<path clip-path="url(#SVGID_4_)" fill="#929497" d="M256.97,147.76c-35.483,4.439-48.116,54.464-48.455,55.92
		c-0.333,1.464-0.59,2.772-0.59,2.772l3.504,1.946c-0.106,0.65-2.549,6.201-6.404,8.329c-3.875,2.108-8.53,0.833-8.53,0.833
		s-1.189-0.196-1.437,0.062c-0.911,0.895,0.068,1.958,0.068,1.958s3.588,3.01,9.279,3.734c6.235,0.793,14.076-3.057,14.076-3.057
		s-1.43,5.558-1.653,8.872c-0.2,3.083,3.192,3.856,3.192,3.856s5.852,1.003,9.542,1.396c2.626,0.278,11.84,1.81,12.806-0.928
		c0.688-1.932,1.172-10.132,1.172-10.132s4.456,0.738,9.695,0.027c5.226-0.711,10.958-4.311,10.958-4.311s5.596,3.979,10.751,4.833
		c5.156,0.867,9.792-0.359,9.792-0.359s0.027,1.186,0.765,7.671c0.441,3.803,4.379,3.227,4.379,3.227s15.12-1.675,20.441-3.043
		c2.69-0.678,0.827-8.167,0.827-8.167l-0.908-5.07c0,0,8.688,2.759,21.104-3.076c8.282-3.911,12.524-13.745,12.524-13.745
		s2.899,0.034,7.325-1.308c4.412-1.349,9.069-4.039,9.266-13.386v-0.135v-0.224c-0.067-8.735-8.98-15.622-15.75-16.672
		c-6.886-1.064-11.184,2.704-12.959,5.598c-2.195,3.605-4.466,16.246-6.248,18.428c-1.641,2.006-6.264,2.108-6.264,2.108
		s-0.982,0.359-1.023-0.353l-0.047-1.104c0,0-3.876,0.962-4.976-0.041c-0.825-0.766-3.184-7.909-3.184-7.909
		c-5.707-15.168-15.873-39.044-45.426-39.038C262.175,147.272,259.633,147.428,256.97,147.76"/>
	<path clip-path="url(#SVGID_4_)" fill="#FFFFFF" d="M249.223,150.655c-0.152,0.047-0.265,0.081-0.366,0.115
		c-1.655,0.542-3.23,1.24-4.761,2.04c-2.569,1.341-4.979,2.941-7.259,4.723c-0.959,0.746-1.881,1.532-2.779,2.352
		c-0.068,0.067-0.18,0.122-0.153,0.264c0.841,0.488,1.688,0.983,2.556,1.478c1.074-0.624,2.138-1.233,3.199-1.844
		c1.06-0.617,2.131-1.227,3.192-1.843c1.061-0.61,2.132-1.227,3.192-1.838c1.064-0.608,2.125-1.219,3.179-1.835V150.655z
		 M294.407,160.136c-0.244-0.23-0.434-0.414-0.623-0.596c-1.951-1.804-4.048-3.43-6.262-4.887c-1.926-1.262-3.932-2.393-6.074-3.267
		c-0.676-0.285-1.374-0.528-2.073-0.786c-0.094-0.034-0.189-0.082-0.298,0v3.619c0.237,0.183,12.335,7.178,12.782,7.395
		C292.687,161.139,293.526,160.651,294.407,160.136 M318.441,195.798c-0.116,0.007-0.17,0.007-0.245,0.014
		c-0.427,0.075-0.882,0.149-1.316,0.19c-0.799,0.074-1.585,0.074-2.363-0.116c-0.292-0.075-0.562-0.175-0.828-0.312
		c-0.495-0.264-0.825-0.685-1.063-1.172c-0.231-0.46-0.44-0.928-0.644-1.396c-0.67-1.633-1.213-3.315-1.775-4.995
		c-0.196-0.576-0.399-1.146-0.604-1.736c-0.027-0.088-0.081-0.176-0.122-0.264c-0.325,0.129-2.419,1.335-2.678,1.538
		c-0.006,0.055-0.014,0.115-0.014,0.183c0,4.812,0.008,9.631,0.014,14.436c0,0.015,0.008,0.028,0.008,0.042
		c0.014,0.014,0.014,0.02,0.055,0.075c3.781,2.188,7.624,4.398,11.453,6.607c0.034,0.02,0.08,0.02,0.109,0.02
		c0.039-0.304,0.067-8.201,0.039-12.742C318.467,196.049,318.454,195.948,318.441,195.798 M210.866,207.781
		c0.512-0.272,1.047-0.549,1.589-0.827c2.907-1.518,5.822-3.049,8.729-4.575c0.404-0.21,0.364-0.121,0.364-0.603
		c0.007-4.636,0-9.271,0-13.9v-0.359c-0.278-0.23-4.657-2.758-4.978-2.88c-0.125,0.135-0.18,0.325-0.261,0.502
		c-2.304,4.867-4.284,9.874-5.92,15.004c-0.621,1.938-1.197,3.891-1.607,5.883c-0.034,0.196-0.075,0.393-0.115,0.59
		C208.907,206.792,210.415,207.591,210.866,207.781 M292.944,178.218c0.406,0.284,12.457,7.231,12.74,7.34
		c0.597-0.285,2.725-1.532,2.942-1.729c-0.026-0.101-0.055-0.21-0.102-0.318c-1.262-3.159-2.623-6.276-4.182-9.299
		c-1.403-2.717-2.955-5.334-4.704-7.82c-1.064-1.512-2.196-2.962-3.415-4.337c-0.096-0.109-0.169-0.238-0.325-0.285
		c-0.977,0.576-1.979,1.145-2.942,1.707C292.911,163.925,292.897,177.703,292.944,178.218 M222.615,185.558
		c0.119-0.061,0.23-0.122,0.349-0.189c2.352-1.362,4.71-2.718,7.08-4.087c1.657-0.956,3.324-1.911,4.988-2.874
		c0.112-0.067,0.23-0.142,0.338-0.21c0.007-4.439,0.024-8.831,0.031-13.236c0-0.461-0.007-0.922-0.007-1.376
		c0-0.02-0.018-0.027-0.024-0.04c0-0.007-0.006-0.028-0.006-0.035c-0.525-0.353-2.857-1.68-3.142-1.782
		c-0.084,0.08-0.176,0.162-0.263,0.258c-0.489,0.508-0.98,1.009-1.458,1.524c-2.874,3.098-5.415,6.446-7.713,9.978
		c-1.836,2.819-3.51,5.74-5.052,8.735c-0.055,0.128-0.116,0.25-0.172,0.386c0.05,0.041,0.077,0.082,0.125,0.102
		C219.324,183.661,220.964,184.609,222.615,185.558 M264.15,161.627c4.184-2.413,8.343-4.812,12.501-7.211
		c0.061-0.041,0.132-0.082,0.193-0.123c0.013,0,0.013-0.013,0.02-0.026c0.007-0.008,0.023-0.021,0.023-0.034
		c0.035-0.414,0.028-4.032-0.017-4.351c-0.081-0.027-0.173-0.074-0.268-0.102c-1-0.271-2.007-0.487-3.026-0.685
		c-1.528-0.292-3.052-0.495-4.601-0.63c-1.312-0.123-2.63-0.149-3.941-0.183c-0.363-0.014-0.723,0.02-1.077,0.027
		c-1.484,0.007-2.964,0.109-4.444,0.236c-1.274,0.109-2.544,0.258-3.809,0.475c-1.383,0.224-2.735,0.529-4.074,0.922
		c-0.084,0.021-0.152,0.068-0.224,0.095c-0.04,0.569-0.027,3.904,0.014,4.243C255.645,156.713,259.891,159.167,264.15,161.627
		 M290.77,163.539c-0.401-0.278-12.403-7.204-12.668-7.306c-0.027,0.007-0.055,0.007-0.081,0.02
		c-4.182,2.406-8.374,4.819-12.565,7.238c-0.055,0.034-0.109,0.068-0.159,0.102c-0.008,0.007-0.021,0.027-0.021,0.027
		c-0.013,0.014-0.021,0.027-0.034,0.041v14.517c0.021,0.041,0.027,0.048,0.034,0.062c0.013,0.013,0.033,0.033,0.062,0.047
		c4.068,2.352,8.147,4.704,12.221,7.062c0.123,0.075,0.25,0.135,0.366,0.203c0.014,0.007,0.027,0.007,0.041,0.007
		c0.014,0.007,0.026,0,0.067,0c4.141-2.385,8.324-4.792,12.478-7.19c0.061-0.035,0.116-0.068,0.17-0.103
		c0.014-0.006,0.014-0.014,0.026-0.027c0-0.007,0-0.021,0.013-0.048C290.749,173.318,290.749,168.432,290.77,163.539 M250.3,156.138
		c-4.249,2.459-8.495,4.9-12.715,7.347c-0.013,0.04-0.026,0.068-0.026,0.088c-0.01,0.075-0.01,0.149-0.01,0.237
		c0,4.771,0,9.542,0.01,14.314c0,0.013,0,0.028,0.007,0.034c0.007,0.014,0.013,0.034,0.034,0.068
		c4.225,2.44,8.479,4.899,12.728,7.347c0.139-0.068,0.251-0.128,0.353-0.203c1.799-1.024,3.595-2.067,5.395-3.098
		c2.227-1.288,4.446-2.568,6.676-3.856c0.111-0.061,0.234-0.101,0.311-0.243c0-4.745,0-9.502,0-14.266c0-0.075,0-0.143-0.013-0.23
		c0-0.014,0-0.027-0.006-0.034c0-0.013-0.007-0.021-0.034-0.068C258.792,161.105,254.561,158.631,250.3,156.138 M223.787,187.462
		c-0.026,0.082-0.034,0.102-0.034,0.129c0,4.703,0,9.421,0,14.131c0,0.129,0,0.258,0.008,0.379v0.041
		c0,0.013,0.013,0.02,0.026,0.034c0.014,0.02,0.028,0.047,0.051,0.053c4.12,2.386,8.238,4.765,12.359,7.144
		c0.078,0.034,0.139,0.075,0.2,0.109c0.023,0.007,0.037,0.013,0.043,0.013c0.014,0,0.027,0,0.034,0
		c0.376-0.176,12.498-7.177,12.749-7.367V187.47c-0.167-0.096-0.319-0.19-0.471-0.272c-2.325-1.348-4.656-2.697-6.981-4.032
		c-1.647-0.956-3.304-1.911-4.957-2.86c-0.116-0.067-0.228-0.169-0.394-0.177C232.205,182.576,227.999,185.017,223.787,187.462
		 M251.395,202.217c4.25,2.453,8.489,4.907,12.715,7.346c0.057-0.013,0.083-0.013,0.103-0.027c4.062-2.338,8.114-4.67,12.174-7.015
		c0.153-0.094,0.305-0.183,0.458-0.27c0.013-0.015,0.02-0.021,0.026-0.027c0.007-0.014,0.017-0.027,0.03-0.068
		c0-0.034,0.015-0.095,0.015-0.162c-0.015-4.813-0.015-9.618-0.015-14.437c0-0.007-0.014-0.02-0.014-0.034
		c0-0.013-0.017-0.02-0.023-0.034c-0.524-0.36-12.436-7.218-12.734-7.347c-0.102,0.062-0.214,0.129-0.326,0.19
		c-2.762,1.585-5.522,3.179-8.278,4.771c-1.25,0.725-2.508,1.443-3.761,2.176c-0.125,0.068-0.278,0.122-0.37,0.264V202.217z
		 M291.833,180.129c-4.257,2.447-8.492,4.894-12.715,7.333c-0.054,0.562-0.09,14.288-0.028,14.734
		c0.015,0.014,0.028,0.033,0.055,0.055c0.041,0.034,0.103,0.067,0.156,0.094c4.154,2.4,8.315,4.805,12.465,7.205
		c0.013,0,0.025,0,0.039,0c0.015,0,0.028,0,0.067,0c4.217-2.433,8.467-4.88,12.716-7.326c0-0.177,0-0.332,0-0.482
		c0-4.568,0.013-9.142,0-13.704c0-0.651,0.107-0.481-0.475-0.819c-3.578-2.074-7.157-4.142-10.735-6.208
		C292.869,180.72,292.361,180.427,291.833,180.129 M320.46,212.708c-0.109-0.068-14.693-8.532-14.843-8.614
		c-4.608,2.657-9.217,5.313-13.839,7.983c-4.61-2.657-9.19-5.32-13.812-7.977c-0.773,0.42-13.057,7.516-13.843,7.969
		c-0.119-0.067-0.24-0.135-0.366-0.195c-2.763-1.606-13.375-7.733-13.514-7.801c-0.576,0.312-13.212,7.605-13.781,7.95
		c-0.153-0.088-0.285-0.156-0.417-0.237c-4.338-2.494-8.663-5.002-12.993-7.496c-0.484-0.278-0.345-0.257-0.79-0.02
		c-2.317,1.2-4.628,2.413-6.94,3.62c-1.444,0.752-2.881,1.511-4.316,2.263c-0.042,0.021-0.092,0.041-0.153,0.061
		c-0.319-0.101-0.604-0.298-0.918-0.447c-0.319-0.163-0.631-0.333-0.943-0.501c-0.312-0.163-0.617-0.319-0.922-0.481
		c-0.321-0.163-0.64-0.325-0.951-0.495c-0.299-0.169-0.625-0.285-0.895-0.508c0.43-2.277,0.942-4.513,1.616-6.71
		c1.742-5.74,3.894-11.324,6.456-16.733c1.484-3.138,3.107-6.202,4.896-9.169c1.992-3.321,4.185-6.521,6.628-9.543
		c1.258-1.552,2.562-3.049,3.958-4.479c0.691-0.711,1.359-1.431,2.061-2.128c0.847-0.854,1.749-1.64,2.688-2.406
		c2.433-2,5.022-3.782,7.79-5.293c2.033-1.118,4.138-2.094,6.364-2.758c1.874-0.556,3.748-1.112,5.679-1.471
		c1.088-0.204,2.193-0.386,3.297-0.502c0.955-0.095,1.908-0.189,2.863-0.271c0.715-0.055,1.432-0.075,2.146-0.116
		c0.097,0,0.21,0.021,0.292-0.06h3.755c0.04,0.02,0.092,0.054,0.132,0.06c0.471,0.028,0.945,0.042,1.415,0.083
		c0.929,0.074,1.861,0.156,2.783,0.257c1.207,0.148,2.409,0.352,3.596,0.596c1.895,0.386,3.753,0.901,5.59,1.491
		c1.817,0.597,3.552,1.396,5.232,2.305c2.929,1.592,5.64,3.491,8.188,5.646c0.956,0.806,1.877,1.633,2.738,2.527
		c2.169,2.264,4.107,4.731,5.842,7.34c2.021,3.023,3.769,6.209,5.326,9.502c1.267,2.677,2.406,5.409,3.484,8.18
		c0.319,0.848,0.65,1.688,0.949,2.549c0.312,0.88,0.583,1.769,0.888,2.656c0.372,1.092,0.76,2.176,1.214,3.227
		c0.135,0.305,0.284,0.603,0.427,0.901c0.075,0.163,0.195,0.271,0.372,0.299c0.245,0.054,0.501,0.115,0.753,0.128
		c0.393,0.014,0.793,0.014,1.186-0.046c0.387-0.068,0.771-0.123,1.172-0.184c0.849-0.123,1.701-0.251,2.542-0.373v19.423H320.46z"/>
</g>
</svg>
