<?xml version="1.0" encoding="utf-8"?>
<!-- Generator: Adobe Illustrator 16.0.0, SVG Export Plug-In . SVG Version: 6.00 Build 0)  -->
<!DOCTYPE svg PUBLIC "-//W3C//DTD SVG 1.1//EN" "http://www.w3.org/Graphics/SVG/1.1/DTD/svg11.dtd">
<svg version="1.1" id="Layer_1" xmlns="http://www.w3.org/2000/svg" xmlns:xlink="http://www.w3.org/1999/xlink" x="0px" y="0px"
	 width="521px" height="499.68px" viewBox="0 0 521 499.68" enable-background="new 0 0 521 499.68" xml:space="preserve">
<rect fill="#CE80A6" width="520.502" height="499.68"/>
<g>
	<defs>
		<rect id="SVGID_1_" width="520.502" height="499.68"/>
	</defs>
	<clipPath id="SVGID_2_">
		<use xlink:href="#SVGID_1_"  overflow="visible"/>
	</clipPath>
	<path clip-path="url(#SVGID_2_)" fill="#A6A8AB" d="M209.814,232.515C114.992,244.389,81.213,378.079,80.312,381.97
		c-0.895,3.904-1.572,7.401-1.572,7.401l9.359,5.191c-0.278,1.748-6.798,16.604-17.127,22.257
		c-10.349,5.639-22.792,2.25-22.792,2.25s-3.159-0.529-3.843,0.148c-2.433,2.4,0.19,5.26,0.19,5.26s9.597,8.024,24.798,9.963
		c16.666,2.128,37.628-8.16,37.628-8.16s-3.815,14.842-4.405,23.708c-0.562,8.241,8.519,10.287,8.519,10.287
		s15.628,2.698,25.497,3.728c7.028,0.76,31.643,4.853,34.233-2.453c1.829-5.179,3.124-27.083,3.124-27.083
		s11.921,1.967,25.917,0.068C213.812,432.624,229.129,423,229.129,423s14.951,10.641,28.743,12.931
		c13.778,2.332,26.154-0.975,26.154-0.975s0.082,3.172,2.06,20.507c1.152,10.153,11.671,8.622,11.671,8.622
		s40.441-4.474,54.646-8.119c7.191-1.816,2.19-21.838,2.19-21.838l-2.386-13.541c0,0,23.219,7.361,56.4-8.227
		c22.135-10.438,33.461-36.734,33.461-36.734s7.746,0.081,19.579-3.511c11.82-3.592,24.25-10.775,24.765-35.744
		c0-0.136,0.015-0.257,0.015-0.393v-0.583c-0.204-23.341-24.007-41.748-42.13-44.555c-18.372-2.846-29.888,7.212-34.611,14.951
		c-5.876,9.651-11.922,43.416-16.713,49.244c-4.398,5.368-16.706,5.652-16.706,5.652s-2.63,0.962-2.772-0.949l-0.115-2.954
		c0,0-10.37,2.575-13.283-0.108c-2.21-2.047-8.52-21.132-8.52-21.132C336.307,295.003,309.171,231.2,230.16,231.2
		C223.721,231.2,216.944,231.633,209.814,232.515"/>
	<path clip-path="url(#SVGID_2_)" fill="#A6A8AB" d="M214.883,51.176c-80.881,10.125-109.706,124.165-110.471,127.499
		c-0.766,3.321-1.342,6.303-1.342,6.303l7.984,4.432c-0.244,1.491-5.802,14.165-14.613,18.991
		c-8.824,4.812-19.438,1.911-19.438,1.911s-2.697-0.447-3.28,0.135c-2.074,2.046,0.163,4.473,0.163,4.473s8.187,6.859,21.152,8.512
		c14.226,1.803,32.098-6.967,32.098-6.967s-3.261,12.66-3.755,20.224c-0.481,7.035,7.259,8.783,7.259,8.783
		s13.351,2.291,21.756,3.186c5.991,0.637,26.993,4.121,29.196-2.115c1.573-4.405,2.684-23.097,2.684-23.097
		s10.159,1.681,22.095,0.068c11.928-1.64,24.995-9.841,24.995-9.841s12.742,9.068,24.508,11.02
		c11.758,1.993,22.31-0.826,22.31-0.826s0.082,2.711,1.763,17.499c0.982,8.648,9.963,7.36,9.963,7.36s34.482-3.823,46.615-6.94
		c6.14-1.545,1.856-18.625,1.856-18.625l-2.033-11.548c0,0,19.817,6.276,48.119-7.022c18.882-8.905,28.539-31.338,28.539-31.338
		s6.608,0.082,16.707-2.982c10.085-3.063,20.691-9.204,21.132-30.498c0-0.122,0-0.217,0-0.339v-0.501
		c-0.169-19.898-20.475-35.605-35.92-38.004c-15.684-2.426-25.511,6.15-29.536,12.752c-5.016,8.241-10.172,37.045-14.253,42.02
		c-3.755,4.568-14.267,4.812-14.267,4.812s-2.229,0.827-2.358-0.813l-0.102-2.521c0,0-8.844,2.196-11.325-0.094
		c-1.884-1.735-7.271-18.015-7.271-18.015c-13.021-34.595-36.172-89.024-103.579-89.01C226.744,50.058,220.97,50.417,214.883,51.176
		"/>
	<path clip-path="url(#SVGID_2_)" fill="#FFFFFF" d="M197.235,57.784c-0.366,0.101-0.611,0.169-0.868,0.25
		c-3.742,1.22-7.347,2.826-10.83,4.643c-5.856,3.07-11.345,6.703-16.55,10.769c-2.196,1.708-4.304,3.498-6.337,5.381
		c-0.155,0.143-0.4,0.265-0.346,0.59c1.925,1.111,3.864,2.229,5.829,3.368c2.454-1.41,4.873-2.806,7.299-4.208
		c2.419-1.396,4.853-2.799,7.272-4.188c2.426-1.396,4.853-2.799,7.279-4.196c2.412-1.402,4.853-2.778,7.252-4.188V57.784z
		 M300.237,79.39c-0.548-0.522-0.988-0.942-1.43-1.362c-4.439-4.114-9.204-7.821-14.267-11.135
		c-4.377-2.887-8.96-5.457-13.825-7.462c-1.56-0.645-3.172-1.193-4.744-1.776c-0.218-0.081-0.44-0.203-0.685-0.006v8.248
		c0.535,0.427,28.112,16.381,29.136,16.855C296.308,81.667,298.225,80.562,300.237,79.39 M355.054,160.688
		c-0.258,0.027-0.407,0.027-0.557,0.041c-1.003,0.149-2.006,0.339-3.022,0.434c-1.816,0.163-3.619,0.163-5.396-0.271
		c-0.656-0.163-1.28-0.393-1.869-0.719c-1.133-0.596-1.898-1.545-2.44-2.67c-0.515-1.043-1.004-2.101-1.451-3.185
		c-1.538-3.714-2.791-7.537-4.052-11.359c-0.44-1.329-0.916-2.644-1.384-3.972c-0.066-0.217-0.188-0.407-0.283-0.61
		c-0.733,0.298-5.504,3.037-6.1,3.511c-0.014,0.122-0.014,0.271-0.014,0.42c0,10.966,0,21.945,0.014,32.911
		c0,0.028,0.013,0.054,0.026,0.095c0.014,0.027,0.027,0.041,0.122,0.163c8.635,4.988,17.377,10.03,26.119,15.073
		c0.068,0.04,0.164,0.027,0.245,0.04c0.108-0.691,0.162-18.678,0.081-29.061C355.094,161.271,355.066,161.027,355.054,160.688
		 M109.773,188.015c1.186-0.624,2.406-1.247,3.612-1.885c6.642-3.483,13.284-6.954,19.926-10.423
		c0.921-0.488,0.826-0.298,0.826-1.396c0-10.56,0-21.119,0-31.678v-0.827c-0.644-0.515-10.627-6.276-11.359-6.561
		c-0.285,0.312-0.42,0.746-0.597,1.125c-5.252,11.115-9.772,22.515-13.5,34.226c-1.396,4.433-2.725,8.865-3.661,13.419
		c-0.081,0.447-0.175,0.908-0.257,1.328C105.32,185.765,108.75,187.581,109.773,188.015 M296.89,120.607
		c0.948,0.664,28.425,16.483,29.062,16.74c1.355-0.651,6.201-3.497,6.724-3.945c-0.082-0.23-0.15-0.488-0.251-0.718
		c-2.881-7.211-5.971-14.314-9.536-21.2c-3.192-6.185-6.716-12.155-10.722-17.842c-2.426-3.436-5.015-6.736-7.794-9.895
		c-0.204-0.23-0.373-0.529-0.718-0.63c-2.244,1.302-4.508,2.603-6.711,3.877C296.835,88.031,296.795,119.441,296.89,120.607
		 M136.55,137.347c0.285-0.149,0.542-0.285,0.8-0.42c5.368-3.118,10.75-6.222,16.13-9.312c3.795-2.196,7.591-4.378,11.373-6.561
		c0.271-0.162,0.529-0.339,0.8-0.501c0.013-10.098,0.026-20.125,0.054-30.163c0-1.05-0.014-2.094-0.028-3.151
		c0-0.027,0-0.054-0.026-0.081c0-0.021-0.014-0.047-0.035-0.081c-1.179-0.8-6.512-3.836-7.15-4.066
		c-0.189,0.196-0.407,0.386-0.61,0.596c-1.112,1.152-2.237,2.304-3.327,3.477c-6.54,7.056-12.335,14.693-17.581,22.749
		c-4.195,6.438-7.991,13.094-11.501,19.912c-0.143,0.285-0.271,0.583-0.414,0.881c0.129,0.095,0.196,0.189,0.292,0.244
		C129.062,133.023,132.803,135.178,136.55,137.347 M231.25,82.786c9.549-5.503,19.024-10.973,28.506-16.436
		c0.155-0.094,0.292-0.183,0.44-0.278c0.027-0.013,0.041-0.04,0.054-0.061c0.014-0.026,0.028-0.054,0.041-0.081
		c0.089-0.942,0.068-9.21-0.026-9.929c-0.184-0.067-0.4-0.156-0.611-0.217c-2.291-0.617-4.595-1.132-6.913-1.565
		c-3.47-0.657-6.954-1.132-10.478-1.444c-2.995-0.271-6.004-0.332-9-0.42c-0.813-0.02-1.627,0.068-2.44,0.068
		c-3.389,0.02-6.764,0.23-10.139,0.535c-2.9,0.265-5.801,0.604-8.675,1.078c-3.145,0.529-6.242,1.227-9.298,2.108
		c-0.19,0.054-0.353,0.155-0.501,0.224c-0.095,1.308-0.068,8.898,0.041,9.658C211.874,71.589,221.539,77.174,231.25,82.786
		 M291.942,87.15c-0.901-0.644-28.275-16.428-28.886-16.672c-0.054,0.021-0.115,0.021-0.162,0.047
		c-9.557,5.503-19.112,11-28.655,16.51c-0.128,0.075-0.244,0.163-0.366,0.237c-0.026,0.02-0.047,0.047-0.061,0.067
		c-0.014,0.021-0.034,0.055-0.061,0.095v33.09c0.041,0.068,0.054,0.095,0.075,0.122c0.047,0.041,0.074,0.095,0.129,0.122
		c9.284,5.354,18.589,10.736,27.875,16.104c0.285,0.163,0.569,0.312,0.848,0.461c0.021,0.014,0.054,0.014,0.081,0.014
		c0.041,0.013,0.054,0,0.136,0c9.461-5.449,18.97-10.912,28.472-16.388c0.129-0.082,0.244-0.163,0.372-0.23
		c0.027-0.027,0.041-0.041,0.056-0.068c0.013-0.027,0.026-0.068,0.061-0.122C291.888,109.438,291.908,98.299,291.942,87.15
		 M199.695,70.282c-9.698,5.598-19.377,11.169-29.007,16.719c-0.035,0.115-0.061,0.169-0.061,0.224
		c-0.014,0.176-0.014,0.345-0.014,0.529c0,10.877,0,21.765,0.014,32.65c0,0.026,0.013,0.054,0.013,0.081
		c0.014,0.027,0.027,0.054,0.082,0.136c9.637,5.571,19.336,11.169,29.035,16.753c0.298-0.163,0.548-0.298,0.8-0.447
		c4.1-2.358,8.187-4.717,12.281-7.076c5.075-2.928,10.152-5.855,15.229-8.783c0.244-0.163,0.542-0.244,0.711-0.569
		c0-10.803,0.014-21.664,0-32.515c0-0.176,0-0.353-0.027-0.529c0-0.02,0-0.047-0.014-0.081c-0.014-0.027-0.027-0.047-0.102-0.149
		C219.045,81.613,209.393,75.961,199.695,70.282 M139.234,141.685c-0.047,0.189-0.081,0.23-0.081,0.285c0,10.749,0,21.498,0,32.233
		c0,0.298,0,0.583,0.014,0.881c0,0.027,0,0.055,0.007,0.081c0.013,0.028,0.033,0.041,0.054,0.068
		c0.041,0.041,0.067,0.108,0.115,0.122c9.4,5.449,18.787,10.857,28.194,16.293c0.162,0.082,0.311,0.163,0.46,0.244
		c0.028,0.014,0.068,0.014,0.089,0.027c0.033,0,0.054-0.013,0.087-0.013c0.847-0.38,28.479-16.348,29.048-16.781v-33.439
		c-0.367-0.204-0.719-0.407-1.071-0.61c-5.3-3.063-10.613-6.127-15.914-9.19c-3.761-2.168-7.529-4.351-11.304-6.506
		c-0.258-0.163-0.515-0.38-0.908-0.407C158.441,130.542,148.838,136.113,139.234,141.685 M202.183,175.328
		c9.685,5.598,19.356,11.183,28.973,16.74c0.142-0.027,0.197-0.027,0.251-0.068c9.244-5.313,18.502-10.653,27.747-15.981
		c0.345-0.203,0.697-0.42,1.043-0.624c0.027-0.013,0.041-0.041,0.068-0.054c0.014-0.027,0.026-0.068,0.061-0.135
		c0.006-0.095,0.026-0.244,0.026-0.38c-0.013-10.979-0.021-21.945-0.026-32.924c0-0.027-0.021-0.054-0.035-0.082
		c-0.013-0.027-0.026-0.041-0.041-0.081c-1.207-0.786-28.356-16.442-29.048-16.727c-0.23,0.136-0.488,0.271-0.745,0.407
		c-6.29,3.646-12.58,7.266-18.863,10.898c-2.853,1.64-5.713,3.294-8.573,4.934c-0.299,0.176-0.638,0.299-0.84,0.61V175.328z
		 M294.368,124.958c-9.678,5.584-19.356,11.169-28.979,16.727c-0.144,1.274-0.204,32.572-0.068,33.575
		c0.033,0.054,0.062,0.095,0.122,0.135c0.115,0.082,0.244,0.163,0.366,0.23c9.475,5.476,18.942,10.939,28.418,16.401
		c0.02,0.014,0.054,0.014,0.088,0.027c0.026,0,0.054-0.013,0.155-0.013c9.61-5.544,19.295-11.115,28.987-16.713
		c0-0.394,0.007-0.732,0.007-1.084c0-10.41,0.006-20.833-0.007-31.244c0-1.478,0.243-1.098-1.099-1.871
		c-8.159-4.731-16.306-9.434-24.465-14.151C296.727,126.313,295.574,125.649,294.368,124.958 M359.648,199.238
		c-0.23-0.149-33.521-19.451-33.847-19.627c-10.505,6.059-21.01,12.104-31.556,18.19c-10.491-6.045-20.955-12.104-31.487-18.19
		c-1.755,0.962-29.773,17.147-31.562,18.177c-0.271-0.149-0.556-0.298-0.827-0.447c-6.31-3.646-30.505-17.607-30.817-17.784
		c-1.321,0.719-30.118,17.35-31.426,18.123c-0.346-0.189-0.644-0.352-0.956-0.528c-9.867-5.707-19.735-11.399-29.61-17.106
		c-1.104-0.624-0.793-0.57-1.81-0.041c-5.286,2.752-10.545,5.503-15.805,8.255c-3.294,1.722-6.575,3.443-9.847,5.165
		c-0.102,0.04-0.225,0.094-0.353,0.148c-0.739-0.244-1.39-0.691-2.081-1.03c-0.733-0.366-1.451-0.759-2.169-1.152
		c-0.698-0.366-1.397-0.719-2.094-1.085c-0.725-0.379-1.457-0.745-2.175-1.152c-0.678-0.38-1.423-0.651-2.033-1.152
		c0.976-5.178,2.147-10.274,3.687-15.303c3.972-13.067,8.872-25.795,14.721-38.129c3.382-7.157,7.075-14.124,11.155-20.916
		c4.555-7.58,9.542-14.866,15.113-21.751c2.86-3.538,5.856-6.96,9.041-10.22c1.559-1.62,3.084-3.267,4.677-4.846
		c1.938-1.945,3.999-3.748,6.126-5.482c5.558-4.562,11.467-8.628,17.77-12.084c4.636-2.548,9.435-4.751,14.504-6.263
		c4.276-1.281,8.553-2.542,12.938-3.369c2.486-0.467,5.008-0.874,7.529-1.132c2.169-0.224,4.351-0.44,6.52-0.617
		c1.633-0.135,3.267-0.183,4.893-0.264c0.23-0.014,0.475,0.033,0.671-0.156h8.56c0.108,0.054,0.203,0.135,0.298,0.142
		c1.084,0.068,2.162,0.102,3.24,0.197c2.115,0.169,4.243,0.339,6.344,0.589c2.751,0.332,5.476,0.8,8.194,1.355
		c4.318,0.888,8.56,2.047,12.741,3.41c4.142,1.349,8.086,3.165,11.915,5.239c6.689,3.626,12.884,7.97,18.698,12.877
		c2.155,1.823,4.257,3.721,6.222,5.761c4.961,5.158,9.373,10.776,13.339,16.74c4.607,6.9,8.572,14.155,12.117,21.637
		c2.901,6.126,5.504,12.362,7.937,18.665c0.753,1.938,1.504,3.863,2.189,5.815c0.705,2.006,1.321,4.04,2.019,6.06
		c0.842,2.48,1.723,4.947,2.766,7.36c0.299,0.691,0.638,1.369,0.977,2.061c0.162,0.366,0.433,0.61,0.833,0.678
		c0.569,0.108,1.146,0.244,1.722,0.271c0.901,0.054,1.81,0.041,2.704-0.095c0.895-0.149,1.776-0.271,2.677-0.42
		c1.932-0.285,3.87-0.569,5.795-0.854c0,14.503,0,44.026-0.007,44.284H359.648z"/>
	<path clip-path="url(#SVGID_2_)" fill="#FFFFFF" d="M189.116,240.268c-0.42,0.109-0.719,0.19-1.004,0.286
		c-4.398,1.437-8.606,3.307-12.701,5.449c-6.866,3.592-13.296,7.862-19.41,12.62c-2.562,2.006-5.036,4.106-7.415,6.316
		c-0.19,0.162-0.474,0.297-0.42,0.691c2.258,1.287,4.534,2.603,6.838,3.931c2.875-1.641,5.713-3.28,8.561-4.921
		c2.833-1.64,5.686-3.28,8.526-4.921c2.84-1.626,5.693-3.266,8.526-4.92c2.833-1.626,5.686-3.239,8.499-4.907V240.268z
		 M309.862,265.588c-0.638-0.609-1.153-1.11-1.668-1.6c-5.205-4.824-10.79-9.162-16.713-13.052
		c-5.158-3.389-10.519-6.398-16.226-8.744c-1.829-0.758-3.7-1.396-5.557-2.087c-0.244-0.095-0.509-0.23-0.807,0v9.665
		c0.637,0.501,32.959,19.193,34.15,19.762C305.253,268.259,307.503,266.958,309.862,265.588 M374.125,360.893
		c-0.312,0.026-0.475,0.026-0.638,0.054c-1.192,0.177-2.372,0.394-3.558,0.502c-2.115,0.202-4.236,0.202-6.323-0.312
		c-0.772-0.189-1.498-0.474-2.196-0.841c-1.329-0.704-2.216-1.815-2.859-3.13c-0.597-1.233-1.166-2.468-1.694-3.741
		c-1.803-4.365-3.28-8.838-4.758-13.325c-0.509-1.558-1.064-3.09-1.614-4.649c-0.094-0.243-0.223-0.474-0.331-0.704
		c-0.86,0.339-6.46,3.565-7.15,4.121c-0.014,0.135-0.027,0.311-0.027,0.474c0.007,12.864,0.014,25.728,0.027,38.591
		c0,0.027,0.013,0.067,0.021,0.095c0.014,0.041,0.048,0.067,0.143,0.203c10.125,5.842,20.379,11.766,30.62,17.662
		c0.088,0.054,0.189,0.04,0.284,0.054c0.136-0.8,0.196-21.904,0.108-34.063C374.179,361.584,374.145,361.271,374.125,360.893
		 M86.588,392.936c1.403-0.732,2.819-1.478,4.242-2.223c7.788-4.066,15.575-8.146,23.355-12.213
		c1.071-0.569,0.969-0.339,0.969-1.641c0.007-12.376,0-24.751,0-37.14v-0.962c-0.752-0.598-12.451-7.361-13.305-7.7
		c-0.345,0.38-0.487,0.882-0.704,1.342c-6.167,13.027-11.454,26.392-15.826,40.109c-1.647,5.178-3.198,10.382-4.283,15.724
		c-0.102,0.529-0.21,1.057-0.319,1.559C81.369,390.279,85.395,392.421,86.588,392.936 M305.944,313.912
		c1.111,0.758,33.317,19.315,34.063,19.626c1.6-0.771,7.271-4.106,7.881-4.636c-0.087-0.271-0.169-0.556-0.284-0.84
		c-3.368-8.444-7.014-16.768-11.188-24.859c-3.741-7.238-7.876-14.247-12.565-20.901c-2.841-4.025-5.884-7.902-9.136-11.603
		c-0.245-0.271-0.428-0.61-0.842-0.732c-2.636,1.519-5.279,3.036-7.875,4.527C305.876,275.728,305.836,312.542,305.944,313.912
		 M117.994,333.538c0.325-0.189,0.629-0.339,0.921-0.501c6.303-3.646,12.606-7.279,18.922-10.925
		c4.439-2.562,8.892-5.124,13.325-7.686c0.311-0.19,0.629-0.394,0.928-0.583c0.02-11.834,0.047-23.599,0.061-35.364
		c0-1.22,0-2.453-0.014-3.688c0-0.026-0.014-0.068-0.033-0.095c-0.014-0.026-0.021-0.067-0.035-0.095
		c-1.396-0.948-7.631-4.501-8.383-4.771c-0.237,0.23-0.488,0.461-0.726,0.705c-1.3,1.342-2.616,2.697-3.889,4.079
		c-7.673,8.256-14.463,17.216-20.618,26.663c-4.919,7.536-9.372,15.345-13.486,23.341c-0.163,0.339-0.312,0.678-0.481,1.031
		c0.142,0.122,0.23,0.216,0.346,0.284C109.21,328.469,113.589,331.004,117.994,333.538 M229,269.574
		c11.189-6.466,22.298-12.864,33.406-19.275c0.184-0.108,0.353-0.217,0.528-0.325c0.027-0.014,0.041-0.041,0.068-0.068
		c0.014-0.027,0.027-0.068,0.054-0.095c0.089-1.112,0.068-10.79-0.04-11.644c-0.23-0.082-0.468-0.176-0.726-0.244
		c-2.677-0.732-5.375-1.328-8.099-1.843c-4.06-0.773-8.159-1.329-12.28-1.694c-3.511-0.312-7.036-0.38-10.553-0.488
		c-0.956-0.013-1.917,0.068-2.874,0.082c-3.965,0.014-7.922,0.271-11.874,0.624c-3.409,0.312-6.798,0.705-10.173,1.26
		c-3.68,0.625-7.306,1.451-10.892,2.481c-0.223,0.067-0.426,0.176-0.603,0.257c-0.108,1.532-0.067,10.424,0.054,11.318
		C206.289,256.453,217.622,263,229,269.574 M300.144,274.684c-1.064-0.759-33.155-19.262-33.86-19.532
		c-0.068,0-0.136,0.014-0.19,0.04c-11.195,6.453-22.406,12.905-33.595,19.37c-0.142,0.082-0.292,0.177-0.413,0.271
		c-0.041,0.027-0.068,0.055-0.082,0.081c-0.02,0.027-0.041,0.055-0.075,0.096v38.807c0.047,0.081,0.061,0.108,0.088,0.149
		c0.054,0.04,0.095,0.095,0.156,0.122c10.891,6.303,21.782,12.593,32.681,18.881c0.318,0.19,0.657,0.367,0.989,0.543
		c0.02,0.026,0.061,0.026,0.089,0.026c0.04,0,0.073,0,0.161,0c11.102-6.397,22.23-12.809,33.387-19.22
		c0.135-0.082,0.27-0.19,0.426-0.285c0.021-0.014,0.041-0.041,0.062-0.067c0.013-0.027,0.026-0.054,0.068-0.136
		C300.075,300.804,300.102,287.751,300.144,274.684 M192.01,254.921c-11.379,6.547-22.711,13.081-34.002,19.601
		c-0.047,0.122-0.081,0.189-0.087,0.244c0,0.217-0.007,0.42-0.007,0.623c0.007,12.769,0.007,25.523,0.007,38.278
		c0,0.027,0.021,0.068,0.026,0.095c0.021,0.027,0.035,0.055,0.089,0.163c11.305,6.52,22.669,13.095,34.036,19.654
		c0.353-0.203,0.651-0.38,0.948-0.542c4.798-2.766,9.597-5.53,14.388-8.296c5.958-3.429,11.909-6.871,17.859-10.314
		c0.292-0.163,0.63-0.258,0.84-0.638V275.66c0-0.203-0.013-0.407-0.041-0.61c0-0.04,0-0.067-0.013-0.096
		c-0.014-0.026-0.042-0.054-0.123-0.188C214.693,268.205,203.369,261.576,192.01,254.921 M121.139,338.621
		c-0.054,0.204-0.095,0.271-0.095,0.339c-0.014,12.593-0.014,25.185-0.014,37.777c0,0.339,0.014,0.678,0.014,1.017
		c0,0.041,0,0.082,0.027,0.108c0.014,0.027,0.027,0.055,0.054,0.082c0.047,0.054,0.082,0.122,0.136,0.148
		c11.02,6.371,22.026,12.729,33.047,19.099c0.175,0.095,0.365,0.177,0.542,0.271c0.042,0.027,0.068,0.027,0.108,0.027
		c0.028,0.014,0.068,0,0.095,0c1.004-0.461,33.386-19.167,34.05-19.668v-39.201c-0.42-0.243-0.841-0.487-1.247-0.718
		c-6.222-3.605-12.444-7.185-18.659-10.775c-4.412-2.549-8.831-5.098-13.242-7.632c-0.319-0.19-0.611-0.461-1.064-0.461
		C143.653,325.555,132.375,332.089,121.139,338.621 M194.917,378.039c11.359,6.574,22.69,13.121,33.968,19.641
		c0.163-0.041,0.244-0.041,0.298-0.067c10.83-6.249,21.688-12.498,32.518-18.746c0.421-0.244,0.827-0.488,1.233-0.732
		c0.027-0.027,0.055-0.041,0.068-0.067c0.027-0.041,0.027-0.068,0.067-0.163c0.014-0.108,0.033-0.271,0.033-0.447
		c-0.006-12.864-0.02-25.713-0.033-38.576c0-0.042-0.014-0.068-0.027-0.096c-0.013-0.041-0.026-0.067-0.04-0.095
		c-1.424-0.936-33.25-19.288-34.063-19.614c-0.271,0.15-0.569,0.312-0.867,0.475c-7.374,4.27-14.748,8.513-22.122,12.77
		c-3.334,1.938-6.688,3.862-10.03,5.787c-0.36,0.204-0.753,0.353-1.003,0.719V378.039z M302.989,319.008
		c-11.346,6.547-22.677,13.095-33.968,19.6c-0.177,1.506-0.244,38.198-0.089,39.363c0.049,0.055,0.082,0.122,0.143,0.163
		c0.136,0.095,0.285,0.189,0.434,0.271c11.103,6.411,22.203,12.822,33.304,19.233c0.035,0.014,0.068,0.014,0.108,0.014
		c0.027,0,0.068,0,0.184-0.014c11.271-6.492,22.616-13.039,33.976-19.586c0-0.447,0.026-0.854,0.026-1.274
		c0-12.199,0-24.412-0.013-36.639c0-1.721,0.271-1.273-1.289-2.183c-9.562-5.529-19.125-11.047-28.688-16.563
		C305.754,320.607,304.398,319.821,302.989,319.008 M379.52,406.084c-0.285-0.177-39.31-22.786-39.682-23.003
		c-12.314,7.089-24.636,14.192-36.99,21.321c-12.301-7.103-24.575-14.191-36.903-21.321c-2.061,1.125-34.911,20.102-37.005,21.309
		c-0.325-0.177-0.65-0.353-0.976-0.529c-7.401-4.283-35.757-20.644-36.124-20.847c-1.545,0.84-35.296,20.332-36.849,21.227
		c-0.386-0.217-0.752-0.394-1.104-0.61c-11.569-6.683-23.151-13.364-34.727-20.047c-1.275-0.732-0.908-0.678-2.114-0.055
		c-6.182,3.227-12.356,6.466-18.543,9.691c-3.836,2.007-7.686,4.026-11.521,6.047c-0.122,0.053-0.258,0.094-0.428,0.175
		c-0.847-0.298-1.619-0.812-2.433-1.22c-0.86-0.42-1.701-0.88-2.542-1.327c-0.819-0.435-1.633-0.854-2.459-1.289
		c-0.84-0.434-1.694-0.867-2.535-1.328c-0.8-0.447-1.668-0.771-2.4-1.355c1.153-6.086,2.528-12.064,4.325-17.946
		c4.662-15.33,10.41-30.24,17.254-44.718c3.965-8.376,8.316-16.55,13.081-24.493c5.34-8.892,11.196-17.431,17.716-25.51
		c3.354-4.147,6.872-8.16,10.593-11.982c1.837-1.898,3.633-3.823,5.49-5.68c2.271-2.276,4.697-4.392,7.177-6.425
		c6.521-5.354,13.446-10.112,20.833-14.165c5.443-2.982,11.061-5.572,17.004-7.347c5.008-1.505,10.038-2.982,15.174-3.944
		c2.915-0.542,5.856-1.03,8.818-1.329c2.555-0.257,5.103-0.515,7.665-0.718c1.897-0.163,3.809-0.217,5.721-0.312
		c0.271-0.013,0.548,0.041,0.779-0.189h10.051c0.115,0.067,0.231,0.163,0.345,0.176c1.261,0.081,2.528,0.108,3.789,0.23
		c2.48,0.204,4.969,0.394,7.442,0.691c3.226,0.38,6.424,0.936,9.604,1.586c5.062,1.044,10.037,2.399,14.943,3.998
		c4.853,1.586,9.469,3.701,13.962,6.141c7.834,4.256,15.101,9.339,21.904,15.099c2.548,2.129,5.009,4.352,7.307,6.751
		c5.814,6.046,10.979,12.633,15.635,19.614c5.401,8.092,10.051,16.591,14.205,25.388c3.396,7.157,6.445,14.477,9.306,21.863
		c0.867,2.264,1.755,4.528,2.568,6.818c0.827,2.346,1.553,4.731,2.353,7.09c0.989,2.913,2.02,5.814,3.253,8.634
		c0.339,0.813,0.752,1.612,1.139,2.412c0.196,0.435,0.515,0.719,0.989,0.801c0.663,0.122,1.328,0.284,2.006,0.324
		c1.058,0.055,2.121,0.055,3.171-0.121c1.045-0.163,2.089-0.326,3.146-0.488c2.264-0.325,4.521-0.664,6.791-1.003
		c0,17.012,0,51.616-0.007,51.915C379.716,406.097,379.587,406.084,379.52,406.084"/>
</g>
</svg>
