<?xml version="1.0" encoding="utf-8"?>
<!-- Generator: Adobe Illustrator 16.0.0, SVG Export Plug-In . SVG Version: 6.00 Build 0)  -->
<!DOCTYPE svg PUBLIC "-//W3C//DTD SVG 1.1//EN" "http://www.w3.org/Graphics/SVG/1.1/DTD/svg11.dtd">
<svg version="1.1" id="Layer_1" xmlns="http://www.w3.org/2000/svg" xmlns:xlink="http://www.w3.org/1999/xlink" x="0px" y="0px"
	 width="432px" height="504px" viewBox="0 0 432 504" enable-background="new 0 0 432 504" xml:space="preserve">
<polygon fill="#FAA61A" points="216.393,2.263 1.872,125.982 1.764,373.649 216.152,497.5 430.675,373.771 430.78,126.113 "/>
<g>
	<defs>
		<rect id="SVGID_1_" x="1.764" y="2.263" width="429.022" height="495.237"/>
	</defs>
	<clipPath id="SVGID_2_">
		<use xlink:href="#SVGID_1_"  overflow="visible"/>
	</clipPath>
	<path clip-path="url(#SVGID_2_)" fill="#231F20" d="M108.752,368.571c0,0,17.554-10.709,20.629-20.906
		c2.043-6.771,0-17.422,0-17.422s-93.656-4.946-93.656-66.469c0-61.54,62.394-81.55,123.052-81.55
		c60.655,0,118.184,31.491,118.184,76.09c0,44.595-47.519,75.234-113.806,75.234C163.156,333.549,150.027,367.312,108.752,368.571"
		/>
	<path clip-path="url(#SVGID_2_)" fill="#FFFFFF" d="M191.29,177.222c0,0,55.172,8.408,80.018,41.295
		c19.022,25.184,21.044,55.605-3.728,84.905c0,0,28.766,6.137,52.53,0c23.763-6.136,31.27-12.514,31.27-12.514
		s24.655,2.831,31.26,28.888c0,0,10.604-12.999,0-33.141c-3.531-6.699-8.132-10.618-8.132-10.618s61.336-75.631-19.386-131.954
		C283.631,94.198,191.29,134.077,191.29,177.222"/>
</g>
</svg>
