<?xml version="1.0" encoding="utf-8"?>
<!-- Generator: Adobe Illustrator 16.0.0, SVG Export Plug-In . SVG Version: 6.00 Build 0)  -->
<!DOCTYPE svg PUBLIC "-//W3C//DTD SVG 1.1//EN" "http://www.w3.org/Graphics/SVG/1.1/DTD/svg11.dtd">
<svg version="1.1" id="Layer_1" xmlns="http://www.w3.org/2000/svg" xmlns:xlink="http://www.w3.org/1999/xlink" x="0px" y="0px"
	 width="72px" height="72px" viewBox="0 0 72 72" enable-background="new 0 0 72 72" xml:space="preserve">
<polygon fill="#231F20" points="35.879,0 4.715,17.972 4.7,53.949 35.844,71.938 67.001,53.969 67.022,17.991 "/>
<g>
	<path fill="#009444" d="M28.024,20.733c-12.189,1.525-16.531,18.708-16.645,19.21c-0.112,0.502-0.205,0.952-0.205,0.952
		l1.207,0.665c-0.037,0.229-0.873,2.138-2.204,2.868c-1.328,0.719-2.928,0.281-2.928,0.281s-0.407-0.068-0.493,0.022
		c-0.313,0.306,0.022,0.677,0.022,0.677s1.234,1.03,3.189,1.28c2.14,0.271,4.838-1.051,4.838-1.051s-0.492,1.904-0.57,3.049
		c-0.073,1.062,1.092,1.319,1.092,1.319s2.013,0.346,3.281,0.484c0.902,0.095,4.063,0.618,4.4-0.321
		c0.232-0.662,0.401-3.48,0.401-3.48s1.533,0.253,3.331,0.009c1.794-0.244,3.763-1.478,3.763-1.478s1.925,1.365,3.695,1.656
		c1.771,0.301,3.362-0.123,3.362-0.123s0.011,0.411,0.265,2.635c0.151,1.305,1.502,1.108,1.502,1.108s5.198-0.576,7.02-1.045
		c0.926-0.232,0.284-2.804,0.284-2.804l-0.307-1.74c0,0,2.985,0.943,7.251-1.061c2.842-1.34,4.3-4.721,4.3-4.721
		s0.759,0.144,2.35,0.075c1.619-0.07,3.894-0.223,4.703-2.212c0.827-2.037-1.243-8.598-6.767-8.759
		c-2.389-0.071-3.979,1.186-4.586,2.178c-0.755,1.243-1.098,4.982-2.016,6.075c-0.567,0.683-2.145,0.725-2.145,0.725
		s-0.334,0.124-0.354-0.122l-0.014-0.379c0,0-1.335,0.331-1.711-0.013c-0.282-0.263-1.094-2.718-1.094-2.718
		c-1.96-5.21-5.451-13.412-15.608-13.41C29.809,20.566,28.939,20.621,28.024,20.733"/>
	<path fill="#231F20" d="M25.309,21.731c-0.055,0.015-0.091,0.025-0.129,0.036c-0.567,0.184-1.109,0.425-1.632,0.701
		c-0.883,0.463-1.712,1.01-2.496,1.624c-0.33,0.256-0.649,0.525-0.953,0.81c-0.025,0.023-0.062,0.04-0.057,0.088
		c0.292,0.169,0.584,0.336,0.879,0.509c0.368-0.212,0.736-0.425,1.101-0.634c0.365-0.212,0.729-0.421,1.098-0.632
		c0.363-0.209,0.727-0.422,1.097-0.632c0.364-0.211,0.728-0.42,1.092-0.631V21.731z M40.831,24.985
		c-0.088-0.078-0.152-0.141-0.223-0.206c-0.666-0.619-1.388-1.177-2.146-1.676c-0.662-0.437-1.35-0.823-2.082-1.124
		c-0.238-0.098-0.478-0.182-0.715-0.27c-0.032-0.011-0.069-0.029-0.104,0v1.243c0.082,0.064,4.239,2.468,4.388,2.54
		C40.237,25.327,40.525,25.163,40.831,24.985 M49.084,37.234c-0.035,0.006-0.06,0.006-0.081,0.007
		c-0.149,0.021-0.304,0.051-0.453,0.066c-0.275,0.024-0.546,0.024-0.816-0.042c-0.097-0.024-0.189-0.058-0.281-0.109
		c-0.17-0.089-0.284-0.231-0.365-0.401c-0.077-0.158-0.154-0.318-0.223-0.479c-0.227-0.561-0.418-1.136-0.611-1.711
		c-0.063-0.201-0.137-0.399-0.202-0.6c-0.018-0.031-0.033-0.062-0.049-0.09c-0.107,0.042-0.827,0.456-0.915,0.527
		c0,0.021-0.006,0.042-0.006,0.064c0.006,1.652,0.006,3.306,0.006,4.958c0,0.003,0,0.007,0.003,0.012
		c0,0.004,0.002,0.006,0.02,0.026c1.298,0.754,2.615,1.511,3.933,2.274c0.012,0.002,0.024,0.002,0.04,0.006
		c0.016-0.105,0.021-2.817,0.013-4.381C49.095,37.323,49.091,37.284,49.084,37.234 M12.13,41.354
		c0.178-0.093,0.365-0.191,0.545-0.288c1.002-0.52,2-1.045,2.999-1.568c0.141-0.073,0.128-0.047,0.128-0.207
		c0-1.594,0-3.184,0-4.778v-0.121c-0.099-0.078-1.603-0.949-1.711-0.991c-0.045,0.047-0.064,0.114-0.091,0.171
		c-0.793,1.673-1.473,3.392-2.033,5.158c-0.209,0.664-0.41,1.335-0.552,2.017c-0.013,0.072-0.027,0.144-0.042,0.205
		C11.457,41.008,11.975,41.289,12.13,41.354 M40.325,31.195c0.139,0.101,4.28,2.485,4.377,2.523
		c0.209-0.099,0.931-0.528,1.012-0.595c-0.011-0.035-0.026-0.074-0.039-0.106c-0.432-1.089-0.9-2.157-1.437-3.197
		c-0.478-0.928-1.012-1.829-1.615-2.686c-0.364-0.518-0.75-1.015-1.174-1.49c-0.033-0.035-0.053-0.082-0.104-0.095
		c-0.341,0.196-0.68,0.39-1.015,0.583C40.316,26.288,40.305,31.017,40.325,31.195 M16.166,33.719
		c0.042-0.022,0.078-0.046,0.119-0.068c0.811-0.466,1.621-0.931,2.431-1.402c0.574-0.328,1.141-0.658,1.715-0.986
		c0.041-0.023,0.078-0.051,0.12-0.073c0.004-1.521,0.004-3.037,0.009-4.547c0-0.157,0-0.315-0.004-0.475c0-0.001,0-0.01,0-0.011
		c-0.004-0.004-0.004-0.01-0.009-0.014c-0.179-0.121-0.979-0.577-1.077-0.613c-0.031,0.031-0.062,0.06-0.095,0.092
		c-0.167,0.173-0.336,0.345-0.5,0.523c-0.987,1.062-1.857,2.213-2.647,3.424c-0.632,0.971-1.207,1.976-1.733,3.003
		c-0.022,0.044-0.043,0.087-0.065,0.133c0.018,0.016,0.033,0.03,0.046,0.037C15.037,33.067,15.601,33.391,16.166,33.719
		 M30.432,25.498c1.442-0.831,2.867-1.655,4.295-2.478c0.022-0.015,0.047-0.026,0.069-0.04c0-0.006,0.005-0.007,0.01-0.012
		c0-0.001,0.004-0.005,0.004-0.011c0.012-0.143,0.008-1.389-0.004-1.498c-0.027-0.007-0.061-0.02-0.097-0.027
		c-0.341-0.093-0.687-0.171-1.037-0.24c-0.522-0.098-1.05-0.168-1.58-0.215c-0.45-0.042-0.904-0.052-1.355-0.066
		c-0.123-0.001-0.248,0.01-0.368,0.01c-0.511,0.004-1.02,0.036-1.53,0.083c-0.436,0.041-0.873,0.088-1.305,0.162
		c-0.474,0.078-0.938,0.184-1.401,0.318c-0.029,0.008-0.051,0.022-0.079,0.033c-0.008,0.197-0.008,1.342,0.01,1.454
		C27.515,23.81,28.972,24.652,30.432,25.498 M39.575,26.153c-0.13-0.095-4.261-2.475-4.352-2.51
		c-0.004,0.001-0.014,0.003-0.022,0.008c-1.439,0.828-2.883,1.656-4.32,2.487c-0.016,0.012-0.035,0.023-0.053,0.035
		c-0.005,0.003-0.005,0.004-0.01,0.01c0,0.004-0.004,0.005-0.01,0.014v4.987c0.01,0.01,0.01,0.014,0.014,0.02
		c0.005,0.005,0.01,0.011,0.018,0.014c1.398,0.811,2.799,1.618,4.2,2.427c0.041,0.023,0.083,0.047,0.129,0.069
		c0.003,0.003,0.008,0.004,0.013,0.004c0,0,0.004,0,0.019,0c1.423-0.822,2.856-1.646,4.292-2.471
		c0.016-0.012,0.035-0.023,0.051-0.033c0.007-0.005,0.007-0.009,0.014-0.011c0-0.003,0-0.009,0.006-0.02
		C39.568,29.516,39.572,27.834,39.575,26.153 M25.676,23.613c-1.459,0.845-2.916,1.683-4.367,2.522
		c-0.004,0.015-0.008,0.023-0.008,0.032c-0.004,0.025-0.004,0.053-0.004,0.079c0,1.64,0,3.281,0.004,4.917c0,0.005,0,0.01,0,0.015
		c0.003,0.005,0.008,0.006,0.013,0.021c1.451,0.838,2.91,1.684,4.372,2.526c0.046-0.026,0.082-0.048,0.123-0.07
		c0.614-0.354,1.232-0.71,1.848-1.066c0.769-0.442,1.533-0.882,2.299-1.324c0.035-0.024,0.08-0.038,0.103-0.084
		c0-1.629,0-3.262,0-4.899c0-0.025,0-0.05,0-0.079c0-0.004-0.004-0.01-0.004-0.014c0-0.002-0.004-0.007-0.014-0.021
		C28.593,25.321,27.139,24.468,25.676,23.613 M16.572,34.373c-0.01,0.025-0.015,0.033-0.015,0.042c0,1.62,0,3.238,0,4.856
		c0,0.044,0,0.088,0,0.132c0,0.004,0,0.009,0.005,0.013c0,0.003,0.004,0.007,0.004,0.009c0.01,0.007,0.014,0.016,0.018,0.021
		c1.416,0.822,2.831,1.636,4.251,2.457c0.022,0.011,0.044,0.02,0.068,0.032c0.005,0.003,0.01,0.007,0.013,0.007
		c0.004,0,0.009,0,0.014,0c0.126-0.062,4.291-2.466,4.372-2.531v-5.037c-0.054-0.031-0.104-0.062-0.159-0.093
		c-0.801-0.462-1.597-0.925-2.397-1.385c-0.569-0.327-1.133-0.656-1.703-0.982c-0.042-0.023-0.077-0.055-0.135-0.058
		C19.465,32.693,18.014,33.531,16.572,34.373 M26.053,39.439c1.456,0.843,2.919,1.683,4.365,2.521c0.022,0,0.032,0,0.035-0.006
		c1.395-0.808,2.791-1.608,4.184-2.411c0.054-0.028,0.103-0.062,0.158-0.093c0-0.004,0.005-0.009,0.01-0.011
		c0-0.004,0.004-0.007,0.01-0.018c0-0.016,0.002-0.033,0.002-0.057c-0.002-1.653-0.002-3.308-0.002-4.959
		c0-0.004-0.005-0.008-0.005-0.013c0-0.004-0.004-0.006-0.004-0.011c-0.183-0.12-4.278-2.48-4.378-2.521
		c-0.036,0.018-0.078,0.039-0.114,0.061c-0.946,0.549-1.893,1.096-2.844,1.641c-0.428,0.248-0.859,0.496-1.287,0.744
		c-0.045,0.028-0.096,0.046-0.128,0.092V39.439z M39.942,31.853c-1.456,0.84-2.917,1.682-4.362,2.52
		c-0.024,0.191-0.033,4.907-0.016,5.056c0.006,0.007,0.016,0.016,0.02,0.021c0.017,0.012,0.035,0.024,0.053,0.033
		c1.43,0.827,2.86,1.652,4.283,2.477c0.005,0,0.007,0,0.011,0c0.005,0,0.012,0,0.024,0c1.454-0.838,2.908-1.678,4.369-2.521
		c0-0.057,0-0.107,0-0.16c0-1.572,0.004-3.142,0-4.712c0-0.221,0.035-0.164-0.163-0.282c-1.229-0.709-2.457-1.42-3.691-2.129
		C40.299,32.056,40.127,31.956,39.942,31.853 M49.783,43.045c-0.039-0.026-0.072-0.055-0.114-0.077
		c-1.621-0.935-3.24-1.869-4.856-2.809c-0.044-0.022-0.082-0.049-0.132-0.077c-1.586,0.913-3.17,1.825-4.756,2.747
		c-1.578-0.915-3.158-1.828-4.742-2.74c-0.269,0.141-0.529,0.297-0.787,0.444c-0.271,0.158-0.533,0.312-0.802,0.462
		c-0.264,0.151-0.524,0.306-0.786,0.457c-0.266,0.152-0.525,0.306-0.789,0.453c-0.268,0.156-0.533,0.309-0.801,0.46
		c-0.264,0.151-0.523,0.306-0.796,0.457c-0.04-0.018-0.082-0.044-0.122-0.067c-0.951-0.548-1.903-1.098-2.853-1.644
		c-0.555-0.325-1.111-0.643-1.667-0.966c-0.036-0.021-0.078-0.044-0.123-0.068c-0.2,0.108-0.395,0.227-0.593,0.344
		c-0.199,0.112-0.394,0.224-0.595,0.336c-0.195,0.117-0.396,0.229-0.592,0.348c-0.2,0.108-0.396,0.223-0.596,0.339
		c-0.19,0.11-0.387,0.225-0.581,0.339c-0.197,0.11-0.396,0.227-0.592,0.339c-0.197,0.114-0.396,0.225-0.597,0.346
		c-0.195,0.111-0.391,0.224-0.592,0.341c-0.05-0.031-0.096-0.058-0.142-0.082c-1.486-0.855-2.974-1.718-4.463-2.573
		c-0.163-0.095-0.119-0.088-0.273-0.007c-0.797,0.414-1.588,0.827-2.383,1.243c-0.493,0.262-0.988,0.519-1.479,0.78
		c-0.019,0.007-0.033,0.014-0.055,0.021c-0.11-0.035-0.21-0.104-0.315-0.154c-0.109-0.057-0.219-0.116-0.328-0.174
		c-0.104-0.057-0.209-0.109-0.313-0.167c-0.109-0.055-0.219-0.11-0.328-0.17c-0.1-0.057-0.213-0.099-0.305-0.171
		c0.145-0.783,0.323-1.551,0.555-2.31c0.596-1.969,1.334-3.884,2.216-5.744c0.509-1.079,1.069-2.13,1.684-3.151
		c0.682-1.144,1.438-2.24,2.273-3.277c0.434-0.533,0.883-1.049,1.36-1.541c0.238-0.244,0.471-0.49,0.706-0.731
		c0.292-0.292,0.606-0.563,0.924-0.826c0.838-0.686,1.729-1.299,2.676-1.819c0.699-0.386,1.425-0.716,2.189-0.944
		c0.641-0.191,1.286-0.382,1.947-0.508c0.378-0.067,0.754-0.132,1.133-0.172c0.328-0.032,0.656-0.065,0.984-0.091
		c0.246-0.02,0.491-0.028,0.736-0.04c0.038-0.001,0.074,0.007,0.1-0.023h1.292c0.014,0.007,0.033,0.022,0.047,0.022
		c0.163,0.011,0.322,0.016,0.487,0.029c0.319,0.027,0.637,0.052,0.956,0.088c0.412,0.049,0.826,0.121,1.233,0.205
		c0.649,0.135,1.291,0.31,1.918,0.515c0.624,0.204,1.222,0.476,1.798,0.79c1.006,0.544,1.938,1.199,2.82,1.938
		c0.323,0.277,0.638,0.561,0.933,0.869c0.746,0.776,1.412,1.625,2.006,2.523c0.7,1.038,1.301,2.132,1.833,3.261
		c0.438,0.92,0.827,1.862,1.196,2.811c0.108,0.291,0.22,0.581,0.326,0.875c0.105,0.302,0.2,0.61,0.303,0.913
		c0.128,0.372,0.262,0.747,0.418,1.11c0.042,0.104,0.097,0.205,0.146,0.309c0.026,0.055,0.068,0.093,0.125,0.104
		c0.086,0.015,0.177,0.038,0.262,0.043c0.137,0.007,0.273,0.004,0.409-0.017c0.135-0.022,0.269-0.041,0.405-0.063
		c0.283-0.044,0.578-0.087,0.869-0.126v6.551c0,0.04,0,0.081,0,0.121C49.804,43.045,49.786,43.045,49.783,43.045"/>
	<path fill="#FFFFFF" d="M25.309,21.731c-0.055,0.015-0.091,0.025-0.129,0.036c-0.567,0.184-1.109,0.425-1.632,0.701
		c-0.883,0.463-1.712,1.01-2.496,1.624c-0.33,0.256-0.649,0.525-0.953,0.81c-0.025,0.023-0.062,0.04-0.057,0.088
		c0.292,0.169,0.584,0.336,0.879,0.509c0.368-0.212,0.736-0.425,1.101-0.634c0.365-0.212,0.729-0.421,1.098-0.632
		c0.363-0.209,0.727-0.422,1.097-0.632c0.364-0.211,0.728-0.42,1.092-0.631V21.731z M40.831,24.985
		c-0.088-0.078-0.152-0.141-0.223-0.206c-0.666-0.619-1.388-1.177-2.146-1.676c-0.662-0.437-1.35-0.823-2.082-1.124
		c-0.238-0.098-0.478-0.182-0.715-0.27c-0.032-0.011-0.069-0.029-0.104,0v1.243c0.082,0.064,4.239,2.468,4.388,2.54
		C40.237,25.327,40.525,25.163,40.831,24.985 M49.084,37.234c-0.035,0.006-0.06,0.006-0.081,0.007
		c-0.149,0.021-0.304,0.051-0.453,0.066c-0.275,0.024-0.546,0.024-0.816-0.042c-0.097-0.024-0.189-0.058-0.281-0.109
		c-0.17-0.089-0.284-0.231-0.365-0.401c-0.077-0.158-0.154-0.318-0.223-0.479c-0.227-0.561-0.418-1.136-0.611-1.711
		c-0.063-0.201-0.137-0.399-0.202-0.6c-0.018-0.031-0.033-0.062-0.049-0.09c-0.107,0.042-0.827,0.456-0.915,0.527
		c0,0.021-0.006,0.042-0.006,0.064c0.006,1.652,0.006,3.306,0.006,4.958c0,0.003,0,0.007,0.003,0.012
		c0,0.004,0.002,0.006,0.02,0.026c1.298,0.754,2.615,1.511,3.933,2.274c0.012,0.002,0.024,0.002,0.04,0.006
		c0.016-0.105,0.021-2.817,0.013-4.381C49.095,37.323,49.091,37.284,49.084,37.234 M12.13,41.354
		c0.178-0.093,0.365-0.191,0.545-0.288c1.002-0.52,2-1.045,2.999-1.568c0.141-0.073,0.128-0.047,0.128-0.207
		c0-1.594,0-3.184,0-4.778v-0.121c-0.099-0.078-1.603-0.949-1.711-0.991c-0.045,0.047-0.064,0.114-0.091,0.171
		c-0.793,1.673-1.473,3.392-2.033,5.158c-0.209,0.664-0.41,1.335-0.552,2.017c-0.013,0.072-0.027,0.144-0.042,0.205
		C11.457,41.008,11.975,41.289,12.13,41.354 M40.325,31.195c0.139,0.101,4.28,2.485,4.377,2.523
		c0.209-0.099,0.931-0.528,1.012-0.595c-0.011-0.035-0.026-0.074-0.039-0.106c-0.432-1.089-0.9-2.157-1.437-3.197
		c-0.478-0.928-1.012-1.829-1.615-2.686c-0.364-0.518-0.75-1.015-1.174-1.49c-0.033-0.035-0.053-0.082-0.104-0.095
		c-0.341,0.196-0.68,0.39-1.015,0.583C40.316,26.288,40.305,31.017,40.325,31.195 M16.166,33.719
		c0.042-0.022,0.078-0.046,0.119-0.068c0.811-0.466,1.621-0.931,2.431-1.402c0.574-0.328,1.141-0.658,1.715-0.986
		c0.041-0.023,0.078-0.051,0.12-0.073c0.004-1.521,0.004-3.037,0.009-4.547c0-0.157,0-0.315-0.004-0.475c0-0.001,0-0.01,0-0.011
		c-0.004-0.004-0.004-0.01-0.009-0.014c-0.179-0.121-0.979-0.577-1.077-0.613c-0.031,0.031-0.062,0.06-0.095,0.092
		c-0.167,0.173-0.336,0.345-0.5,0.523c-0.987,1.062-1.857,2.213-2.647,3.424c-0.632,0.971-1.207,1.976-1.733,3.003
		c-0.022,0.044-0.043,0.087-0.065,0.133c0.018,0.016,0.033,0.03,0.046,0.037C15.037,33.067,15.601,33.391,16.166,33.719
		 M30.432,25.498c1.442-0.831,2.867-1.655,4.295-2.478c0.022-0.015,0.047-0.026,0.069-0.04c0-0.006,0.005-0.007,0.01-0.012
		c0-0.001,0.004-0.005,0.004-0.011c0.012-0.143,0.008-1.389-0.004-1.498c-0.027-0.007-0.061-0.02-0.097-0.027
		c-0.341-0.093-0.687-0.171-1.037-0.24c-0.522-0.098-1.05-0.168-1.58-0.215c-0.45-0.042-0.904-0.052-1.355-0.066
		c-0.123-0.001-0.248,0.01-0.368,0.01c-0.511,0.004-1.02,0.036-1.53,0.083c-0.436,0.041-0.873,0.088-1.305,0.162
		c-0.474,0.078-0.938,0.184-1.401,0.318c-0.029,0.008-0.051,0.022-0.079,0.033c-0.008,0.197-0.008,1.342,0.01,1.454
		C27.515,23.81,28.972,24.652,30.432,25.498 M39.575,26.153c-0.13-0.095-4.261-2.475-4.352-2.51
		c-0.004,0.001-0.014,0.003-0.022,0.008c-1.439,0.828-2.883,1.656-4.32,2.487c-0.016,0.012-0.035,0.023-0.053,0.035
		c-0.005,0.003-0.005,0.004-0.01,0.01c0,0.004-0.004,0.005-0.01,0.014v4.987c0.01,0.01,0.01,0.014,0.014,0.02
		c0.005,0.005,0.01,0.011,0.018,0.014c1.398,0.811,2.799,1.618,4.2,2.427c0.041,0.023,0.083,0.047,0.129,0.069
		c0.003,0.003,0.008,0.004,0.013,0.004c0,0,0.004,0,0.019,0c1.423-0.822,2.856-1.646,4.292-2.471
		c0.016-0.012,0.035-0.023,0.051-0.033c0.007-0.005,0.007-0.009,0.014-0.011c0-0.003,0-0.009,0.006-0.02
		C39.568,29.516,39.572,27.834,39.575,26.153 M25.676,23.613c-1.459,0.845-2.916,1.683-4.367,2.522
		c-0.004,0.015-0.008,0.023-0.008,0.032c-0.004,0.025-0.004,0.053-0.004,0.079c0,1.64,0,3.281,0.004,4.917c0,0.005,0,0.01,0,0.015
		c0.003,0.005,0.008,0.006,0.013,0.021c1.451,0.838,2.91,1.684,4.372,2.526c0.046-0.026,0.082-0.048,0.123-0.07
		c0.614-0.354,1.232-0.71,1.848-1.066c0.769-0.442,1.533-0.882,2.299-1.324c0.035-0.024,0.08-0.038,0.103-0.084
		c0-1.629,0-3.262,0-4.899c0-0.025,0-0.05,0-0.079c0-0.004-0.004-0.01-0.004-0.014c0-0.002-0.004-0.007-0.014-0.021
		C28.593,25.321,27.139,24.468,25.676,23.613 M16.572,34.373c-0.01,0.025-0.015,0.033-0.015,0.042c0,1.62,0,3.238,0,4.856
		c0,0.044,0,0.088,0,0.132c0,0.004,0,0.009,0.005,0.013c0,0.003,0.004,0.007,0.004,0.009c0.01,0.007,0.014,0.016,0.018,0.021
		c1.416,0.822,2.831,1.636,4.251,2.457c0.022,0.011,0.044,0.02,0.068,0.032c0.005,0.003,0.01,0.007,0.013,0.007
		c0.004,0,0.009,0,0.014,0c0.126-0.062,4.291-2.466,4.372-2.531v-5.037c-0.054-0.031-0.104-0.062-0.159-0.093
		c-0.801-0.462-1.597-0.925-2.397-1.385c-0.569-0.327-1.133-0.656-1.703-0.982c-0.042-0.023-0.077-0.055-0.135-0.058
		C19.465,32.693,18.014,33.531,16.572,34.373 M26.053,39.439c1.456,0.843,2.919,1.683,4.365,2.521c0.022,0,0.032,0,0.035-0.006
		c1.395-0.808,2.791-1.608,4.184-2.411c0.054-0.028,0.103-0.062,0.158-0.093c0-0.004,0.005-0.009,0.01-0.011
		c0-0.004,0.004-0.007,0.01-0.018c0-0.016,0.002-0.033,0.002-0.057c-0.002-1.653-0.002-3.308-0.002-4.959
		c0-0.004-0.005-0.008-0.005-0.013c0-0.004-0.004-0.006-0.004-0.011c-0.183-0.12-4.278-2.48-4.378-2.521
		c-0.036,0.018-0.078,0.039-0.114,0.061c-0.946,0.549-1.893,1.096-2.844,1.641c-0.428,0.248-0.859,0.496-1.287,0.744
		c-0.045,0.028-0.096,0.046-0.128,0.092V39.439z M39.942,31.853c-1.456,0.84-2.917,1.682-4.362,2.52
		c-0.024,0.191-0.033,4.907-0.016,5.056c0.006,0.007,0.016,0.016,0.02,0.021c0.017,0.012,0.035,0.024,0.053,0.033
		c1.43,0.827,2.86,1.652,4.283,2.477c0.005,0,0.007,0,0.011,0c0.005,0,0.012,0,0.024,0c1.454-0.838,2.908-1.678,4.369-2.521
		c0-0.057,0-0.107,0-0.16c0-1.572,0.004-3.142,0-4.712c0-0.221,0.035-0.164-0.163-0.282c-1.229-0.709-2.457-1.42-3.691-2.129
		C40.299,32.056,40.127,31.956,39.942,31.853 M49.783,43.045c-0.039-0.026-0.072-0.055-0.114-0.077
		c-1.621-0.935-3.24-1.869-4.856-2.809c-0.044-0.022-0.082-0.049-0.132-0.077c-1.586,0.913-3.17,1.825-4.756,2.747
		c-1.578-0.915-3.158-1.828-4.742-2.74c-0.269,0.141-0.529,0.297-0.787,0.444c-0.271,0.158-0.533,0.312-0.802,0.462
		c-0.264,0.151-0.524,0.306-0.786,0.457c-0.266,0.152-0.525,0.306-0.789,0.453c-0.268,0.156-0.533,0.309-0.801,0.46
		c-0.264,0.151-0.523,0.306-0.796,0.457c-0.04-0.018-0.082-0.044-0.122-0.067c-0.951-0.548-1.903-1.098-2.853-1.644
		c-0.555-0.325-1.111-0.643-1.667-0.966c-0.036-0.021-0.078-0.044-0.123-0.068c-0.2,0.108-0.395,0.227-0.593,0.344
		c-0.199,0.112-0.394,0.224-0.595,0.336c-0.195,0.117-0.396,0.229-0.592,0.348c-0.2,0.108-0.396,0.223-0.596,0.339
		c-0.19,0.11-0.387,0.225-0.581,0.339c-0.197,0.11-0.396,0.227-0.592,0.339c-0.197,0.114-0.396,0.225-0.597,0.346
		c-0.195,0.111-0.391,0.224-0.592,0.341c-0.05-0.031-0.096-0.058-0.142-0.082c-1.486-0.855-2.974-1.718-4.463-2.573
		c-0.163-0.095-0.119-0.088-0.273-0.007c-0.797,0.414-1.588,0.827-2.383,1.243c-0.493,0.262-0.988,0.519-1.479,0.78
		c-0.019,0.007-0.033,0.014-0.055,0.021c-0.11-0.035-0.21-0.104-0.315-0.154c-0.109-0.057-0.219-0.116-0.328-0.174
		c-0.104-0.057-0.209-0.109-0.313-0.167c-0.109-0.055-0.219-0.11-0.328-0.17c-0.1-0.057-0.213-0.099-0.305-0.171
		c0.145-0.783,0.323-1.551,0.555-2.31c0.596-1.969,1.334-3.884,2.216-5.744c0.509-1.079,1.069-2.13,1.684-3.151
		c0.682-1.144,1.438-2.24,2.273-3.277c0.434-0.533,0.883-1.049,1.36-1.541c0.238-0.244,0.471-0.49,0.706-0.731
		c0.292-0.292,0.606-0.563,0.924-0.826c0.838-0.686,1.729-1.299,2.676-1.819c0.699-0.386,1.425-0.716,2.189-0.944
		c0.641-0.191,1.286-0.382,1.947-0.508c0.378-0.067,0.754-0.132,1.133-0.172c0.328-0.032,0.656-0.065,0.984-0.091
		c0.246-0.02,0.491-0.028,0.736-0.04c0.038-0.001,0.074,0.007,0.1-0.023h1.292c0.014,0.007,0.033,0.022,0.047,0.022
		c0.163,0.011,0.322,0.016,0.487,0.029c0.319,0.027,0.637,0.052,0.956,0.088c0.412,0.049,0.826,0.121,1.233,0.205
		c0.649,0.135,1.291,0.31,1.918,0.515c0.624,0.204,1.222,0.476,1.798,0.79c1.006,0.544,1.938,1.199,2.82,1.938
		c0.323,0.277,0.638,0.561,0.933,0.869c0.746,0.776,1.412,1.625,2.006,2.523c0.7,1.038,1.301,2.132,1.833,3.261
		c0.438,0.92,0.827,1.862,1.196,2.811c0.108,0.291,0.22,0.581,0.326,0.875c0.105,0.302,0.2,0.61,0.303,0.913
		c0.128,0.372,0.262,0.747,0.418,1.11c0.042,0.104,0.097,0.205,0.146,0.309c0.026,0.055,0.068,0.093,0.125,0.104
		c0.086,0.015,0.177,0.038,0.262,0.043c0.137,0.007,0.273,0.004,0.409-0.017c0.135-0.022,0.269-0.041,0.405-0.063
		c0.283-0.044,0.578-0.087,0.869-0.126v6.551c0,0.04,0,0.081,0,0.121C49.804,43.045,49.786,43.045,49.783,43.045"/>
</g>
<g>
	<defs>
		<polygon id="SVGID_1_" points="35.879,0 4.715,17.972 4.7,53.949 35.844,71.938 67.001,53.969 67.022,17.991 		"/>
	</defs>
	<clipPath id="SVGID_2_">
		<use xlink:href="#SVGID_1_"  overflow="visible"/>
	</clipPath>
</g>
<g>
	<defs>
		<polygon id="SVGID_3_" points="35.879,0 4.715,17.972 4.7,53.949 35.844,71.938 67.001,53.969 67.022,17.991 		"/>
	</defs>
	<clipPath id="SVGID_4_">
		<use xlink:href="#SVGID_3_"  overflow="visible"/>
	</clipPath>
</g>
<g>
	<defs>
		<polygon id="SVGID_5_" points="35.879,0 4.715,17.972 4.7,53.949 35.844,71.938 67.001,53.969 67.022,17.991 		"/>
	</defs>
	<clipPath id="SVGID_6_">
		<use xlink:href="#SVGID_5_"  overflow="visible"/>
	</clipPath>
</g>
</svg>
