<?xml version="1.0" encoding="utf-8"?>
<!-- Generator: Adobe Illustrator 19.2.1, SVG Export Plug-In . SVG Version: 6.00 Build 0)  -->
<svg version="1.1" id="Layer_1" xmlns="http://www.w3.org/2000/svg" xmlns:xlink="http://www.w3.org/1999/xlink" x="0px" y="0px"
	 viewBox="0 0 50.5 27.4" style="enable-background:new 0 0 50.5 27.4;" xml:space="preserve">
<style type="text/css">
	.st0{clip-path:url(#SVGID_2_);fill:none;stroke:#000000;stroke-width:2.116;}
	.st1{clip-path:url(#SVGID_2_);fill:#65A184;}
	.st2{clip-path:url(#SVGID_2_);fill:none;stroke:#000000;stroke-width:1.289;}
	.st3{fill:#FFFFFF;}
	.st4{clip-path:url(#SVGID_4_);}
	.st5{clip-path:url(#SVGID_4_);fill:#FFFFFF;}
</style>
<g>
	<defs>
		<rect id="SVGID_1_" width="50.3" height="27.3"/>
	</defs>
	<clipPath id="SVGID_2_">
		<use xlink:href="#SVGID_1_"  style="overflow:visible;"/>
	</clipPath>
	<path class="st0" d="M49.1,13.3C42.9,7.2,34.5,1.1,25.1,1.1c-9.3,0-17.7,6.1-23.9,12.1c-0.5,0.5,0,0.8,0,0.8
		c6.1,6.1,14.6,12.2,23.9,12.2c9.3,0,17.7-6.1,23.9-12.1C49.1,14.1,49.5,13.7,49.1,13.3z"/>
	<path class="st1" d="M25.2,25.8c6.8,0,12.3-5.4,12.3-12s-5.5-12-12.3-12s-12.3,5.4-12.3,12S18.4,25.8,25.2,25.8"/>
	<ellipse class="st2" cx="25.2" cy="13.7" rx="12.3" ry="12"/>
</g>
<polygon class="st3" points="21.5,9.4 16.4,11.4 25,17.3 33.9,14.3 31.3,11.6 "/>
<g>
	<defs>
		<rect id="SVGID_3_" width="50.3" height="27.3"/>
	</defs>
	<clipPath id="SVGID_4_">
		<use xlink:href="#SVGID_3_"  style="overflow:visible;"/>
	</clipPath>
	<path class="st4" d="M25,22.2c-0.2,0.3-0.5,0.4-0.8,0.2c-0.3-0.2-0.7-0.5-1-0.7c-0.2-0.1-0.3-0.3-0.4-0.5c-0.1-0.2-0.1-0.4-0.1-0.6
		c0-0.3-0.1-0.5-0.1-0.8c0-0.2,0-0.4,0.1-0.6c0-0.3,0-0.5,0.1-0.8c0-0.1,0-0.2,0.1-0.3c0.1-0.2,0-0.3-0.1-0.3
		c-0.2-0.1-0.5-0.3-0.7-0.4c-0.2,0.1-0.2,0.2-0.3,0.4c0,0-0.2,1.4-0.2,2.1c0,0.2,0.1,0.4,0.2,0.7c-0.1,0.1-0.2,0.1-0.3,0
		c-0.2-0.2-0.3-0.5-0.4-0.8c0-0.2,0.1-2.3,0.3-2.7c0-0.1,0-0.2-0.2-0.3c-0.2-0.1-0.4-0.2-0.6-0.4c-0.1-0.1-0.2,0-0.3,0.1
		c-0.4,1.1-0.3,2.3-0.3,2.6c0,0.1,0,0.2,0.1,0.4c-0.1,0-0.2,0-0.3,0c-0.7-0.5-1.4-1-2.2-1.5c-0.2-0.1-0.4-0.3-0.6-0.4
		c-0.2-0.2-0.3-0.4-0.3-0.7c0-0.4-0.1-0.9-0.1-1.3c0-0.5,0-1,0.2-1.4c0-0.1,0-0.2-0.1-0.2c-0.2-0.2-0.4-0.3-0.6-0.4
		c-0.1-0.1-0.3,0-0.3,0.1c-0.1,0.3-0.2,0.6-0.3,0.9c-0.1,0.6,0,1.2,0.3,1.8c0,0.1,0.1,0.2,0,0.3c-0.5-0.2-0.9-0.6-1.1-1.1
		c-0.2-0.5-0.3-1.1-0.2-1.7c0-0.1,0-0.3,0.1-0.4c0.1-0.3,0.2-0.6,0.4-0.9c0.1-0.3,0.5-0.3,0.7-0.2c0.8,0.5,1.5,1,2.3,1.6
		c0.6,0.4,1.3,0.8,1.9,1.2c0.8,0.6,1.6,1.1,2.5,1.7c0.6,0.4,1.3,0.8,1.9,1.2c0.2,0.1,0.4,0.3,0.6,0.4c0.2,0.1,0.2,0.3,0.1,0.5
		c-0.2,0.4-0.4,0.9-0.3,1.4c0,0.1,0,0.3,0.1,0.4c0.1,0.3,0.4,0.9,0.4,0.8c0-0.3,0.3-0.4,0.5-0.5c0.4-0.2,0.9-0.3,1.3-0.5
		c0.6-0.2,1.1-0.4,1.7-0.6c0.6-0.2,1.2-0.4,1.8-0.7c0.5-0.2,1-0.3,1.5-0.5c0.3-0.1,0.7-0.3,1-0.4c0.6-0.2,1.2-0.4,1.7-0.6
		c0.1,0,0.2-0.1,0.3-0.1c0.3-0.1,0.6,0,0.7,0.3c0.1,0.3,0,0.5-0.3,0.6c-0.6,0.2-1.2,0.5-1.8,0.7c-0.6,0.2-1.2,0.4-1.9,0.7
		c-0.8,0.3-1.5,0.5-2.3,0.8c-0.6,0.2-1.2,0.4-1.8,0.6c-0.6,0.2-1.2,0.4-1.8,0.6c-0.2,0.1-0.4,0.1-0.5-0.1
		C25.3,21.9,25.1,22.1,25,22.2"/>
	<path class="st4" d="M17.5,11.6c0.2,0.2,6.8,4.6,7.3,4.9c0.4,0.3,0.7,0.5,1.2,0.2c0.7-0.3,7.3-2.5,7.4-2.6c0-0.1-1.7-1.2-1.9-1.3
		c-0.3-0.2-0.3-0.4,0-0.6c0.1-0.1,0.4-0.2,0.6-0.3c0.4,0.3,2,1.3,2.4,1.6c0.2,0.1,0.4,0.2,0.6,0.4c0.4,0.3,0.2,0.7-0.1,0.9
		c-0.3,0.1-0.6,0.2-0.9,0.3c-0.3,0.1-0.6,0.2-1,0.3c-0.3,0.1-0.7,0.2-1,0.4c-0.4,0.1-0.7,0.2-1.1,0.4c-0.3,0.1-0.7,0.2-1,0.4
		c-0.4,0.1-0.7,0.2-1.1,0.4c-0.3,0.1-0.7,0.2-1,0.4c-0.3,0.1-0.7,0.2-1,0.3c-0.4,0.1-0.8,0.3-1.2,0.4c-0.2,0-0.4,0-0.5-0.1
		c-0.7-0.5-8.7-5.8-8.9-6c-0.2-0.1-0.3-0.3-0.3-0.5c0-0.2,0.2-0.4,0.4-0.5c0.9-0.3,4.2-1.5,4.5-1.5c0.2-0.1,0.4,0,0.4,0.2
		c0,0.2-0.1,0.4-0.1,0.5c0,0.3-0.3,0.3-0.5,0.4C20.1,10.7,17.9,11.5,17.5,11.6"/>
	<path class="st4" d="M25.6,19.4c0.6-0.2,1.2-0.4,1.8-0.6c0.2-0.1,0.4-0.2,0.6-0.2c0.5-0.2,1-0.4,1.6-0.6c0.6-0.2,1.2-0.4,1.8-0.7
		c0.5-0.2,1.1-0.4,1.6-0.6c0.5-0.2,1-0.4,1.6-0.5c0,0,0,0,0,0c0.1,0,0.3-0.1,0.4,0.1c0.1,0.2-0.1,0.2-0.2,0.3
		c-0.9,0.4-1.7,0.6-2.6,1c-0.6,0.2-1.1,0.4-1.7,0.6c-0.6,0.2-1.1,0.4-1.7,0.6c-0.5,0.2-1,0.4-1.5,0.5c-0.4,0.1-1.5,0.6-1.7,0.6
		C25.5,19.9,25.5,19.4,25.6,19.4"/>
	<path class="st4" d="M25.2,5.1c-3.6,0.4-4.8,5.5-4.9,5.6c0,0.1-0.1,0.3-0.1,0.3l0.4,0.2c0,0.1-0.3,0.6-0.6,0.8
		c-0.4,0.2-0.9,0.1-0.9,0.1s-0.1,0-0.1,0c-0.1,0.1,0,0.2,0,0.2s0.4,0.3,0.9,0.4c0.6,0.1,1.4-0.3,1.4-0.3s-0.1,0.6-0.2,0.9
		c0,0.3,0.3,0.4,0.3,0.4s0.6,0.1,1,0.1c0.3,0,1.2,0.2,1.3-0.1c0.1-0.2,0.1-1,0.1-1s0.4,0.1,1,0c0.5-0.1,1.1-0.4,1.1-0.4
		s0.6,0.4,1.1,0.5c0.5,0.1,1,0,1,0s0,0.1,0.1,0.8c0,0.4,0.4,0.3,0.4,0.3s1.5-0.2,2.1-0.3c0.3-0.1,0.1-0.8,0.1-0.8l-0.1-0.5
		c0,0,0.9,0.3,2.1-0.3c0.8-0.4,1.3-1.4,1.3-1.4s0.3,0,0.7-0.1c0.4-0.1,0.9-0.4,0.9-1.3v0v0c0-0.9-0.9-1.6-1.6-1.7
		c-0.7-0.1-1.1,0.3-1.3,0.6c-0.2,0.4-0.4,1.6-0.6,1.9c-0.2,0.2-0.6,0.2-0.6,0.2s-0.1,0-0.1,0l0-0.1c0,0-0.4,0.1-0.5,0
		C30.8,9.7,30.6,9,30.6,9C30,7.5,29,5.1,26,5.1C25.8,5.1,25.5,5.1,25.2,5.1"/>
	<path class="st5" d="M24.5,5.4C24.4,5.4,24.4,5.4,24.5,5.4c-0.2,0.1-0.4,0.1-0.5,0.2c-0.3,0.1-0.5,0.3-0.7,0.5
		c-0.1,0.1-0.2,0.2-0.3,0.2c0,0,0,0,0,0c0.1,0,0.2,0.1,0.3,0.1c0.1-0.1,0.2-0.1,0.3-0.2c0.1-0.1,0.2-0.1,0.3-0.2
		C23.9,6.1,24,6,24.1,5.9c0.1-0.1,0.2-0.1,0.3-0.2V5.4z M29,6.4C29,6.3,29,6.3,29,6.4c-0.3-0.2-0.5-0.4-0.7-0.6
		c-0.2-0.1-0.4-0.2-0.6-0.3c-0.1,0-0.1-0.1-0.2-0.1c0,0,0,0,0,0v0.4c0,0,1.2,0.7,1.3,0.7C28.8,6.5,28.9,6.4,29,6.4 M31.4,10
		C31.4,10,31.4,10,31.4,10c-0.1,0-0.1,0-0.2,0c-0.1,0-0.2,0-0.2,0c0,0-0.1,0-0.1,0c0,0-0.1-0.1-0.1-0.1c0,0,0-0.1-0.1-0.1
		c-0.1-0.2-0.1-0.3-0.2-0.5c0-0.1,0-0.1-0.1-0.2c0,0,0,0,0,0c0,0-0.2,0.1-0.3,0.2c0,0,0,0,0,0c0,0.5,0,1,0,1.5c0,0,0,0,0,0
		c0,0,0,0,0,0c0.4,0.2,0.8,0.4,1.2,0.7c0,0,0,0,0,0C31.4,11.2,31.4,10.4,31.4,10C31.4,10,31.4,10,31.4,10 M20.6,11.2
		c0.1,0,0.1-0.1,0.2-0.1c0.3-0.2,0.6-0.3,0.9-0.5c0,0,0,0,0-0.1c0-0.5,0-0.9,0-1.4v0c0,0-0.5-0.3-0.5-0.3c0,0,0,0,0,0.1
		c-0.2,0.5-0.4,1-0.6,1.5c-0.1,0.2-0.1,0.4-0.2,0.6c0,0,0,0,0,0.1C20.4,11.1,20.6,11.1,20.6,11.2 M28.9,8.2c0,0,1.3,0.7,1.3,0.7
		c0.1,0,0.3-0.2,0.3-0.2c0,0,0,0,0,0c-0.1-0.3-0.3-0.6-0.4-0.9c-0.1-0.3-0.3-0.5-0.5-0.8c-0.1-0.2-0.2-0.3-0.3-0.4c0,0,0,0,0,0
		c-0.1,0.1-0.2,0.1-0.3,0.2C28.9,6.7,28.9,8.1,28.9,8.2 M21.8,8.9C21.8,8.9,21.8,8.9,21.8,8.9c0.3-0.2,0.5-0.3,0.7-0.4
		c0.2-0.1,0.3-0.2,0.5-0.3c0,0,0,0,0,0c0-0.4,0-0.9,0-1.3c0,0,0-0.1,0-0.1c0,0,0,0,0,0c0,0,0,0,0,0c-0.1,0-0.3-0.2-0.3-0.2
		c0,0,0,0,0,0c0,0.1-0.1,0.1-0.1,0.2c-0.3,0.3-0.5,0.6-0.8,1c-0.2,0.3-0.4,0.6-0.5,0.9c0,0,0,0,0,0c0,0,0,0,0,0
		C21.5,8.7,21.6,8.8,21.8,8.9 M26,6.5c0.4-0.2,0.8-0.5,1.3-0.7c0,0,0,0,0,0c0,0,0,0,0,0c0,0,0,0,0,0c0,0,0-0.4,0-0.4c0,0,0,0,0,0
		c-0.1,0-0.2-0.1-0.3-0.1c-0.2,0-0.3-0.1-0.5-0.1c-0.1,0-0.3,0-0.4,0c0,0-0.1,0-0.1,0c-0.1,0-0.3,0-0.4,0c-0.1,0-0.3,0-0.4,0
		c-0.1,0-0.3,0.1-0.4,0.1c0,0,0,0,0,0c0,0.1,0,0.4,0,0.4C25.1,6,25.5,6.3,26,6.5 M28.7,6.7c0,0-1.2-0.7-1.3-0.7c0,0,0,0,0,0
		c-0.4,0.2-0.8,0.5-1.3,0.7c0,0,0,0,0,0c0,0,0,0,0,0c0,0,0,0,0,0v1.5c0,0,0,0,0,0c0,0,0,0,0,0c0.4,0.2,0.8,0.5,1.2,0.7c0,0,0,0,0,0
		c0,0,0,0,0,0c0,0,0,0,0,0c0.4-0.2,0.8-0.5,1.3-0.7c0,0,0,0,0,0c0,0,0,0,0,0c0,0,0,0,0,0C28.6,7.7,28.6,7.2,28.7,6.7 M24.6,6
		c-0.4,0.2-0.9,0.5-1.3,0.7c0,0,0,0,0,0c0,0,0,0,0,0c0,0.5,0,1,0,1.4c0,0,0,0,0,0c0,0,0,0,0,0c0.4,0.2,0.9,0.5,1.3,0.7c0,0,0,0,0,0
		c0.2-0.1,0.4-0.2,0.5-0.3c0.2-0.1,0.4-0.3,0.7-0.4c0,0,0,0,0,0c0-0.5,0-1,0-1.4c0,0,0,0,0,0c0,0,0,0,0,0c0,0,0,0,0,0
		C25.4,6.5,25,6.2,24.6,6 M21.9,9.1C21.9,9.1,21.9,9.1,21.9,9.1c0,0.5,0,1,0,1.4c0,0,0,0,0,0v0c0,0,0,0,0,0c0,0,0,0,0,0
		c0.4,0.2,0.8,0.5,1.2,0.7c0,0,0,0,0,0c0,0,0,0,0,0c0,0,0,0,0,0c0,0,1.3-0.7,1.3-0.7V9.1c0,0,0,0,0,0c-0.2-0.1-0.5-0.3-0.7-0.4
		c-0.2-0.1-0.3-0.2-0.5-0.3c0,0,0,0,0,0C22.7,8.6,22.3,8.9,21.9,9.1 M24.7,10.6c0.4,0.2,0.9,0.5,1.3,0.7c0,0,0,0,0,0
		c0.4-0.2,0.8-0.5,1.2-0.7c0,0,0,0,0,0c0,0,0,0,0,0c0,0,0,0,0,0c0,0,0,0,0,0c0-0.5,0-1,0-1.5c0,0,0,0,0,0s0,0,0,0
		c-0.1,0-1.3-0.7-1.3-0.7c0,0,0,0,0,0c-0.3,0.2-0.6,0.3-0.8,0.5C25,8.9,24.8,9,24.7,9.1c0,0,0,0,0,0V10.6z M28.8,8.4
		c-0.4,0.2-0.9,0.5-1.3,0.7c0,0.1,0,1.4,0,1.5c0,0,0,0,0,0c0,0,0,0,0,0c0.4,0.2,0.8,0.5,1.3,0.7c0,0,0,0,0,0s0,0,0,0
		c0.4-0.2,0.9-0.5,1.3-0.7c0,0,0,0,0,0c0-0.5,0-0.9,0-1.4c0-0.1,0,0,0-0.1c-0.4-0.2-0.7-0.4-1.1-0.6C28.9,8.4,28.8,8.4,28.8,8.4
		 M31.6,11.7c0,0-1.5-0.9-1.5-0.9c-0.5,0.3-0.9,0.5-1.4,0.8c-0.5-0.3-0.9-0.5-1.4-0.8c-0.1,0-1.3,0.8-1.4,0.8c0,0,0,0,0,0
		c-0.3-0.2-1.3-0.8-1.4-0.8c-0.1,0-1.3,0.8-1.4,0.8c0,0,0,0,0,0c-0.4-0.3-0.9-0.5-1.3-0.8c0,0,0,0-0.1,0c-0.2,0.1-0.5,0.2-0.7,0.4
		c-0.1,0.1-0.3,0.2-0.4,0.2c0,0,0,0,0,0c0,0-0.1,0-0.1,0c0,0-0.1,0-0.1-0.1c0,0-0.1,0-0.1,0c0,0-0.1,0-0.1,0c0,0-0.1,0-0.1-0.1
		c0-0.2,0.1-0.5,0.2-0.7c0.2-0.6,0.4-1.1,0.7-1.7c0.1-0.3,0.3-0.6,0.5-0.9c0.2-0.3,0.4-0.7,0.7-1c0.1-0.2,0.3-0.3,0.4-0.5
		c0.1-0.1,0.1-0.1,0.2-0.2C22.8,6.2,22.9,6.1,23,6c0.2-0.2,0.5-0.4,0.8-0.5c0.2-0.1,0.4-0.2,0.6-0.3C24.6,5.1,24.8,5.1,25,5
		c0.1,0,0.2,0,0.3,0c0.1,0,0.2,0,0.3,0c0.1,0,0.1,0,0.2,0c0,0,0,0,0,0h0.4c0,0,0,0,0,0c0,0,0.1,0,0.1,0c0.1,0,0.2,0,0.3,0
		C26.8,5,26.9,5,27,5c0.2,0,0.4,0.1,0.6,0.2c0.2,0.1,0.4,0.1,0.5,0.2c0.3,0.2,0.6,0.4,0.8,0.6c0.1,0.1,0.2,0.2,0.3,0.3
		c0.2,0.2,0.4,0.5,0.6,0.7c0.2,0.3,0.4,0.6,0.5,1c0.1,0.3,0.2,0.5,0.4,0.8c0,0.1,0.1,0.2,0.1,0.3c0,0.1,0.1,0.2,0.1,0.3
		c0,0.1,0.1,0.2,0.1,0.3c0,0,0,0.1,0,0.1c0,0,0,0,0,0c0,0,0,0,0.1,0c0,0,0.1,0,0.1,0c0,0,0.1,0,0.1,0c0.1,0,0.2,0,0.3,0L31.6,11.7
		L31.6,11.7z"/>
</g>
</svg>
