<?xml version="1.0" encoding="utf-8"?>
<!-- Generator: Adobe Illustrator 21.0.0, SVG Export Plug-In . SVG Version: 6.00 Build 0)  -->
<svg version="1.1" id="Layer_1" xmlns="http://www.w3.org/2000/svg" xmlns:xlink="http://www.w3.org/1999/xlink" x="0px" y="0px"
	 viewBox="0 0 120 120" style="enable-background:new 0 0 120 120;" xml:space="preserve">
<style type="text/css">
	.st0{clip-path:url(#SVGID_2_);fill:#9D1C52;}
	.st1{clip-path:url(#SVGID_2_);fill:none;stroke:#000000;stroke-width:2;stroke-miterlimit:10;}
	.st2{clip-path:url(#SVGID_2_);}
	.st3{clip-path:url(#SVGID_2_);fill:#FFFFFF;}
	.st4{fill:#52564B;}
</style>
<g>
	<defs>
		<rect id="SVGID_1_" y="-0.4" width="120.4" height="120.4"/>
	</defs>
	<clipPath id="SVGID_2_">
		<use xlink:href="#SVGID_1_"  style="overflow:visible;"/>
	</clipPath>
	<path class="st0" d="M60.4,102.8c21.3,0,38.5-17.2,38.5-38.5S81.7,25.8,60.4,25.8S21.9,43,21.9,64.3S39.2,102.8,60.4,102.8"/>
	<circle class="st1" cx="60.4" cy="64.3" r="38.5"/>
	<path class="st2" d="M55.6,61.3c-11.8,1.5-15.9,18-16,18.5c-0.1,0.5-0.2,0.9-0.2,0.9l1.2,0.6c0,0.2-0.8,2.1-2.1,2.8
		c-1.3,0.7-2.8,0.3-2.8,0.3s-0.4-0.1-0.5,0c-0.3,0.3,0,0.7,0,0.7s1.2,1,3.1,1.2c2.1,0.3,4.7-1,4.7-1s-0.5,1.8-0.5,2.9
		c-0.1,1,1.1,1.3,1.1,1.3s1.9,0.3,3.2,0.5c0.9,0.1,3.9,0.6,4.2-0.3c0.2-0.6,0.4-3.4,0.4-3.4s1.5,0.2,3.2,0c1.7-0.2,3.6-1.4,3.6-1.4
		s1.9,1.3,3.6,1.6c1.7,0.3,3.2-0.1,3.2-0.1s0,0.4,0.3,2.5c0.1,1.3,1.4,1.1,1.4,1.1s5-0.6,6.8-1c0.9-0.2,0.3-2.7,0.3-2.7l-0.3-1.7
		c0,0,2.9,0.9,7-1c2.7-1.3,4.1-4.6,4.1-4.6s1,0,2.4-0.4c1.5-0.4,3-1.3,3.1-4.4c0,0,0,0,0,0v-0.1c0-2.9-3-5.2-5.2-5.5
		c-2.3-0.4-3.7,0.9-4.3,1.9c-0.7,1.2-1.5,5.4-2.1,6.1c-0.5,0.7-2.1,0.7-2.1,0.7s-0.3,0.1-0.3-0.1l0-0.4c0,0-1.3,0.3-1.6,0
		c-0.3-0.3-1.1-2.6-1.1-2.6c-1.9-5-5.3-12.9-15-12.9C57.3,61.2,56.5,61.2,55.6,61.3"/>
	<path class="st3" d="M53,62.3c-0.1,0-0.1,0-0.1,0c-0.5,0.2-1.1,0.4-1.6,0.7c-0.9,0.4-1.6,1-2.4,1.6c-0.3,0.2-0.6,0.5-0.9,0.8
		c0,0-0.1,0-0.1,0.1c0.3,0.2,0.6,0.3,0.8,0.5c0.4-0.2,0.7-0.4,1.1-0.6c0.4-0.2,0.7-0.4,1.1-0.6c0.4-0.2,0.7-0.4,1.1-0.6
		c0.4-0.2,0.7-0.4,1.1-0.6V62.3z M68,65.4c-0.1-0.1-0.1-0.1-0.2-0.2c-0.6-0.6-1.3-1.1-2.1-1.6c-0.6-0.4-1.3-0.8-2-1.1
		c-0.2-0.1-0.5-0.2-0.7-0.3c0,0-0.1,0-0.1,0v1.2c0.1,0.1,4.1,2.4,4.2,2.4C67.4,65.8,67.7,65.6,68,65.4 M75.9,77.2
		C75.9,77.2,75.9,77.2,75.9,77.2c-0.2,0-0.4,0.1-0.5,0.1c-0.3,0-0.5,0-0.8,0c-0.1,0-0.2-0.1-0.3-0.1c-0.2-0.1-0.3-0.2-0.4-0.4
		c-0.1-0.2-0.1-0.3-0.2-0.5c-0.2-0.5-0.4-1.1-0.6-1.7c-0.1-0.2-0.1-0.4-0.2-0.6c0,0,0-0.1,0-0.1c-0.1,0-0.8,0.4-0.9,0.5
		c0,0,0,0,0,0.1c0,1.6,0,3.2,0,4.8c0,0,0,0,0,0c0,0,0,0,0,0c1.3,0.7,2.5,1.5,3.8,2.2c0,0,0,0,0,0c0-0.1,0-2.7,0-4.2
		C76,77.3,75.9,77.3,75.9,77.2 M40.3,81.2c0.2-0.1,0.3-0.2,0.5-0.3c1-0.5,1.9-1,2.9-1.5c0.1-0.1,0.1,0,0.1-0.2c0-1.5,0-3.1,0-4.6
		v-0.1c-0.1-0.1-1.5-0.9-1.6-1c0,0-0.1,0.1-0.1,0.2c-0.8,1.6-1.4,3.3-2,5c-0.2,0.6-0.4,1.3-0.5,1.9c0,0.1,0,0.1,0,0.2
		C39.7,80.9,40.2,81.1,40.3,81.2 M67.5,71.4c0.1,0.1,4.1,2.4,4.2,2.4c0.2-0.1,0.9-0.5,1-0.6c0,0,0-0.1,0-0.1c-0.4-1-0.9-2.1-1.4-3.1
		c-0.5-0.9-1-1.8-1.6-2.6c-0.4-0.5-0.7-1-1.1-1.4c0,0-0.1-0.1-0.1-0.1c-0.3,0.2-0.7,0.4-1,0.6C67.5,66.7,67.5,71.2,67.5,71.4
		 M44.2,73.8c0,0,0.1,0,0.1-0.1c0.8-0.5,1.6-0.9,2.3-1.4c0.5-0.3,1.1-0.6,1.7-1c0,0,0.1,0,0.1-0.1c0-1.5,0-2.9,0-4.4
		c0-0.2,0-0.3,0-0.5c0,0,0,0,0,0c0,0,0,0,0,0c-0.2-0.1-0.9-0.6-1-0.6c0,0-0.1,0.1-0.1,0.1c-0.2,0.2-0.3,0.3-0.5,0.5
		c-1,1-1.8,2.1-2.6,3.3c-0.6,0.9-1.2,1.9-1.7,2.9c0,0,0,0.1-0.1,0.1c0,0,0,0,0,0C43.1,73.2,43.7,73.5,44.2,73.8 M58,65.9
		c1.4-0.8,2.8-1.6,4.1-2.4c0,0,0,0,0.1,0c0,0,0,0,0,0c0,0,0,0,0,0c0-0.1,0-1.3,0-1.4c0,0-0.1,0-0.1,0c-0.3-0.1-0.7-0.2-1-0.2
		c-0.5-0.1-1-0.2-1.5-0.2c-0.4,0-0.9,0-1.3-0.1c-0.1,0-0.2,0-0.4,0c-0.5,0-1,0-1.5,0.1c-0.4,0-0.8,0.1-1.3,0.2
		c-0.5,0.1-0.9,0.2-1.3,0.3c0,0-0.1,0-0.1,0c0,0.2,0,1.3,0,1.4C55.1,64.3,56.6,65.1,58,65.9 M66.8,66.5c-0.1-0.1-4.1-2.4-4.2-2.4
		c0,0,0,0,0,0c-1.4,0.8-2.8,1.6-4.2,2.4c0,0,0,0-0.1,0c0,0,0,0,0,0c0,0,0,0,0,0v4.8c0,0,0,0,0,0c0,0,0,0,0,0
		c1.3,0.8,2.7,1.6,4.1,2.3c0,0,0.1,0,0.1,0.1c0,0,0,0,0,0c0,0,0,0,0,0c1.4-0.8,2.8-1.6,4.1-2.4c0,0,0,0,0.1,0c0,0,0,0,0,0
		c0,0,0,0,0,0C66.8,69.8,66.8,68.2,66.8,66.5 M53.4,64.1c-1.4,0.8-2.8,1.6-4.2,2.4c0,0,0,0,0,0c0,0,0,0.1,0,0.1c0,1.6,0,3.2,0,4.7
		c0,0,0,0,0,0c0,0,0,0,0,0c1.4,0.8,2.8,1.6,4.2,2.4c0,0,0.1,0,0.1-0.1c0.6-0.3,1.2-0.7,1.8-1c0.7-0.4,1.5-0.9,2.2-1.3
		c0,0,0.1,0,0.1-0.1v-4.7c0,0,0-0.1,0-0.1c0,0,0,0,0,0c0,0,0,0,0,0C56.2,65.7,54.8,64.9,53.4,64.1 M44.6,74.5
		C44.6,74.5,44.6,74.5,44.6,74.5c0,1.6,0,3.2,0,4.7c0,0,0,0.1,0,0.1c0,0,0,0,0,0c0,0,0,0,0,0c0,0,0,0,0,0c1.4,0.8,2.7,1.6,4.1,2.4
		c0,0,0,0,0.1,0c0,0,0,0,0,0c0,0,0,0,0,0c0.1-0.1,4.1-2.4,4.2-2.4v-4.9c-0.1,0-0.1-0.1-0.2-0.1c-0.8-0.4-1.5-0.9-2.3-1.3
		c-0.5-0.3-1.1-0.6-1.6-0.9c0,0-0.1-0.1-0.1-0.1C47.4,72.9,46,73.7,44.6,74.5 M53.7,79.4c1.4,0.8,2.8,1.6,4.2,2.4c0,0,0,0,0,0
		c1.3-0.8,2.7-1.5,4-2.3c0.1,0,0.1-0.1,0.2-0.1c0,0,0,0,0,0c0,0,0,0,0,0c0,0,0,0,0-0.1c0-1.6,0-3.2,0-4.8c0,0,0,0,0,0c0,0,0,0,0,0
		C62,74.4,58.1,72.1,58,72c0,0-0.1,0-0.1,0.1c-0.9,0.5-1.8,1.1-2.7,1.6c-0.4,0.2-0.8,0.5-1.2,0.7c0,0-0.1,0-0.1,0.1V79.4z M67.1,72
		c-1.4,0.8-2.8,1.6-4.2,2.4c0,0.2,0,4.7,0,4.9c0,0,0,0,0,0c0,0,0,0,0.1,0c1.4,0.8,2.8,1.6,4.1,2.4c0,0,0,0,0,0c0,0,0,0,0,0
		c1.4-0.8,2.8-1.6,4.2-2.4c0-0.1,0-0.1,0-0.2c0-1.5,0-3,0-4.5c0-0.2,0-0.2-0.2-0.3c-1.2-0.7-2.4-1.4-3.6-2.1
		C67.5,72.2,67.3,72.1,67.1,72 M76.6,82.8c0,0-4.9-2.8-4.9-2.9c-1.5,0.9-3.1,1.8-4.6,2.6c-1.5-0.9-3-1.8-4.6-2.6
		c-0.3,0.1-4.3,2.5-4.6,2.6c0,0-0.1,0-0.1-0.1C56.9,82,53.4,80,53.4,80c-0.2,0.1-4.4,2.5-4.6,2.6c0,0-0.1-0.1-0.1-0.1
		c-1.4-0.8-2.9-1.7-4.3-2.5c-0.2-0.1-0.1-0.1-0.3,0c-0.8,0.4-1.5,0.8-2.3,1.2c-0.5,0.2-1,0.5-1.4,0.7c0,0,0,0-0.1,0
		c-0.1,0-0.2-0.1-0.3-0.2c-0.1-0.1-0.2-0.1-0.3-0.2c-0.1-0.1-0.2-0.1-0.3-0.2c-0.1-0.1-0.2-0.1-0.3-0.2c-0.1-0.1-0.2-0.1-0.3-0.2
		c0.1-0.8,0.3-1.5,0.5-2.2c0.6-1.9,1.3-3.7,2.1-5.5c0.5-1,1-2.1,1.6-3c0.7-1.1,1.4-2.2,2.2-3.2c0.4-0.5,0.9-1,1.3-1.5
		c0.2-0.2,0.5-0.5,0.7-0.7c0.3-0.3,0.6-0.5,0.9-0.8c0.8-0.7,1.7-1.3,2.6-1.8c0.7-0.4,1.4-0.7,2.1-0.9c0.6-0.2,1.2-0.4,1.9-0.5
		c0.4-0.1,0.7-0.1,1.1-0.2c0.3,0,0.6-0.1,0.9-0.1c0.2,0,0.5,0,0.7,0c0,0,0.1,0,0.1,0h1.2c0,0,0,0,0,0c0.2,0,0.3,0,0.5,0
		c0.3,0,0.6,0.1,0.9,0.1c0.4,0,0.8,0.1,1.2,0.2c0.6,0.1,1.2,0.3,1.9,0.5c0.6,0.2,1.2,0.5,1.7,0.8c1,0.5,1.9,1.2,2.7,1.9
		c0.3,0.3,0.6,0.5,0.9,0.8c0.7,0.8,1.4,1.6,1.9,2.4c0.7,1,1.2,2.1,1.8,3.1c0.4,0.9,0.8,1.8,1.2,2.7c0.1,0.3,0.2,0.6,0.3,0.8
		c0.1,0.3,0.2,0.6,0.3,0.9c0.1,0.4,0.3,0.7,0.4,1.1c0,0.1,0.1,0.2,0.1,0.3c0,0.1,0.1,0.1,0.1,0.1c0.1,0,0.2,0,0.2,0
		c0.1,0,0.3,0,0.4,0c0.1,0,0.3,0,0.4-0.1c0.3,0,0.6-0.1,0.8-0.1C76.6,78.5,76.6,82.8,76.6,82.8C76.6,82.8,76.6,82.8,76.6,82.8"/>
	<path class="st2" d="M56.2,38.9c-10,1.3-13.6,15.4-13.7,15.8c-0.1,0.4-0.2,0.8-0.2,0.8l1,0.6c0,0.2-0.7,1.8-1.8,2.4
		c-1.1,0.6-2.4,0.2-2.4,0.2s-0.3-0.1-0.4,0c-0.3,0.3,0,0.6,0,0.6s1,0.8,2.6,1.1c1.8,0.2,4-0.9,4-0.9s-0.4,1.6-0.5,2.5
		c-0.1,0.9,0.9,1.1,0.9,1.1s1.7,0.3,2.7,0.4c0.7,0.1,3.3,0.5,3.6-0.3c0.2-0.5,0.3-2.9,0.3-2.9s1.3,0.2,2.7,0
		c1.5-0.2,3.1-1.2,3.1-1.2s1.6,1.1,3,1.4c1.5,0.2,2.8-0.1,2.8-0.1s0,0.3,0.2,2.2c0.1,1.1,1.2,0.9,1.2,0.9s4.3-0.5,5.8-0.9
		c0.8-0.2,0.2-2.3,0.2-2.3l-0.3-1.4c0,0,2.5,0.8,6-0.9c2.3-1.1,3.5-3.9,3.5-3.9s0.8,0,2.1-0.4c1.2-0.4,2.6-1.1,2.6-3.8c0,0,0,0,0,0
		v-0.1c0-2.5-2.5-4.4-4.5-4.7c-1.9-0.3-3.2,0.8-3.7,1.6c-0.6,1-1.3,4.6-1.8,5.2c-0.5,0.6-1.8,0.6-1.8,0.6s-0.3,0.1-0.3-0.1l0-0.3
		c0,0-1.1,0.3-1.4,0c-0.2-0.2-0.9-2.2-0.9-2.2c-1.6-4.3-4.5-11-12.8-11C57.7,38.7,57,38.8,56.2,38.9"/>
	<path class="st3" d="M54,39.7c0,0-0.1,0-0.1,0c-0.5,0.2-0.9,0.3-1.3,0.6c-0.7,0.4-1.4,0.8-2.1,1.3c-0.3,0.2-0.5,0.4-0.8,0.7
		c0,0,0,0,0,0.1c0.2,0.1,0.5,0.3,0.7,0.4c0.3-0.2,0.6-0.3,0.9-0.5c0.3-0.2,0.6-0.3,0.9-0.5c0.3-0.2,0.6-0.3,0.9-0.5
		c0.3-0.2,0.6-0.3,0.9-0.5V39.7z M66.8,42.3c-0.1-0.1-0.1-0.1-0.2-0.2c-0.5-0.5-1.1-1-1.8-1.4c-0.5-0.4-1.1-0.7-1.7-0.9
		c-0.2-0.1-0.4-0.1-0.6-0.2c0,0-0.1,0-0.1,0v1c0.1,0.1,3.5,2,3.6,2.1C66.3,42.6,66.5,42.5,66.8,42.3 M73.6,52.4
		C73.6,52.4,73.5,52.4,73.6,52.4c-0.2,0-0.3,0-0.4,0.1c-0.2,0-0.4,0-0.7,0c-0.1,0-0.2,0-0.2-0.1c-0.1-0.1-0.2-0.2-0.3-0.3
		c-0.1-0.1-0.1-0.3-0.2-0.4c-0.2-0.5-0.3-0.9-0.5-1.4c-0.1-0.2-0.1-0.3-0.2-0.5c0,0,0-0.1,0-0.1c-0.1,0-0.7,0.4-0.8,0.4
		c0,0,0,0,0,0.1c0,1.4,0,2.7,0,4.1c0,0,0,0,0,0c0,0,0,0,0,0c1.1,0.6,2.2,1.2,3.2,1.9c0,0,0,0,0,0c0-0.1,0-2.3,0-3.6
		C73.6,52.5,73.6,52.5,73.6,52.4 M43.2,55.8c0.1-0.1,0.3-0.2,0.4-0.2c0.8-0.4,1.6-0.9,2.5-1.3c0.1-0.1,0.1,0,0.1-0.2
		c0-1.3,0-2.6,0-3.9v-0.1c-0.1-0.1-1.3-0.8-1.4-0.8c0,0-0.1,0.1-0.1,0.1c-0.7,1.4-1.2,2.8-1.7,4.2c-0.2,0.5-0.3,1.1-0.5,1.7
		c0,0.1,0,0.1,0,0.2C42.6,55.5,43.1,55.8,43.2,55.8 M66.4,47.5c0.1,0.1,3.5,2,3.6,2.1c0.2-0.1,0.8-0.4,0.8-0.5c0,0,0-0.1,0-0.1
		c-0.4-0.9-0.7-1.8-1.2-2.6c-0.4-0.8-0.8-1.5-1.3-2.2c-0.3-0.4-0.6-0.8-1-1.2c0,0,0-0.1-0.1-0.1c-0.3,0.2-0.6,0.3-0.8,0.5
		C66.4,43.4,66.4,47.3,66.4,47.5 M46.5,49.5C46.5,49.5,46.6,49.5,46.5,49.5c0.8-0.4,1.4-0.8,2.1-1.2c0.5-0.3,0.9-0.5,1.4-0.8
		c0,0,0.1,0,0.1-0.1c0-1.3,0-2.5,0-3.7c0-0.1,0-0.3,0-0.4c0,0,0,0,0,0c0,0,0,0,0,0c-0.1-0.1-0.8-0.5-0.9-0.5c0,0,0,0-0.1,0.1
		c-0.1,0.1-0.3,0.3-0.4,0.4c-0.8,0.9-1.5,1.8-2.2,2.8c-0.5,0.8-1,1.6-1.4,2.5c0,0,0,0.1,0,0.1c0,0,0,0,0,0
		C45.6,49,46,49.3,46.5,49.5 M58.2,42.8c1.2-0.7,2.4-1.4,3.5-2c0,0,0,0,0.1,0c0,0,0,0,0,0c0,0,0,0,0,0c0-0.1,0-1.1,0-1.2
		c0,0,0,0-0.1,0c-0.3-0.1-0.6-0.1-0.9-0.2c-0.4-0.1-0.9-0.1-1.3-0.2c-0.4,0-0.7,0-1.1-0.1c-0.1,0-0.2,0-0.3,0c-0.4,0-0.8,0-1.3,0.1
		c-0.4,0-0.7,0.1-1.1,0.1c-0.4,0.1-0.8,0.2-1.2,0.3c0,0,0,0-0.1,0c0,0.2,0,1.1,0,1.2C55.8,41.4,57,42.1,58.2,42.8 M65.8,43.3
		c-0.1-0.1-3.5-2-3.6-2.1c0,0,0,0,0,0c-1.2,0.7-2.4,1.4-3.6,2c0,0,0,0,0,0c0,0,0,0,0,0c0,0,0,0,0,0v4.1c0,0,0,0,0,0c0,0,0,0,0,0
		c1.2,0.7,2.3,1.3,3.5,2c0,0,0.1,0,0.1,0.1c0,0,0,0,0,0c0,0,0,0,0,0c1.2-0.7,2.4-1.4,3.5-2c0,0,0,0,0,0c0,0,0,0,0,0c0,0,0,0,0,0
		C65.8,46.1,65.8,44.7,65.8,43.3 M54.3,41.2c-1.2,0.7-2.4,1.4-3.6,2.1c0,0,0,0,0,0c0,0,0,0,0,0.1c0,1.3,0,2.7,0,4c0,0,0,0,0,0
		c0,0,0,0,0,0c1.2,0.7,2.4,1.4,3.6,2.1c0,0,0.1,0,0.1-0.1c0.5-0.3,1-0.6,1.5-0.9c0.6-0.4,1.3-0.7,1.9-1.1c0,0,0.1,0,0.1-0.1
		c0-1.3,0-2.7,0-4c0,0,0,0,0-0.1c0,0,0,0,0,0c0,0,0,0,0,0C56.7,42.6,55.5,41.9,54.3,41.2 M46.8,50.1C46.8,50.1,46.8,50.1,46.8,50.1
		c0,1.4,0,2.7,0,4c0,0,0,0.1,0,0.1c0,0,0,0,0,0c0,0,0,0,0,0c0,0,0,0,0,0c1.2,0.7,2.3,1.3,3.5,2c0,0,0,0,0.1,0c0,0,0,0,0,0
		c0,0,0,0,0,0c0.1,0,3.5-2,3.6-2.1v-4.1c0,0-0.1-0.1-0.1-0.1c-0.7-0.4-1.3-0.8-2-1.1c-0.5-0.3-0.9-0.5-1.4-0.8c0,0-0.1,0-0.1,0
		C49.2,48.7,48,49.4,46.8,50.1 M54.6,54.2c1.2,0.7,2.4,1.4,3.6,2.1c0,0,0,0,0,0c1.1-0.7,2.3-1.3,3.4-2c0,0,0.1-0.1,0.1-0.1
		c0,0,0,0,0,0c0,0,0,0,0,0c0,0,0,0,0,0c0-1.4,0-2.7,0-4.1c0,0,0,0,0,0c0,0,0,0,0,0c-0.2-0.1-3.5-2-3.6-2.1c0,0-0.1,0-0.1,0.1
		c-0.8,0.5-1.6,0.9-2.3,1.3c-0.4,0.2-0.7,0.4-1.1,0.6c0,0-0.1,0-0.1,0.1V54.2z M66.1,48c-1.2,0.7-2.4,1.4-3.6,2.1c0,0.2,0,4,0,4.2
		c0,0,0,0,0,0c0,0,0,0,0,0c1.2,0.7,2.3,1.4,3.5,2c0,0,0,0,0,0c0,0,0,0,0,0c1.2-0.7,2.4-1.4,3.6-2.1c0,0,0-0.1,0-0.1
		c0-1.3,0-2.6,0-3.9c0-0.2,0-0.1-0.1-0.2c-1-0.6-2-1.2-3-1.8C66.4,48.2,66.2,48.1,66.1,48 M74.2,57.2c0,0-4.2-2.4-4.2-2.4
		c-1.3,0.8-2.6,1.5-3.9,2.3c-1.3-0.8-2.6-1.5-3.9-2.3c-0.2,0.1-3.7,2.1-3.9,2.3c0,0-0.1,0-0.1-0.1c-0.8-0.5-3.8-2.2-3.8-2.2
		c-0.2,0.1-3.7,2.1-3.9,2.2c0,0-0.1,0-0.1-0.1c-1.2-0.7-2.4-1.4-3.7-2.1c-0.1-0.1-0.1-0.1-0.2,0c-0.7,0.3-1.3,0.7-2,1
		c-0.4,0.2-0.8,0.4-1.2,0.6c0,0,0,0,0,0c-0.1,0-0.2-0.1-0.3-0.1c-0.1,0-0.2-0.1-0.3-0.1c-0.1,0-0.2-0.1-0.3-0.1
		c-0.1,0-0.2-0.1-0.3-0.1c-0.1,0-0.2-0.1-0.3-0.1c0.1-0.6,0.3-1.3,0.5-1.9c0.5-1.6,1.1-3.2,1.8-4.7c0.4-0.9,0.9-1.8,1.4-2.6
		c0.6-0.9,1.2-1.8,1.9-2.7c0.4-0.4,0.7-0.9,1.1-1.3c0.2-0.2,0.4-0.4,0.6-0.6c0.2-0.2,0.5-0.5,0.8-0.7c0.7-0.6,1.4-1.1,2.2-1.5
		c0.6-0.3,1.2-0.6,1.8-0.8c0.5-0.2,1.1-0.3,1.6-0.4c0.3-0.1,0.6-0.1,0.9-0.1c0.3,0,0.5-0.1,0.8-0.1c0.2,0,0.4,0,0.6,0
		c0,0,0.1,0,0.1,0H59c0,0,0,0,0,0c0.1,0,0.3,0,0.4,0c0.3,0,0.5,0,0.8,0.1c0.3,0,0.7,0.1,1,0.2c0.5,0.1,1.1,0.3,1.6,0.4
		c0.5,0.2,1,0.4,1.5,0.6c0.8,0.4,1.6,1,2.3,1.6c0.3,0.2,0.5,0.5,0.8,0.7c0.6,0.6,1.2,1.3,1.7,2.1c0.6,0.9,1.1,1.8,1.5,2.7
		c0.4,0.8,0.7,1.5,1,2.3c0.1,0.2,0.2,0.5,0.3,0.7c0.1,0.2,0.2,0.5,0.2,0.8c0.1,0.3,0.2,0.6,0.3,0.9c0,0.1,0.1,0.2,0.1,0.3
		c0,0,0.1,0.1,0.1,0.1c0.1,0,0.1,0,0.2,0c0.1,0,0.2,0,0.3,0c0.1,0,0.2,0,0.3-0.1c0.2,0,0.5-0.1,0.7-0.1
		C74.2,53.5,74.2,57.2,74.2,57.2L74.2,57.2z"/>
</g>
<g>
	<path class="st4" d="M15.4,50.8l0.2-0.6l-7.2-1.9l-0.2,0.6l-1.4-0.4l1-3.7c0.6-2.3,1.4-3,3.9-2.3c2.3,0.6,2.8,1.6,2.2,4l-0.2,0.9
		l2.5,0.7l0.2-0.9l1.5,0.4l-1,3.7L15.4,50.8z M12.4,46.3c0.3-1-0.1-1.4-1.4-1.8c-1-0.3-1.6,0-1.8,0.9L9,46.1l3.2,0.9L12.4,46.3z"/>
</g>
<g>
	<path class="st4" d="M17.8,43.2l0.2-0.5l-4.1-1.8l-0.2,0.5l-1.3-0.6l1-2.3l1.4,0.6c-0.9-0.8-1.1-1.6-0.7-2.5c0-0.1,0.1-0.2,0.1-0.3
		l1.8,0.8c-0.1,0.1-0.1,0.2-0.2,0.3c-0.5,1-0.1,1.8,1.2,2.3l2,0.9l0.3-0.6l1.4,0.6l-1.4,3.1L17.8,43.2z"/>
</g>
<g>
	<path class="st4" d="M23,36.7c-0.9,1.4-2.2,1.7-3.9,0.6l-1.5-0.9c-1.8-1.1-2.2-2.3-1.2-3.9c0.9-1.4,2.1-1.7,3.6-0.8l1.5,0.9
		l-1.7,2.8l0.7,0.4c0.7,0.4,1.2,0.5,1.5,0.1c0.3-0.4,0-0.8-0.7-1.3l1-1.6C23.6,33.9,23.9,35.2,23,36.7z M19.4,33.5l-0.7-0.4
		c-0.6-0.4-1-0.3-1.2,0.1c-0.2,0.4-0.1,0.8,0.5,1.2l0.6,0.4L19.4,33.5z"/>
</g>
<g>
	<path class="st4" d="M20.4,29.5L20,29.9L18.9,29l2.1-2.4l1.1,0.9l-0.3,0.4l2.6,1.4c0.6,0.3,1.1,0.6,1.6,1l0.1-0.1
		c-0.4-0.5-0.9-0.9-1.2-1.4l-1.9-2.3l-0.3,0.4l-1.1-0.9l1.9-2.3l1.1,0.9L24.1,25l3.6,5.1l-1.7,2L20.4,29.5z"/>
</g>
<g>
	<path class="st4" d="M23,19.8l1.6-1.4l1.4,1.5l-1.6,1.4L23,19.8z M28.6,27l0.5-0.4l-3-3.4l-0.4,0.4l-1-1.1l2-1.8l4,4.5l0.4-0.4
		l1,1.1l-2.5,2.2L28.6,27z"/>
</g>
<g>
	<path class="st4" d="M31,17.2c1.5-1.1,3-0.9,4,0.6l1.3,1.8c1,1.5,0.7,2.9-0.8,4c-1.5,1.1-3,0.9-4-0.6l-1.3-1.8
		C29.1,19.7,29.4,18.3,31,17.2z M33.1,18.9c-0.4-0.6-0.9-0.8-1.3-0.5c-0.4,0.3-0.5,0.8,0,1.4l1.5,2.2c0.4,0.6,0.9,0.8,1.4,0.5
		c0.5-0.3,0.5-0.8,0-1.4L33.1,18.9z"/>
</g>
<g>
	<path class="st4" d="M42.3,18.3c0,0.9-0.4,1.7-1.3,2.1c-1.3,0.6-2.2,0.1-2.9-1.6l-1.5-3.1L36,15.9l-0.6-1.3l2.5-1.1l1.9,4.1
		c0.4,0.9,0.7,1.4,1.3,1.1c0.6-0.3,0.6-0.8,0.2-1.7L40,14.1l-0.6,0.3L38.8,13l2.5-1.2l2.5,5.4l0.5-0.2l0.6,1.3l-2.2,1L42.3,18.3z"/>
</g>
<g>
	<path class="st4" d="M45.2,15.5l1.7-0.5c0.2,0.8,0.7,1.2,1.2,1.1c0.4-0.1,0.6-0.4,0.5-0.9c-0.2-0.7-0.9-0.6-1.9-0.9
		c-1.2-0.3-1.9-0.7-2.2-1.6c-0.3-1.2,0.2-2.2,1.4-2.5c0.8-0.2,1.4-0.1,1.8,0.4L47.5,10l1.5-0.4l0.6,2.3L48,12.3
		c-0.2-0.8-0.6-1.1-1.1-1c-0.4,0.1-0.6,0.4-0.5,0.8c0.2,0.6,0.8,0.7,1.9,0.9c1.2,0.2,1.9,0.6,2.2,1.7c0.3,1.3-0.3,2.3-1.5,2.7
		c-0.7,0.2-1.3,0-1.9-0.4l0.2,0.8l-1.5,0.4L45.2,15.5z"/>
</g>
<g>
	<path class="st4" d="M62,13c0.1,2-0.9,3-3,3.1c-2.2,0.1-3.3-1-3.4-3.5l-0.1-3.9c-0.1-2.3,0.8-3.5,2.5-3.5c0.8,0,1.5,0.3,2,1l0-0.8
		l1.8-0.1l0.2,4l-2,0.1c0-0.1,0-0.3,0-0.4c-0.1-1.5-0.3-2.2-1.1-2.1c-0.9,0-1,0.7-1,2.1l0.1,3.8c0.1,1.3,0.3,1.9,1.1,1.9
		c0.8,0,1-0.6,1-1.8c0-0.2,0-0.4,0-0.6l2.1-0.1L62,13z"/>
</g>
<g>
	<path class="st4" d="M63.4,14.3l0.6,0.1L65,6.8l-0.6-0.1l0.2-1.4l2.7,0.4l-0.5,3.8c0.5-0.5,1.1-0.7,1.9-0.6
		c1.4,0.2,1.9,1.1,1.7,2.7l-0.5,3.6l0.6,0.1l-0.2,1.5L67,16.4l0.2-1.5l0.5,0.1l0.5-3.4c0.1-0.8-0.1-1.3-0.7-1.3
		c-0.6-0.1-0.9,0.3-1,1.1L66,14.7l0.5,0.1l-0.2,1.5l-3.2-0.4L63.4,14.3z"/>
</g>
<g>
	<path class="st4" d="M75.2,17.2c-0.7,0.7-1.4,0.9-2.3,0.6c-1.2-0.4-1.5-1.3-1.1-2.8c0.5-1.6,1.6-2,3.6-1.4l0.6,0.2l0.2-0.7
		c0.2-0.6,0.1-1-0.4-1.2c-0.4-0.1-0.8,0-0.9,0.5l-0.2,0.5l-1.8-0.6c0-0.1,0-0.2,0.1-0.3c0.5-1.5,1.5-1.9,3.2-1.3
		c1.9,0.6,2.4,1.7,1.8,3.4L77,17.4l0.5,0.2L77,19l-2.2-0.7L75.2,17.2z M75.5,15c-1.1-0.4-1.6-0.2-1.8,0.6c-0.2,0.6,0,1,0.4,1.1
		c0.5,0.2,1.1-0.2,1.4-1.1l0.2-0.5C75.6,15,75.6,15,75.5,15z"/>
</g>
<g>
	<path class="st4" d="M78.4,18.1l0.6,0.3l3.4-6.9L82,11.3l0.6-1.3l2.4,1.2L81,19.4l0.6,0.3L80.9,21l-3.1-1.6L78.4,18.1z"/>
</g>
<g>
	<path class="st4" d="M82.4,20.1l0.6,0.4l4.1-6.5l-0.5-0.3l0.8-1.2l2.3,1.4l-4.8,7.8l0.6,0.4l-0.8,1.3l-3-1.8L82.4,20.1z"/>
</g>
<g>
	<path class="st4" d="M87.3,25.5c-1.3-1.1-1.4-2.4-0.1-4l1.1-1.4c1.3-1.6,2.6-1.9,4-0.7c1.3,1.1,1.5,2.3,0.4,3.7l-1.1,1.4L89,22.4
		L88.5,23c-0.5,0.7-0.6,1.2-0.2,1.5c0.4,0.3,0.8,0.1,1.4-0.6l1.4,1.2C90,26.4,88.7,26.5,87.3,25.5z M90.9,22.2l0.5-0.6
		c0.4-0.5,0.4-0.9,0.1-1.2c-0.4-0.3-0.8-0.2-1.2,0.4l-0.5,0.6L90.9,22.2z"/>
</g>
<g>
	<path class="st4" d="M91.4,26.6l0.4,0.4l3.3-3.1l-0.4-0.4l1.1-1l1.7,1.8l-0.8,0.7c0.9-0.3,1.7,0,2.3,0.6c1,1,0.8,2-0.4,3.2
		l-2.7,2.5l0.4,0.4l-1.1,1L93,30.5l1.1-1l0.3,0.4l2.5-2.3c0.6-0.6,0.7-1,0.3-1.5c-0.4-0.4-0.9-0.3-1.5,0.2l-2.5,2.3l0.3,0.4l-1.1,1
		l-2.2-2.4L91.4,26.6z"/>
</g>
<g>
	<path class="st4" d="M97,39c-0.9,0-1.7-0.5-2.3-1.4c-0.9-1.5-0.7-2.6,0.6-3.5c0,0,0.1,0,0.1-0.1l1,1.6c-0.7,0.4-0.8,0.7-0.6,1.2
		c0.3,0.5,0.8,0.4,1.7-0.2l0.9-0.5c-0.7-0.1-1.2-0.4-1.5-0.9c-0.7-1.1-0.2-2.2,1.5-3.2l1.2-0.7c1.8-1.1,2.8-1.2,3.6,0.1
		c0.4,0.7,0.4,1.4,0,2.2l0.8-0.5l1.2,2l-1.2,0.8l-0.3-0.5l-3.9,2.5C98.6,38.5,97.7,39,97,39z M101.5,34.2c0.9-0.6,1.2-1.1,0.9-1.5
		c-0.3-0.4-0.7-0.3-1.6,0.2l-1.4,0.9c-0.8,0.5-1.2,0.9-0.9,1.4c0.3,0.5,0.8,0.4,1.6-0.1L101.5,34.2z"/>
</g>
<g>
	<path class="st4" d="M100.3,42.3c-0.7-1.5-0.1-2.8,1.7-3.6l1.6-0.7c1.9-0.8,3.1-0.5,3.9,1.2c0.7,1.6,0.2,2.8-1.3,3.4l-1.6,0.7
		l-1.3-3l-0.7,0.3c-0.8,0.3-1.1,0.7-0.9,1.2c0.2,0.5,0.6,0.5,1.5,0.1l0.7,1.7C102.2,44.3,101,43.8,100.3,42.3z M105,41.1l0.7-0.3
		c0.6-0.3,0.8-0.6,0.6-1c-0.2-0.4-0.6-0.5-1.3-0.2l-0.7,0.3L105,41.1z"/>
</g>
<g>
	<path class="st4" d="M104.5,44.9l0.5,1.7c-0.8,0.2-1.2,0.7-1.1,1.2c0.1,0.4,0.4,0.6,0.9,0.5c0.7-0.2,0.6-0.9,0.9-1.9
		c0.3-1.2,0.7-1.9,1.6-2.2c1.2-0.3,2.2,0.2,2.5,1.4c0.2,0.8,0.1,1.4-0.4,1.8l0.6-0.2l0.4,1.5l-2.3,0.6l-0.5-1.7
		c0.8-0.2,1.1-0.6,1-1.1c-0.1-0.4-0.4-0.6-0.8-0.5c-0.6,0.2-0.7,0.8-0.9,1.9c-0.2,1.2-0.6,1.9-1.7,2.2c-1.3,0.3-2.3-0.3-2.7-1.5
		c-0.2-0.7,0-1.3,0.4-1.9l-0.8,0.2l-0.4-1.5L104.5,44.9z"/>
</g>
</svg>
