{
    "_links": {
        "self": {
            "href": "http:\/\/guts.local\/admin\/config\/user-interface\/shortcut\/link\/5?_format=hal_json"
        },
        "type": {
            "href": "http:\/\/drupal.org\/rest\/type\/shortcut\/default"
        }
    },
    "id": [
        {
            "value": 5
        }
    ],
    "uuid": [
        {
            "value": "e813a4bc-dd58-46cb-84c7-13be39e4dd55"
        }
    ],
    "langcode": [
        {
            "value": "en",
            "lang": "en"
        }
    ],
    "shortcut_set": [
        {
            "target_id": "default"
        }
    ],
    "title": [
        {
            "value": "Create News",
            "lang": "en"
        }
    ],
    "link": [
        {
            "uri": "internal:\/node\/add\/news",
            "title": null,
            "options": []
        }
    ],
    "default_langcode": [
        {
            "value": true,
            "lang": "en"
        }
    ]
}