{
    "_links": {
        "self": {
            "href": "http:\/\/guts.local\/block\/3?_format=hal_json"
        },
        "type": {
            "href": "http:\/\/drupal.org\/rest\/type\/block_content\/basic"
        }
    },
    "id": [
        {
            "value": "3"
        }
    ],
    "uuid": [
        {
            "value": "eb3ed151-c0ca-447f-beb9-29adbae0b949"
        }
    ],
    "revision_id": [
        {
            "value": "3"
        }
    ],
    "langcode": [
        {
            "value": "en",
            "lang": "en"
        }
    ],
    "info": [
        {
            "value": "Experienced with GUTS?",
            "lang": "en"
        }
    ],
    "type": [
        {
            "target_id": "basic"
        }
    ],
    "changed": [
        {
            "value": "1466625577",
            "lang": "en"
        }
    ],
    "revision_translation_affected": [
        {
            "value": "1",
            "lang": "en"
        }
    ],
    "default_langcode": [
        {
            "value": "1",
            "lang": "en"
        }
    ],
    "body": [
        {
            "value": "<p>Are you <a href=\"\/node\/5\">experienced with GUTS<\/a>?<\/p>\r\n",
            "format": "full_html",
            "summary": "",
            "lang": "en"
        }
    ]
}