<?xml version="1.0" encoding="utf-8"?>
<!-- Generator: Adobe Illustrator 16.0.0, SVG Export Plug-In . SVG Version: 6.00 Build 0)  -->
<!DOCTYPE svg PUBLIC "-//W3C//DTD SVG 1.1 Tiny//EN" "http://www.w3.org/Graphics/SVG/1.1/DTD/svg11-tiny.dtd">
<svg version="1.1" baseProfile="tiny" id="Layer_1" xmlns="http://www.w3.org/2000/svg" xmlns:xlink="http://www.w3.org/1999/xlink"
	 x="0px" y="0px" width="432px" height="504px" viewBox="0 0 432 504" xml:space="preserve">
<polygon fill="#FCC478" points="216.631,3.25 1.131,127.531 1.019,376.328 216.388,500.75 431.892,376.456 432,127.666 "/>
<g>
</g>
<g>
	<path fill="none" d="M141.778,120.906c1.64,3.624,3.896,4.791,6.468,3.63c2.648-1.201,3.117-3.589,1.475-7.22l-5.675-12.544
		c-1.637-3.63-3.746-4.865-6.39-3.664c-2.571,1.161-3.192,3.617-1.549,7.253L141.778,120.906z"/>
	<path fill="#231F20" d="M189.411,240.106c0.263-0.148,0.566-0.243,0.755-0.58c0-11.296,0-22.639-0.01-33.975
		c0-0.189-0.013-0.371-0.02-0.553c0-0.027-0.013-0.054-0.021-0.082c-0.013-0.033-0.033-0.053-0.111-0.168
		c-10.011-5.857-20.105-11.769-30.237-17.686c-10.129,5.836-20.237,11.66-30.311,17.463c-0.027,0.115-0.064,0.175-0.064,0.236
		c-0.014,0.183-0.021,0.358-0.021,0.54c0.007,11.377,0.013,22.747,0.021,34.117c0,0.027,0.013,0.067,0.023,0.087
		c0.014,0.027,0.027,0.054,0.081,0.149c10.074,5.81,20.196,11.673,30.328,17.51c0.317-0.182,0.58-0.33,0.843-0.479
		c4.275-2.463,8.553-4.933,12.831-7.396C178.806,246.233,184.11,243.163,189.411,240.106z"/>
	<path fill="#231F20" d="M139.44,251.416c-3.938-2.267-7.868-4.548-11.809-6.809c-0.283-0.162-0.54-0.398-0.945-0.405
		c-10.013,5.81-20.061,11.633-30.085,17.456c-0.05,0.183-0.077,0.236-0.077,0.311c-0.007,11.216-0.014,22.443-0.014,33.664
		c0,0.305,0.007,0.615,0.014,0.904c0,0.042,0.007,0.067,0.013,0.096c0.014,0.026,0.034,0.047,0.058,0.074
		c0.041,0.053,0.067,0.107,0.115,0.141c9.828,5.668,19.639,11.343,29.464,17.012c0.159,0.095,0.317,0.176,0.483,0.25
		c0.03,0.02,0.057,0.026,0.091,0.026c0.027,0,0.054,0,0.091-0.007c0.884-0.404,29.75-17.071,30.345-17.53v-34.927
		c-0.378-0.223-0.746-0.438-1.117-0.654C150.523,257.812,144.983,254.613,139.44,251.416z"/>
	<path fill="#231F20" d="M255.937,239.755c0.024-0.021,0.037-0.047,0.058-0.075c0.014-0.02,0.026-0.047,0.061-0.121
		c0.027-11.592,0.064-23.232,0.099-34.886c-0.956-0.668-29.553-17.16-30.184-17.416c-0.054,0.02-0.124,0.02-0.172,0.047
		c-9.977,5.749-19.963,11.498-29.94,17.254c-0.131,0.081-0.256,0.162-0.381,0.25c-0.021,0.014-0.041,0.047-0.054,0.067
		c-0.02,0.02-0.041,0.061-0.067,0.094v34.583c0.041,0.075,0.054,0.102,0.075,0.122c0.041,0.047,0.084,0.101,0.138,0.128
		c9.709,5.607,19.417,11.221,29.129,16.822c0.284,0.168,0.592,0.323,0.881,0.485c0.027,0.014,0.062,0.021,0.088,0.021
		c0.027,0,0.058,0,0.139,0c9.895-5.695,19.818-11.411,29.747-17.133C255.684,239.924,255.809,239.836,255.937,239.755z"/>
	<path fill="#231F20" d="M287.935,261.071c-8.516-4.939-17.045-9.852-25.571-14.777c-1.214-0.688-2.426-1.39-3.674-2.112
		c-10.117,5.837-20.219,11.667-30.28,17.471c-0.152,1.335-0.213,34.042-0.067,35.081c0.033,0.054,0.067,0.114,0.118,0.148
		c0.121,0.088,0.253,0.169,0.384,0.243c9.896,5.716,19.792,11.431,29.691,17.132c0.023,0.021,0.057,0.021,0.09,0.021
		c0.027,0,0.059,0,0.166-0.013c10.048-5.79,20.155-11.62,30.277-17.457c0.014-0.405,0.026-0.763,0.026-1.127
		c0-10.891,0-21.775-0.013-32.659C289.082,261.483,289.331,261.881,287.935,261.071z"/>
	<path fill="#231F20" d="M223.082,261.801c-0.007-0.027-0.027-0.055-0.041-0.074c-1.259-0.838-29.636-17.194-30.348-17.491
		c-0.25,0.142-0.51,0.283-0.773,0.432c-6.579,3.799-13.151,7.584-19.721,11.383c-2.979,1.715-5.965,3.435-8.947,5.163
		c-0.313,0.182-0.665,0.303-0.894,0.627v34.96c10.132,5.857,20.233,11.681,30.281,17.497c0.146-0.033,0.206-0.033,0.263-0.061
		c9.66-5.561,19.326-11.127,28.984-16.708c0.372-0.202,0.733-0.432,1.1-0.654c0.028-0.014,0.049-0.04,0.068-0.061
		c0.014-0.027,0.021-0.055,0.055-0.135c0.006-0.101,0.029-0.25,0.029-0.398c-0.006-11.458-0.016-22.929-0.029-34.394
		C223.109,261.86,223.102,261.827,223.082,261.801z"/>
	<path fill="#231F20" d="M127.688,190.361c-2.288,1.782-4.501,3.658-6.62,5.628c-0.168,0.148-0.415,0.263-0.368,0.614
		c2.011,1.153,4.036,2.327,6.087,3.508c2.564-1.471,5.095-2.928,7.628-4.386c2.537-1.457,5.064-2.928,7.601-4.386
		c2.538-1.458,5.064-2.922,7.602-4.386c2.527-1.458,5.071-2.895,7.571-4.373v-8.59c-0.372,0.115-0.635,0.183-0.891,0.264
		c-3.917,1.289-7.668,2.956-11.316,4.865C138.859,182.318,133.124,186.11,127.688,190.361z"/>
	<path fill="#231F20" d="M123.37,240.099c0.28-0.168,0.556-0.351,0.826-0.52c0.014-10.547,0.037-21.033,0.058-31.519
		c0-1.093-0.013-2.193-0.021-3.292c0-0.027-0.017-0.054-0.023-0.081c-0.014-0.034-0.027-0.061-0.041-0.088
		c-1.235-0.836-6.798-3.994-7.469-4.244c-0.207,0.196-0.429,0.398-0.641,0.621c-1.161,1.208-2.335,2.395-3.475,3.63
		c-6.836,7.369-12.888,15.358-18.375,23.772c-4.379,6.714-8.346,13.678-12.018,20.811c-0.151,0.29-0.273,0.593-0.425,0.904
		c0.121,0.115,0.199,0.202,0.304,0.256c3.903,2.267,7.807,4.514,11.731,6.782c0.29-0.169,0.56-0.304,0.823-0.459
		c5.624-3.239,11.242-6.478,16.866-9.724C115.451,244.667,119.409,242.38,123.37,240.099z"/>
	<path fill="#231F20" d="M91.274,262.644v-0.857c-0.671-0.54-11.1-6.559-11.859-6.862c-0.311,0.338-0.442,0.783-0.627,1.182
		c-5.5,11.619-10.213,23.521-14.103,35.77c-1.464,4.622-2.854,9.258-3.823,14.002c-0.095,0.485-0.186,0.951-0.277,1.396
		c0.567,0.432,4.16,2.335,5.233,2.801c1.242-0.668,2.507-1.322,3.779-1.99c6.937-3.625,13.874-7.248,20.813-10.878
		c0.958-0.506,0.863-0.311,0.863-1.458C91.274,284.716,91.274,273.676,91.274,262.644z"/>
	<path fill="#231F20" d="M229.01,173.856c-0.213-0.087-0.448-0.209-0.719,0v8.617c0.566,0.438,29.38,17.112,30.446,17.618
		c1.977-1.141,3.971-2.294,6.08-3.516c-0.574-0.546-1.029-0.999-1.492-1.424c-4.636-4.305-9.612-8.172-14.898-11.646
		c-4.589-3.01-9.369-5.695-14.454-7.793C232.343,175.044,230.67,174.471,229.01,173.856z"/>
	<path fill="#231F20" d="M162.925,172.284c-0.192,0.054-0.371,0.162-0.536,0.229c-0.091,1.37-0.064,9.292,0.047,10.095
		c10.061,5.81,20.156,11.646,30.304,17.517c9.98-5.763,19.873-11.478,29.774-17.193c0.159-0.081,0.317-0.182,0.472-0.276
		c0.021-0.021,0.041-0.047,0.062-0.061c0.014-0.034,0.027-0.061,0.047-0.088c0.078-0.985,0.064-9.622-0.033-10.371
		c-0.199-0.074-0.422-0.168-0.647-0.229c-2.386-0.641-4.791-1.174-7.217-1.64c-3.627-0.688-7.274-1.18-10.952-1.504
		c-3.127-0.284-6.265-0.351-9.403-0.439c-0.85-0.02-1.707,0.062-2.557,0.075c-3.536,0.014-7.061,0.243-10.583,0.56
		c-3.033,0.276-6.06,0.621-9.065,1.127C169.353,170.624,166.121,171.366,162.925,172.284z"/>
	<path fill="#231F20" d="M384.645,219.073c-16.385-2.537-26.654,6.431-30.852,13.32c-5.25,8.61-10.635,38.712-14.898,43.909
		c-2.59,3.151-8.258,4.329-11.809,4.766v39.91c0,0.277,0,0.547-0.015,0.823h-0.175c-0.243-0.175-0.472-0.377-0.735-0.52
		c-11.235-6.497-22.477-12.982-33.712-19.486c-0.29-0.162-0.58-0.325-0.911-0.513c-10.981,6.321-21.961,12.651-32.979,19.008
		c-10.958-6.329-21.897-12.652-32.893-19.002c-1.846,1.006-3.633,2.085-5.458,3.124c-1.854,1.06-3.688,2.133-5.541,3.191
		c-1.818,1.053-3.644,2.105-5.459,3.151c-1.825,1.053-3.641,2.099-5.466,3.151c-1.845,1.061-3.697,2.132-5.543,3.199
		c-1.821,1.046-3.64,2.091-5.513,3.171c-0.29-0.155-0.58-0.304-0.871-0.473c-6.592-3.812-13.192-7.618-19.781-11.431
		c-3.85-2.227-7.706-4.454-11.556-6.667c-0.26-0.162-0.529-0.296-0.857-0.472c-1.38,0.735-2.729,1.552-4.096,2.334
		c-1.376,0.797-2.75,1.586-4.126,2.376c-1.366,0.796-2.743,1.585-4.109,2.382c-1.376,0.789-2.743,1.578-4.12,2.375
		c-1.347,0.776-2.689,1.546-4.035,2.328c-1.374,0.789-2.75,1.586-4.12,2.375c-1.374,0.789-2.743,1.586-4.116,2.382
		c-1.37,0.776-2.736,1.565-4.12,2.369c-0.351-0.202-0.674-0.364-0.989-0.554c-10.313-5.951-20.631-11.902-30.948-17.861
		c-1.147-0.654-0.813-0.607-1.886-0.047c-5.513,2.874-11.02,5.755-16.529,8.63c-3.417,1.803-6.845,3.591-10.273,5.385
		c-0.105,0.061-0.22,0.102-0.375,0.162c-0.129-0.044-0.254-0.101-0.38-0.155c-2.403,4.75-7.141,12.153-13.51,15.648
		c-9.225,5.027-20.314,2.004-20.314,2.004s-2.821-0.479-3.421,0.128c-2.169,2.139,0.172,4.689,0.172,4.689s8.546,7.153,22.099,8.88
		c14.855,1.89,33.54-7.28,33.54-7.28s-3.408,13.226-3.934,21.141c-0.489,7.349,7.587,9.164,7.587,9.164s13.944,2.409,22.74,3.333
		c6.252,0.661,28.192,4.319,30.507-2.206c1.63-4.596,2.784-24.131,2.784-24.131s10.621,1.762,23.094,0.068
		c12.457-1.694,26.11-10.277,26.11-10.277s13.324,9.487,25.622,11.519c12.277,2.071,23.307-0.871,23.307-0.871
		s0.074,2.834,1.832,18.273c1.036,9.049,10.412,7.699,10.412,7.699s36.039-3.994,48.705-7.247c6.417-1.62,1.95-19.461,1.95-19.461
		l-2.133-12.064c0,0,20.703,6.553,50.278-7.342c19.725-9.305,29.818-32.733,29.818-32.733s6.896,0.074,17.449-3.131
		c10.533-3.205,21.62-9.609,22.079-31.856c0-0.129,0.007-0.229,0.007-0.351v-0.526C422,237.987,400.784,221.583,384.645,219.073z"/>
	<path fill="#231F20" d="M298.454,252.245c-3.017-7.523-6.248-14.946-9.966-22.153c-3.337-6.444-7.018-12.686-11.212-18.624
		c-2.53-3.59-5.232-7.051-8.141-10.345c-0.213-0.236-0.389-0.56-0.745-0.661c-2.355,1.356-4.7,2.706-7.016,4.049
		c-0.102,1.086-0.151,33.907-0.053,35.122c0.987,0.695,29.689,17.228,30.364,17.497c1.416-0.688,6.479-3.658,7.024-4.123
		C298.623,252.758,298.549,252.502,298.454,252.245z"/>
	<path fill="#231F20" d="M322.085,281.523c-0.27,0.015-0.425,0.015-0.567,0.041c-1.059,0.142-2.111,0.344-3.171,0.439
		c-1.883,0.181-3.771,0.181-5.634-0.278c-0.683-0.168-1.336-0.417-1.957-0.748c-1.188-0.628-1.971-1.612-2.544-2.787
		c-0.534-1.1-1.046-2.206-1.519-3.333c-1.593-3.894-2.915-7.882-4.23-11.877c-0.459-1.39-0.951-2.76-1.444-4.143
		c-0.074-0.223-0.195-0.425-0.29-0.635c-0.775,0.304-5.77,3.186-6.369,3.664c-0.015,0.136-0.028,0.291-0.028,0.439
		c0,11.465,0.014,22.929,0.014,34.394c0,0.026,0.015,0.06,0.027,0.087s0.034,0.048,0.128,0.183
		c9.036,5.209,18.158,10.479,27.295,15.743c0.067,0.04,0.162,0.025,0.25,0.047c0.128-0.723,0.183-19.521,0.094-30.358
		C322.132,282.125,322.105,281.861,322.085,281.523z"/>
	<path fill="#FFFFFF" d="M66.156,315.708c3.428-1.794,6.855-3.582,10.273-5.385c5.51-2.875,11.016-5.756,16.529-8.63
		c1.073-0.561,0.739-0.607,1.886,0.047c10.317,5.959,20.635,11.91,30.948,17.861c0.314,0.189,0.638,0.352,0.989,0.554
		c1.383-0.804,2.75-1.593,4.12-2.369c1.374-0.796,2.743-1.593,4.116-2.382c1.37-0.789,2.746-1.586,4.12-2.375
		c1.346-0.782,2.688-1.552,4.035-2.328c1.376-0.797,2.743-1.586,4.12-2.375c1.366-0.797,2.743-1.586,4.109-2.382
		c1.377-0.79,2.75-1.579,4.126-2.376c1.367-0.782,2.716-1.599,4.096-2.334c0.328,0.176,0.597,0.31,0.857,0.472
		c3.85,2.213,7.706,4.44,11.556,6.667c6.589,3.812,13.189,7.618,19.781,11.431c0.291,0.169,0.581,0.317,0.871,0.473
		c1.873-1.08,3.691-2.125,5.513-3.171c1.846-1.067,3.698-2.139,5.543-3.199c1.826-1.053,3.641-2.099,5.466-3.151
		c1.815-1.046,3.641-2.099,5.459-3.151c1.852-1.059,3.687-2.132,5.541-3.191c1.825-1.039,3.612-2.118,5.458-3.124
		c10.995,6.35,21.935,12.673,32.893,19.002c11.019-6.356,21.998-12.687,32.979-19.008c0.331,0.188,0.621,0.351,0.911,0.513
		c11.235,6.504,22.477,12.989,33.712,19.486c0.264,0.143,0.492,0.345,0.735,0.52h0.175c0.015-0.276,0.015-0.546,0.015-0.823v-39.91
		v-5.542c-2.024,0.297-4.036,0.594-6.06,0.897c-0.938,0.135-1.863,0.276-2.794,0.425c-0.944,0.155-1.89,0.155-2.828,0.115
		c-0.6-0.034-1.207-0.189-1.801-0.291c-0.426-0.074-0.702-0.33-0.891-0.722c-0.324-0.708-0.688-1.417-1.006-2.139
		c-1.093-2.523-2.005-5.108-2.888-7.699c-0.723-2.099-1.363-4.231-2.099-6.329c-0.723-2.031-1.512-4.049-2.294-6.066
		c-2.545-6.586-5.264-13.105-8.286-19.495c-3.712-7.834-7.855-15.412-12.666-22.625c-4.146-6.228-8.756-12.092-13.938-17.49
		c-2.045-2.125-4.244-4.109-6.508-6.012c-6.066-5.128-12.541-9.663-19.529-13.462c-4.001-2.166-8.117-4.062-12.442-5.472
		c-4.383-1.417-8.812-2.632-13.317-3.557c-2.833-0.58-5.685-1.079-8.559-1.417c-2.206-0.263-4.423-0.432-6.64-0.621
		c-1.12-0.088-2.247-0.128-3.374-0.203c-0.104-0.006-0.206-0.094-0.304-0.141h-8.961c-0.202,0.195-0.455,0.141-0.691,0.155
		c-1.707,0.094-3.415,0.141-5.115,0.276c-2.271,0.183-4.545,0.418-6.819,0.648c-2.638,0.263-5.25,0.695-7.858,1.188
		c-4.585,0.864-9.056,2.18-13.519,3.509c-5.307,1.579-10.311,3.887-15.155,6.552c-6.592,3.61-12.76,7.854-18.573,12.612
		c-2.217,1.822-4.366,3.711-6.397,5.735c-1.667,1.66-3.263,3.381-4.893,5.061c-3.323,3.408-6.447,6.984-9.44,10.688
		c-5.816,7.187-11.032,14.798-15.796,22.727c-4.248,7.085-8.124,14.373-11.653,21.836c-6.104,12.915-11.229,26.194-15.382,39.846
		c-1.596,5.25-2.827,10.587-3.85,16.005c0.641,0.527,1.424,0.804,2.136,1.201c0.739,0.412,1.505,0.797,2.257,1.195
		c0.726,0.378,1.461,0.755,2.193,1.133c0.752,0.398,1.498,0.823,2.257,1.201c0.607,0.292,1.185,0.659,1.796,0.925
		c0.125,0.055,0.25,0.111,0.38,0.155C65.936,315.81,66.051,315.769,66.156,315.708z M90.411,297.206
		c-6.94,3.63-13.877,7.253-20.813,10.878c-1.272,0.668-2.538,1.322-3.779,1.99c-1.073-0.466-4.666-2.369-5.233-2.801
		c0.091-0.445,0.182-0.911,0.277-1.396c0.968-4.744,2.359-9.38,3.823-14.002c3.89-12.248,8.604-24.15,14.103-35.77
		c0.185-0.398,0.317-0.844,0.627-1.182c0.759,0.304,11.188,6.322,11.859,6.862v0.857c0,11.032,0,22.072,0,33.104
		C91.274,296.896,91.369,296.7,90.411,297.206z M94.625,256.672c-0.263,0.155-0.533,0.29-0.823,0.459
		c-3.924-2.268-7.828-4.515-11.731-6.782c-0.105-0.054-0.183-0.142-0.304-0.256c0.152-0.311,0.273-0.614,0.425-0.904
		c3.671-7.132,7.639-14.097,12.018-20.811c5.487-8.414,11.539-16.404,18.375-23.772c1.14-1.235,2.314-2.422,3.475-3.63
		c0.212-0.223,0.435-0.425,0.641-0.621c0.671,0.25,6.234,3.408,7.469,4.244c0.014,0.027,0.027,0.054,0.041,0.088
		c0.007,0.027,0.023,0.054,0.023,0.081c0.007,1.1,0.021,2.2,0.021,3.292c-0.021,10.486-0.044,20.972-0.058,31.519
		c-0.27,0.169-0.546,0.351-0.826,0.52c-3.961,2.281-7.919,4.568-11.88,6.849C105.866,250.194,100.249,253.433,94.625,256.672z
		 M192.285,168.397c0.851-0.013,1.708-0.095,2.557-0.075c3.138,0.088,6.276,0.155,9.403,0.439c3.678,0.324,7.325,0.816,10.952,1.504
		c2.426,0.466,4.831,0.999,7.217,1.64c0.226,0.061,0.448,0.155,0.647,0.229c0.098,0.749,0.111,9.386,0.033,10.371
		c-0.02,0.027-0.033,0.054-0.047,0.088c-0.021,0.014-0.04,0.041-0.062,0.061c-0.154,0.094-0.312,0.195-0.472,0.276
		c-9.902,5.715-19.794,11.431-29.774,17.193c-10.148-5.871-20.243-11.708-30.304-17.517c-0.111-0.803-0.138-8.725-0.047-10.095
		c0.165-0.067,0.344-0.176,0.536-0.229c3.195-0.918,6.427-1.66,9.71-2.2c3.006-0.506,6.032-0.851,9.065-1.127
		C185.224,168.641,188.749,168.411,192.285,168.397z M263.325,195.152c0.463,0.425,0.918,0.877,1.492,1.424
		c-2.109,1.221-4.104,2.375-6.08,3.516c-1.066-0.506-29.88-17.18-30.446-17.618v-8.617c0.271-0.209,0.506-0.087,0.719,0
		c1.66,0.614,3.333,1.188,4.963,1.856c5.085,2.098,9.865,4.784,14.454,7.793C253.713,186.98,258.689,190.848,263.325,195.152z
		 M157.19,173.991v8.59c-2.5,1.478-5.044,2.915-7.571,4.373c-2.537,1.464-5.064,2.928-7.602,4.386
		c-2.537,1.458-5.064,2.929-7.601,4.386c-2.534,1.458-5.064,2.915-7.628,4.386c-2.051-1.181-4.076-2.355-6.087-3.508
		c-0.047-0.351,0.2-0.466,0.368-0.614c2.119-1.97,4.332-3.846,6.62-5.628c5.436-4.251,11.171-8.043,17.294-11.242
		c3.647-1.909,7.399-3.576,11.316-4.865C156.555,174.174,156.818,174.106,157.19,173.991z M157.183,296.599
		c-0.594,0.459-29.461,17.126-30.345,17.53c-0.037,0.007-0.064,0.007-0.091,0.007c-0.034,0-0.062-0.007-0.091-0.026
		c-0.166-0.074-0.324-0.155-0.483-0.25c-9.825-5.669-19.636-11.344-29.464-17.012c-0.047-0.033-0.074-0.088-0.115-0.141
		c-0.023-0.027-0.043-0.048-0.058-0.074c-0.006-0.028-0.013-0.054-0.013-0.096c-0.007-0.289-0.014-0.6-0.014-0.904
		c0-11.221,0.007-22.448,0.014-33.664c0-0.074,0.027-0.128,0.077-0.311c10.024-5.823,20.072-11.646,30.085-17.456
		c0.405,0.006,0.662,0.243,0.945,0.405c3.941,2.26,7.872,4.542,11.809,6.809c5.543,3.198,11.083,6.397,16.626,9.602
		c0.372,0.216,0.739,0.432,1.117,0.654V296.599z M159.825,257.164c-10.132-5.836-20.253-11.7-30.328-17.51
		c-0.054-0.095-0.067-0.122-0.081-0.149c-0.01-0.02-0.023-0.061-0.023-0.087c-0.007-11.37-0.014-22.74-0.021-34.117
		c0-0.182,0.007-0.357,0.021-0.54c0-0.061,0.037-0.121,0.064-0.236c10.074-5.803,20.182-11.626,30.311-17.463
		c10.131,5.917,20.226,11.829,30.237,17.686c0.078,0.115,0.098,0.135,0.111,0.168c0.007,0.027,0.021,0.054,0.021,0.082
		c0.007,0.182,0.02,0.364,0.02,0.553c0.01,11.336,0.01,22.679,0.01,33.975c-0.189,0.337-0.492,0.432-0.755,0.58
		c-5.301,3.057-10.604,6.127-15.912,9.184c-4.278,2.463-8.556,4.933-12.831,7.396C160.405,256.834,160.142,256.982,159.825,257.164z
		 M223.109,296.68c-0.034,0.08-0.041,0.107-0.055,0.135c-0.02,0.021-0.04,0.047-0.068,0.061c-0.366,0.223-0.728,0.452-1.1,0.654
		c-9.659,5.581-19.325,11.147-28.984,16.708c-0.057,0.027-0.118,0.027-0.263,0.061c-10.047-5.816-20.149-11.64-30.281-17.497v-34.96
		c0.229-0.324,0.581-0.445,0.894-0.627c2.982-1.729,5.968-3.448,8.947-5.163c6.569-3.799,13.142-7.584,19.721-11.383
		c0.263-0.148,0.523-0.29,0.773-0.432c0.712,0.297,29.089,16.653,30.348,17.491c0.014,0.02,0.034,0.047,0.041,0.074
		c0.02,0.026,0.027,0.06,0.027,0.087c0.014,11.465,0.023,22.936,0.029,34.394C223.139,296.43,223.115,296.579,223.109,296.68z
		 M225.666,257.131c-0.026,0-0.061-0.007-0.088-0.021c-0.289-0.162-0.597-0.317-0.881-0.485
		c-9.712-5.601-19.42-11.215-29.129-16.822c-0.054-0.027-0.098-0.082-0.138-0.128c-0.021-0.02-0.034-0.047-0.075-0.122V204.97
		c0.027-0.034,0.047-0.074,0.067-0.094c0.014-0.021,0.034-0.054,0.054-0.067c0.125-0.088,0.25-0.169,0.381-0.25
		c9.977-5.756,19.963-11.505,29.94-17.254c0.048-0.027,0.118-0.027,0.172-0.047c0.631,0.256,29.228,16.748,30.184,17.416
		c-0.034,11.653-0.071,23.293-0.099,34.886c-0.034,0.074-0.047,0.101-0.061,0.121c-0.021,0.027-0.033,0.054-0.058,0.075
		c-0.128,0.081-0.253,0.168-0.385,0.243c-9.929,5.722-19.853,11.438-29.747,17.133C225.724,257.131,225.693,257.131,225.666,257.131
		z M289.095,295.681c0,0.364-0.013,0.722-0.026,1.127c-10.122,5.837-20.229,11.667-30.277,17.457
		c-0.107,0.013-0.139,0.013-0.166,0.013c-0.033,0-0.066,0-0.09-0.021c-9.899-5.701-19.795-11.416-29.691-17.132
		c-0.131-0.074-0.263-0.155-0.384-0.243c-0.051-0.034-0.085-0.095-0.118-0.148c-0.146-1.039-0.085-33.746,0.067-35.081
		c10.062-5.804,20.163-11.634,30.28-17.471c1.248,0.722,2.46,1.424,3.674,2.112c8.526,4.926,17.056,9.838,25.571,14.777
		c1.396,0.81,1.147,0.412,1.147,1.95C289.095,273.905,289.095,284.79,289.095,295.681z M291.687,257.131
		c-0.675-0.27-29.377-16.802-30.364-17.497c-0.099-1.215-0.049-34.036,0.053-35.122c2.315-1.343,4.66-2.692,7.016-4.049
		c0.356,0.102,0.532,0.425,0.745,0.661c2.908,3.293,5.61,6.755,8.141,10.345c4.194,5.938,7.875,12.179,11.212,18.624
		c3.718,7.207,6.949,14.629,9.966,22.153c0.095,0.257,0.169,0.513,0.257,0.763C298.165,253.473,293.103,256.442,291.687,257.131z
		 M322.045,312.76c-0.088-0.021-0.183-0.007-0.25-0.047c-9.137-5.265-18.259-10.534-27.295-15.743
		c-0.094-0.135-0.115-0.155-0.128-0.183s-0.027-0.061-0.027-0.087c0-11.465-0.014-22.929-0.014-34.394
		c0-0.148,0.014-0.304,0.028-0.439c0.6-0.479,5.594-3.36,6.369-3.664c0.095,0.21,0.216,0.412,0.29,0.635
		c0.493,1.383,0.985,2.753,1.444,4.143c1.315,3.995,2.638,7.983,4.23,11.877c0.473,1.127,0.984,2.233,1.519,3.333
		c0.573,1.175,1.356,2.159,2.544,2.787c0.621,0.331,1.274,0.58,1.957,0.748c1.862,0.459,3.751,0.459,5.634,0.278
		c1.06-0.096,2.112-0.298,3.171-0.439c0.143-0.026,0.298-0.026,0.567-0.041c0.021,0.338,0.047,0.602,0.054,0.878
		C322.228,293.238,322.173,312.037,322.045,312.76z"/>
	<path fill="#231F20" d="M212.734,117.418l16.654-0.425l-0.192-7.706l-3.07,0.087l-0.482-18.995
		c-0.223-8.705-3.634-12.76-10.924-12.571c-4.892,0.122-8.327,2.281-10.537,6.815l-0.138-5.553l-12.756,0.323l0.188,7.45
		l3.067-0.075l0.594,23.381l-3.066,0.081l0.192,7.692l16.734-0.418l-0.192-7.699l-2.652,0.067l-0.452-17.74
		c-0.108-4.238,1.33-6.431,4.318-6.505c3.236-0.081,4.618,1.876,4.727,6.269l0.449,17.753l-2.659,0.061L212.734,117.418z"/>
	<path fill="#231F20" d="M269.962,131.346c10.496,4.744,17.537,0.843,23.276-11.849l11.208-24.792l2.794,1.262l3.172-7.011
		l-14.879-6.734l-3.172,7.024l2.645,1.194L282.503,118.1c-2.493,5.52-4.939,7.503-8.796,5.763c-3.704-1.68-3.711-4.683-1.356-9.892
		l12.676-28.044l2.646,1.195l3.178-7.018l-15.941-7.2l-3.171,7.011l2.8,1.268l-11.688,25.844
		C257.421,119.044,259.382,126.562,269.962,131.346z"/>
	<path fill="#231F20" d="M324.791,117.458c-4.824-3.786-10.688-3.03-14.683,2.058c-3.179,4.042-2.875,8.077-0.096,14.062
		c2.39,5.149,4.656,7.773,2.402,10.641c-1.383,1.761-3.366,2.004-5.128,0.614c-2.159-1.694-1.903-4.562,0.851-8.199l-7.302-5.735
		l-8.705,11.08l6.52,5.121l2.604-3.319c-0.317,3.752,0.999,6.788,3.94,9.096c5.014,3.934,11.343,3.124,15.547-2.221
		c3.631-4.629,3.333-8.671,0.445-14.521c-2.437-5.081-4.433-7.921-2.281-10.654c1.282-1.633,3.03-1.842,4.656-0.561
		c1.836,1.438,1.755,4.224-0.742,7.538l7.1,5.574l7.476-9.507l-6.383-5.021l-2.052,2.604
		C329.528,122.978,328.111,120.077,324.791,117.458z"/>
	
		<rect x="162.511" y="67.064" transform="matrix(-0.225 -0.9744 0.9744 -0.225 134.8936 252.3601)" fill="#231F20" width="10.602" height="10.936"/>
	<polygon fill="#231F20" points="170.517,122.964 187.315,119.085 185.581,111.582 182.595,112.276 175.658,82.215 162.177,85.326 
		163.85,92.586 166.674,91.938 171.94,114.732 168.789,115.461 	"/>
	<path fill="#231F20" d="M98.275,97.667L82.762,109.86l4.764,6.053l3.786-2.977l20.494,26.087c2.723,3.462,2.958,5.904,0.863,7.551
		c-2.412,1.896-4.781,0.493-8.472-4.204c-0.462-0.587-0.911-1.289-1.424-1.95l-8.401,6.606l3.64,4.629
		c5.169,6.586,12.143,7.011,19.832,0.965c8.803-6.916,8.243-14.062,0.25-24.231l-17.73-22.565l2.672-2.099L98.275,97.667z"/>
	<path fill="#231F20" d="M151.205,131.285c8.843-3.995,11.789-10.958,7.959-19.421l-4.781-10.587
		c-3.829-8.461-10.999-10.85-19.838-6.849c-8.843,3.995-11.789,10.958-7.959,19.42l4.781,10.581
		C135.195,132.891,142.365,135.286,151.205,131.285z M137.655,101.109c2.645-1.201,4.753,0.034,6.39,3.664l5.675,12.544
		c1.643,3.63,1.174,6.019-1.475,7.22c-2.571,1.161-4.828-0.006-6.468-3.63l-5.671-12.544
		C134.463,104.726,135.084,102.27,137.655,101.109z"/>
</g>
</svg>
