<?xml version="1.0" encoding="utf-8"?>
<!-- Generator: Adobe Illustrator 16.0.0, SVG Export Plug-In . SVG Version: 6.00 Build 0)  -->
<!DOCTYPE svg PUBLIC "-//W3C//DTD SVG 1.1//EN" "http://www.w3.org/Graphics/SVG/1.1/DTD/svg11.dtd">
<svg version="1.1" id="Layer_1" xmlns="http://www.w3.org/2000/svg" xmlns:xlink="http://www.w3.org/1999/xlink" x="0px" y="0px"
	 width="521px" height="499.68px" viewBox="0 0 521 499.68" enable-background="new 0 0 521 499.68" xml:space="preserve">
<rect fill="#B3B5AB" width="520.5" height="499.68"/>
<g>
	<defs>
		<rect id="SVGID_1_" width="520.5" height="499.68"/>
	</defs>
	<clipPath id="SVGID_2_">
		<use xlink:href="#SVGID_1_"  overflow="visible"/>
	</clipPath>
	<path clip-path="url(#SVGID_2_)" fill="#231F20" d="M24.151,334.354c0,0,51.301,130.626,228.715,130.626
		s234.649-134.021,234.649-134.021s0.115-39.207-29.475-67.428c-17.296-16.496-53.426-28.377-53.426-28.377l-49.031,69.108
		l-53.615-69.108c0,0-24.459,9.726-37.665,19.221c-13.206,9.481-14.25,11.229-14.25,11.229l-26.252-5.096
		c0,0-25.733,28.688-52.972,28.688c-27.546,0-51.637-28.688-51.637-28.688S68.499,263.801,24.151,334.354"/>
	<path clip-path="url(#SVGID_2_)" fill="#231F20" d="M289.803,147.949c0,0-7.92-26.161,9.355-48.702
		c17.272-22.542,34.781-25.191,52.769-25.191c17.994,0,41.674,6.899,52.294,24.473c14.633,24.236,11.508,49.42,11.508,49.42
		s7.801,1.667,7.801,16.788c0,18.475-13.792,19.668-13.792,19.668s-5.754,58.773-57.573,58.536
		c-51.812-0.244-56.367-58.773-56.367-58.773s-11.755,0.481-13.199-15.832C281.161,152.022,289.803,147.949,289.803,147.949"/>
	<path clip-path="url(#SVGID_2_)" fill="#FFFFFF" d="M302.825,152.734c0,0,0,77.011,48.939,77.011
		c48.938,0,48.451-71.25,48.451-71.25s-15.832-1.199-23.267-5.76c-7.436-4.555-14.643-20.868-14.643-20.868
		s-8.868,16.55-25.178,19.431C320.812,154.171,302.825,152.734,302.825,152.734"/>
	<path clip-path="url(#SVGID_2_)" fill="#231F20" d="M226.468,205.279c0,0-16.926,58.536-57.567,58.536
		c-38.614,0-56.38-58.773-56.38-58.773s-28.912,2.054-35.11-18.048c-4.392-14.267,11.766-28.492,11.766-28.492
		s-7.78-18.977,1.711-30.01c9.495-11.041,23.056-9.38,23.056-9.38s-6.821-21.857,12.782-30.742
		c19.607-8.885,29.315,4.283,29.315,4.283s10.64-15.818,26.74-12.355c18.987,4.094,19.079,17.221,19.079,17.221
		s22.575-8.228,28.695,7.998c6.13,16.238,2.887,22.487,2.887,22.487s21.023-0.671,24.687,10.905
		c6.12,19.363-6.736,23.619-6.736,23.619s12.789,2.419,12.856,16.191C264.388,203.449,226.468,205.279,226.468,205.279"/>
	<path clip-path="url(#SVGID_2_)" fill="#FFFFFF" d="M119.552,173.615c0,0,10.491,77.004,48.939,77.004
		c40.183,0,48.458-71.243,48.458-71.243s-15.838-1.207-23.263-5.761c-7.448-4.562-14.646-15.114-14.646-15.114
		s-8.868,10.796-25.185,13.677S119.552,173.615,119.552,173.615"/>
	<path clip-path="url(#SVGID_2_)" fill="#231F20" d="M151.067,228.274c0,0,11.078-6.188,14.11-5.062
		c3.04,1.125,3.656,3.802,3.656,3.802s1-2.996,3.304-3.789c2.297-0.793,12.667,4.487,12.667,4.487s-6.276,10.369-15.768,9.698
		C162.548,236.956,157.973,235.038,151.067,228.274"/>
	<path clip-path="url(#SVGID_2_)" fill="#B3B5AB" d="M172.127,308.457c0,2.312-1.874,4.188-4.185,4.188
		c-2.318,0-4.192-1.877-4.192-4.188c0-2.317,1.874-4.188,4.192-4.188C170.253,304.269,172.127,306.14,172.127,308.457"/>
	<path clip-path="url(#SVGID_2_)" fill="#B3B5AB" d="M172.127,326.627c0,2.312-1.874,4.182-4.185,4.182
		c-2.318,0-4.192-1.87-4.192-4.182c0-2.311,1.874-4.188,4.192-4.188C170.253,322.438,172.127,324.316,172.127,326.627"/>
	<path clip-path="url(#SVGID_2_)" fill="#B3B5AB" d="M172.127,345.488c0,2.312-1.874,4.188-4.185,4.188
		c-2.318,0-4.192-1.877-4.192-4.188c0-2.311,1.874-4.182,4.192-4.182C170.253,341.307,172.127,343.178,172.127,345.488"/>
</g>
</svg>
