{
    "_links": {
        "self": {
            "href": "http:\/\/guts.local\/taxonomy\/term\/22?_format=hal_json"
        },
        "type": {
            "href": "http:\/\/drupal.org\/rest\/type\/taxonomy_term\/education_level"
        }
    },
    "tid": [
        {
            "value": "22"
        }
    ],
    "uuid": [
        {
            "value": "035723b0-28e7-4670-b5b9-2527a2e6d86f"
        }
    ],
    "vid": [
        {
            "target_id": "education_level"
        }
    ],
    "langcode": [
        {
            "value": "en",
            "lang": "en"
        }
    ],
    "name": [
        {
            "value": "High School",
            "lang": "en"
        }
    ],
    "weight": [
        {
            "value": "0"
        }
    ],
    "changed": [
        {
            "value": "1466116367",
            "lang": "en"
        }
    ],
    "default_langcode": [
        {
            "value": "1",
            "lang": "en"
        }
    ]
}