{
    "_links": {
        "self": {
            "href": "http:\/\/guts.local\/taxonomy\/term\/219?_format=hal_json"
        },
        "type": {
            "href": "http:\/\/drupal.org\/rest\/type\/taxonomy_term\/languages"
        }
    },
    "tid": [
        {
            "value": "219"
        }
    ],
    "uuid": [
        {
            "value": "e0295be0-6c1f-432f-a0b4-149654510d6e"
        }
    ],
    "langcode": [
        {
            "value": "en",
            "lang": "en"
        }
    ],
    "vid": [
        {
            "target_id": "languages"
        }
    ],
    "name": [
        {
            "value": "Yupik",
            "lang": "en"
        }
    ],
    "weight": [
        {
            "value": "0"
        }
    ],
    "changed": [
        {
            "value": "1490185944",
            "lang": "en"
        }
    ],
    "default_langcode": [
        {
            "value": "1",
            "lang": "en"
        }
    ]
}