<?xml version="1.0" encoding="utf-8"?>
<!-- Generator: Adobe Illustrator 16.0.0, SVG Export Plug-In . SVG Version: 6.00 Build 0)  -->
<!DOCTYPE svg PUBLIC "-//W3C//DTD SVG 1.1 Tiny//EN" "http://www.w3.org/Graphics/SVG/1.1/DTD/svg11-tiny.dtd">
<svg version="1.1" baseProfile="tiny" id="Layer_1" xmlns="http://www.w3.org/2000/svg" xmlns:xlink="http://www.w3.org/1999/xlink"
	 x="0px" y="0px" width="2806px" height="500px" viewBox="0 0 2806 500" xml:space="preserve">
<g>
	<path fill="none" d="M958.22,242.072c0-16.456-5.877-24.684-16.848-24.684c-11.362,0-17.239,8.62-17.239,26.643v17.631h34.087
		V242.072z"/>
	<path fill="none" d="M273.359,242.072c0-16.456-5.877-24.684-16.848-24.684c-11.362,0-17.239,8.62-17.239,26.643v17.631h34.087
		V242.072z"/>
	<path fill="none" d="M394.424,316.906c0,14.889,6.661,22.725,17.631,22.725c13.714,0,23.509-12.93,23.509-35.262v-14.104h-2.743
		C405.003,290.265,394.424,296.533,394.424,316.906z"/>
	<path fill="#231F20" d="M1254.808,266.755c-23.901-11.754-39.573-16.455-39.573-32.911c0-9.795,5.877-15.672,15.672-15.672
		c10.972,0,18.807,10.579,19.198,30.169h42.707v-57.204h-38.397v15.673c-7.052-13.322-20.765-19.982-40.747-19.982
		c-28.994,0-48.584,19.982-48.584,50.542c0,24.292,12.93,38.397,40.748,52.502c23.9,12.146,39.964,15.28,39.964,32.521
		c0,10.578-6.66,17.238-17.24,17.238c-12.929,0-20.374-11.361-20.765-32.912h-43.882v66.607h39.18v-19.982
		c9.795,14.889,23.508,22.333,41.139,22.333c30.17,0,51.327-21.549,51.327-53.677
		C1295.555,294.183,1282.625,280.077,1254.808,266.755z"/>
	<path fill="#231F20" d="M1030.31,336.889v36.438h83.845v-36.438h-17.239v-52.11c0-32.911,12.93-48.583,40.748-48.583
		c2.742,0,5.485,0,8.619,0.392v-48.976c-2.742-0.392-5.093-0.392-7.444-0.392c-23.9,0-39.18,12.146-48.192,40.356v-36.438h-60.337
		V226.4h14.496v110.488H1030.31z"/>
	<path fill="#231F20" d="M1004.844,293.398v-43.49c0-41.531-22.333-63.472-63.864-63.472c-44.273,0-64.647,24.292-64.647,75.226
		v43.098c0,48.192,22.333,73.269,63.472,73.269c41.923,0,64.647-22.726,65.039-64.648h-45.449c0,21.55-4.702,31.345-17.239,31.345
		c-11.754,0-18.023-10.578-18.023-31.345v-19.981H1004.844z M924.133,244.031c0-18.023,5.877-26.643,17.239-26.643
		c10.971,0,16.848,8.228,16.848,24.684v19.59h-34.087V244.031z"/>
	<path fill="#231F20" d="M1709.124,22.382l-76.543,168.226l-35.737,0.529v32.128l21.189-0.683l-43.604,95.832l9.389-21.593
		l-18.71-105.684h-62.689l-15.28,79.536c-5.094,26.251-8.619,50.543-10.578,73.66h-1.567c-1.959-19.591-5.485-40.748-9.403-63.864
		l-10.187-57.204h15.672v-32.128h-76.009v34.479h12.537l34.87,147.71h63.081l18.414-92.857c3.525-18.022,6.269-37.222,7.836-57.204
		h1.959c0.783,16.848,3.135,35.263,6.66,55.245l14.138,83.568l-62.647,137.687l14.73,0.235l217.704-477.618H1709.124z"/>
	<polygon fill="#231F20" points="42.706,151.957 69.741,151.957 69.741,335.321 45.448,335.321 45.448,373.326 148.102,373.326 
		148.102,335.321 123.811,335.321 123.811,151.957 150.844,151.957 150.844,202.5 193.551,202.5 193.551,117.478 0,117.478 0,202.5 
		42.706,202.5 	"/>
	<path fill="#231F20" d="M589.538,221.306c12.93,0,16.064,12.538,16.456,40.356h45.449v-70.525h-38.788v18.415
		c-9.795-16.064-20.766-23.116-37.613-23.116c-35.262,0-52.502,25.075-52.502,75.226v43.49c0,49.367,20.374,72.876,65.431,72.876
		c39.181,0,63.472-25.076,63.472-66.999v-5.877h-46.624v3.525c0,23.9-3.918,34.871-15.672,34.871
		c-12.538,0-14.889-9.402-14.889-30.953v-56.811C574.258,232.277,578.568,221.306,589.538,221.306z"/>
	<path fill="#231F20" d="M419.5,259.703c-50.543,0-73.659,18.415-73.659,59.554c0,37.222,16.064,56.42,45.841,56.42
		c23.508,0,39.572-10.187,49.759-32.128v29.777h57.203v-36.438h-13.713v-85.806c0-44.665-19.199-65.039-68.566-65.039
		c-44.274,0-64.647,16.847-64.647,54.461c0,2.35,0.391,4.701,0.391,7.444h47.409v-12.538c0-11.362,7.052-18.415,18.022-18.415
		c12.537,0,18.023,7.445,18.023,23.9v18.807H419.5z M435.564,304.369c0,22.332-9.795,35.262-23.509,35.262
		c-10.97,0-17.631-7.836-17.631-22.725c0-20.373,10.579-26.642,38.397-26.642h2.743V304.369z"/>
	<path fill="#231F20" d="M319.983,293.398v-43.49c0-41.531-22.332-63.472-63.863-63.472c-44.274,0-64.648,24.292-64.648,75.226
		v43.098c0,48.192,22.333,73.269,63.472,73.269c41.923,0,64.648-22.726,65.039-64.648h-45.449c0,21.55-4.701,31.345-17.239,31.345
		c-11.754,0-18.023-10.578-18.023-31.345v-19.981H319.983z M239.272,244.031c0-18.023,5.877-26.643,17.239-26.643
		c10.971,0,16.848,8.228,16.848,24.684v19.59h-34.087V244.031z"/>
	<path fill="#231F20" d="M677.694,336.889v36.438h78.753v-36.438h-12.538v-83.847c0-19.982,7.444-30.169,21.549-30.169
		c15.28,0,21.158,9.404,21.158,30.169v83.847h-12.538v36.438h78.752v-36.438h-14.496v-89.724c0-41.139-15.281-60.729-49.759-60.729
		c-19.591,0-33.696,6.66-44.666,21.549v-94.816h-66.215v35.262h14.497v188.458H677.694z"/>
	<path fill="#231F20" d="M1925.587,275.215h35.354c-2.724,39.246-24.092,60.229-60.222,60.229
		c-45.451,0-74.983-34.972-74.983-93.251c0-59.83,31.473-95.181,77.315-95.181c33.406-0.008,57.111,21.363,60.997,56.331h48.176
		v-88.579h-47.01v23.309c-16.711-20.593-40.402-28.749-74.983-28.749c-75.374,0-122.771,49.729-122.771,130.54
		c0,83.918,48.172,134.035,125.879,134.035c38.462,0,63.329-11.653,72.261-33.797v28.357h47.787v-93.631h24.866v-37.3h-112.666
		V275.215z"/>
</g>
<polygon fill="#231F20" points="2439.668,151.245 2398.489,151.245 2398.489,201.745 2353.412,201.745 2353.412,115.115 
	2579.92,115.115 2579.92,201.745 2534.465,201.745 2534.465,151.245 2493.666,151.245 2493.666,331.123 2529.42,331.123 
	2529.42,368.81 2403.537,368.81 2403.537,331.123 2439.668,331.123 "/>
<g>
	
		<line fill="none" stroke="#231F20" stroke-width="0" stroke-linecap="round" stroke-linejoin="round" x1="2610.838" y1="282.173" x2="2610.838" y2="282.165"/>
	<path fill="#231F20" d="M2713.018,213.792c-29.911-9.33-44.286-16.711-44.286-35.747c0-17.869,14.375-30.298,36.905-30.298
		c26.807,0,44.677,16.703,47.009,46.226h45.843v-78.857h-45.064v19.423c-12.046-15.933-33.418-24.863-60.996-24.863
		c-47.404,0-79.652,30.302-79.652,74.975c0,19.819,6.605,36.53,18.657,48.567c12.815,12.821,33.018,18.265,59.441,25.646
		c38.454,10.488,59.047,14.763,59.047,41.57c0,22.142-15.928,35.746-42.735,35.746c-32.631,0-50.116-16.32-50.116-47.01
		c0-2.332,0.391-4.665,0.391-6.997h-46.622v87.796h45.456v-22.534c14.763,19.043,34.188,26.808,61.771,26.808
		c55.565,0,87.804-30.307,87.804-78.474c0-20.977-6.598-37.688-19.031-49.73C2769.739,229.72,2744.103,223.888,2713.018,213.792z"/>
	<path fill="#231F20" d="M2055.752,110.785v36.725h33.206v125.017c0,66.8,34.38,98.839,107.825,98.839
		c73.442,0,107.822-32.039,107.822-98.839V36.724h32.815V0h-87.073l-0.044,36.724v236.973c0,40.627-16.021,59.383-53.521,59.383
		c-37.507,0-53.523-18.756-53.523-59.383l0.176-162.912H2055.752z"/>
</g>
</svg>
