{
    "_links": {
        "self": {
            "href": "http:\/\/guts.local\/admin\/structure\/menu\/item\/7\/edit?_format=hal_json"
        },
        "type": {
            "href": "http:\/\/drupal.org\/rest\/type\/menu_link_content\/menu_link_content"
        }
    },
    "id": [
        {
            "value": "7"
        }
    ],
    "uuid": [
        {
            "value": "0a30c6b9-87d0-4949-8400-c690873a9cb7"
        }
    ],
    "bundle": [
        {
            "value": "menu_link_content"
        }
    ],
    "title": [
        {
            "value": "Help",
            "lang": "en"
        }
    ],
    "menu_name": [
        {
            "value": "visitor-menu"
        }
    ],
    "link": [
        {
            "uri": "entity:node\/1",
            "title": "",
            "options": []
        }
    ],
    "external": [
        {
            "value": "0"
        }
    ],
    "rediscover": [
        {
            "value": "0"
        }
    ],
    "weight": [
        {
            "value": "1"
        }
    ],
    "expanded": [
        {
            "value": "0"
        }
    ],
    "enabled": [
        {
            "value": "1"
        }
    ],
    "langcode": [
        {
            "value": "en",
            "lang": "en"
        }
    ],
    "changed": [
        {
            "value": "1452553099",
            "lang": "en"
        }
    ],
    "default_langcode": [
        {
            "value": "1",
            "lang": "en"
        }
    ]
}
