{
    "_links": {
        "self": {
            "href": "http:\/\/guts.local\/taxonomy\/term\/16?_format=hal_json"
        },
        "type": {
            "href": "http:\/\/drupal.org\/rest\/type\/taxonomy_term\/curricular_area"
        }
    },
    "tid": [
        {
            "value": "16"
        }
    ],
    "uuid": [
        {
            "value": "7c04786f-67f3-412c-83f1-d3607707da7d"
        }
    ],
    "vid": [
        {
            "target_id": "curricular_area"
        }
    ],
    "langcode": [
        {
            "value": "en",
            "lang": "en"
        }
    ],
    "name": [
        {
            "value": "Science- Life Sciences",
            "lang": "en"
        }
    ],
    "weight": [
        {
            "value": "0"
        }
    ],
    "changed": [
        {
            "value": "1466116159",
            "lang": "en"
        }
    ],
    "default_langcode": [
        {
            "value": "1",
            "lang": "en"
        }
    ]
}