<?xml version="1.0" encoding="utf-8"?>
<!-- Generator: Adobe Illustrator 20.1.0, SVG Export Plug-In . SVG Version: 6.00 Build 0)  -->
<svg version="1.1" id="Layer_1" xmlns="http://www.w3.org/2000/svg" xmlns:xlink="http://www.w3.org/1999/xlink" x="0px" y="0px"
	 viewBox="0 0 432 504" style="enable-background:new 0 0 432 504;" xml:space="preserve">
<style type="text/css">
	.st0{fill:#FCC478;}
	.st1{clip-path:url(#SVGID_2_);fill:#FFFFFF;}
	.st2{clip-path:url(#SVGID_4_);fill:#231F20;}
	.st3{clip-path:url(#SVGID_6_);fill:#FCC478;}
	.st4{clip-path:url(#SVGID_8_);}
	.st5{enable-background:new    ;}
	.st6{fill:#231F20;}
	.st7{clip-path:url(#SVGID_10_);}
	.st8{clip-path:url(#SVGID_12_);}
	.st9{clip-path:url(#SVGID_14_);}
	.st10{clip-path:url(#SVGID_16_);}
	.st11{clip-path:url(#SVGID_18_);}
	.st12{font-family:'SerifaBT-Roman';}
	.st13{font-size:88.1508px;}
	.st14{clip-path:url(#SVGID_20_);}
	.st15{clip-path:url(#SVGID_22_);}
</style>
<polygon class="st0" points="216.1,2.7 0.1,127.2 0,376.6 215.9,501.3 431.9,376.8 432,127.4 "/>
<g>
	<g>
		<defs>
			<polygon id="SVGID_1_" points="216.1,2.7 0.1,127.2 0,376.6 215.9,501.3 431.9,376.8 432,127.4 			"/>
		</defs>
		<clipPath id="SVGID_2_">
			<use xlink:href="#SVGID_1_"  style="overflow:visible;"/>
		</clipPath>
		<path class="st1" d="M148.2,351.4c0,0,25-15.3,29.4-29.8c2.9-9.7,0-24.8,0-24.8s-133.5-7-133.5-94.7
			c0-87.7,88.9-116.2,175.4-116.2c86.4,0,168.4,44.9,168.4,108.4c0,63.6-67.7,107.2-162.2,107.2C225.8,301.5,207,349.6,148.2,351.4"
			/>
	</g>
</g>
<g>
	<g>
		<defs>
			<rect id="SVGID_3_" y="2.7" width="432" height="498.7"/>
		</defs>
		<clipPath id="SVGID_4_">
			<use xlink:href="#SVGID_3_"  style="overflow:visible;"/>
		</clipPath>
		<path class="st2" d="M185.9,116.5c-65,8.1-88.1,99.7-88.7,102.4c-0.6,2.7-1.1,5.1-1.1,5.1l6.4,3.6c-0.2,1.2-4.7,11.4-11.7,15.3
			c-7.1,3.9-15.6,1.5-15.6,1.5s-2.2-0.4-2.6,0.1c-1.7,1.6,0.1,3.6,0.1,3.6s6.6,5.5,17,6.8c11.4,1.5,25.8-5.6,25.8-5.6
			s-2.6,10.2-3,16.2c-0.4,5.6,5.8,7.1,5.8,7.1s10.7,1.8,17.5,2.6c4.8,0.5,21.7,3.3,23.4-1.7c1.3-3.5,2.1-18.6,2.1-18.6
			s8.2,1.4,17.7,0.1c9.6-1.3,20.1-7.9,20.1-7.9s10.2,7.3,19.7,8.9c9.4,1.6,17.9-0.7,17.9-0.7s0.1,2.2,1.4,14c0.8,6.9,8,5.9,8,5.9
			s27.7-3.1,37.4-5.6c4.9-1.2,1.5-15,1.5-15l-1.6-9.3c0,0,15.9,5,38.6-5.6c15.2-7.2,22.9-25.2,22.9-25.2s5.3,0.1,13.4-2.4
			c8.1-2.5,16.6-7.4,17-24.5c0-0.1,0-0.2,0-0.3v-0.4c-0.1-16-16.5-28.6-28.9-30.5c-12.6-1.9-20.5,4.9-23.7,10.2
			c-4,6.6-8.2,29.7-11.4,33.7c-3,3.7-11.5,3.9-11.5,3.9s-1.8,0.7-1.9-0.6l-0.1-2c0,0-7.1,1.8-9.1-0.1c-1.5-1.4-5.8-14.5-5.8-14.5
			c-10.5-27.8-29.1-71.5-83.2-71.5C195.5,115.6,190.8,115.9,185.9,116.5"/>
	</g>
	<g>
		<defs>
			<rect id="SVGID_5_" y="2.7" width="432" height="498.7"/>
		</defs>
		<clipPath id="SVGID_6_">
			<use xlink:href="#SVGID_5_"  style="overflow:visible;"/>
		</clipPath>
		<path class="st3" d="M171.7,121.8c-0.3,0.1-0.5,0.1-0.7,0.2c-3,1-5.9,2.3-8.7,3.7c-4.7,2.5-9.1,5.4-13.3,8.6
			c-1.8,1.4-3.5,2.8-5.1,4.3c-0.1,0.1-0.3,0.2-0.3,0.5c1.5,0.9,3.1,1.8,4.7,2.7c2-1.1,3.9-2.2,5.9-3.4c2-1.1,3.9-2.2,5.9-3.4
			c1.9-1.1,3.9-2.3,5.8-3.4c1.9-1.1,3.9-2.2,5.8-3.4L171.7,121.8L171.7,121.8z M254.5,139.1c-0.4-0.4-0.8-0.8-1.2-1.1
			c-3.6-3.3-7.4-6.3-11.4-8.9c-3.5-2.3-7.2-4.4-11.1-6c-1.3-0.5-2.5-0.9-3.8-1.4c-0.2-0.1-0.3-0.2-0.5,0v6.6
			c0.4,0.4,22.6,13.2,23.4,13.5C251.3,140.9,252.9,140.1,254.5,139.1 M298.5,204.4c-0.2,0-0.3,0-0.4,0c-0.8,0.1-1.6,0.3-2.4,0.4
			c-1.4,0.1-2.9,0.1-4.3-0.2c-0.5-0.1-1-0.3-1.5-0.6c-0.9-0.5-1.5-1.2-2-2.2c-0.4-0.8-0.8-1.7-1.2-2.6c-1.2-3-2.2-6.1-3.3-9.1
			c-0.3-1.1-0.7-2.1-1.1-3.2c-0.1-0.2-0.2-0.3-0.2-0.5c-0.6,0.2-4.4,2.5-4.9,2.8c0,0.1,0,0.2,0,0.3c0,8.8,0,17.6,0,26.4
			c0,0,0,0,0,0.1c0,0,0,0,0.1,0.1c6.9,4,14,8,21,12.1c0.1,0,0.1,0,0.2,0c0.1-0.5,0.1-15,0.1-23.3
			C298.5,204.9,298.5,204.7,298.5,204.4 M101.5,226.4c1-0.5,1.9-1,2.9-1.5c5.3-2.8,10.7-5.6,16-8.4c0.7-0.4,0.7-0.2,0.7-1.1v-25.4
			v-0.7c-0.5-0.4-8.5-5-9.1-5.3c-0.2,0.3-0.3,0.6-0.5,0.9c-4.2,8.9-7.9,18.1-10.8,27.5c-1.1,3.6-2.2,7.1-2.9,10.8
			c-0.1,0.4-0.1,0.7-0.2,1.1C97.9,224.5,100.7,226,101.5,226.4 M251.8,172.2c0.8,0.5,22.8,13.2,23.3,13.5c1.1-0.5,5-2.8,5.4-3.2
			c-0.1-0.2-0.1-0.4-0.2-0.6c-2.3-5.8-4.8-11.5-7.7-17c-2.6-5-5.4-9.8-8.6-14.3c-1.9-2.8-4-5.4-6.3-8c-0.2-0.2-0.3-0.4-0.6-0.5
			c-1.8,1-3.6,2.1-5.4,3.1C251.8,146.1,251.7,171.3,251.8,172.2 M123,185.7c0.2-0.1,0.4-0.2,0.6-0.4c4.3-2.5,8.6-5,13-7.5
			c3-1.8,6.1-3.5,9.1-5.3c0.2-0.1,0.4-0.3,0.6-0.4c0-8.1,0-16.2,0-24.2c0-0.8,0-1.7,0-2.5c0,0,0,0,0-0.1c0,0,0-0.1,0-0.1
			c-1-0.6-5.2-3.1-5.7-3.3c-0.2,0.1-0.3,0.3-0.5,0.5c-0.9,0.9-1.8,1.8-2.7,2.8c-5.3,5.7-9.9,11.8-14.1,18.3
			c-3.4,5.2-6.4,10.5-9.2,16c-0.1,0.2-0.2,0.5-0.3,0.7c0.1,0.1,0.2,0.2,0.2,0.2C117,182.2,120,183.9,123,185.7 M199.1,141.8
			c7.7-4.4,15.3-8.8,22.9-13.2c0.1-0.1,0.2-0.1,0.4-0.2c0,0,0,0,0,0c0,0,0,0,0-0.1c0.1-0.8,0-7.4,0-8c-0.2-0.1-0.3-0.1-0.5-0.2
			c-1.8-0.5-3.7-0.9-5.5-1.3c-2.8-0.5-5.6-0.9-8.4-1.2c-2.4-0.2-4.8-0.3-7.2-0.3c-0.6,0-1.3,0-2,0.1c-2.7,0-5.4,0.2-8.1,0.4
			c-2.3,0.2-4.7,0.5-7,0.9c-2.5,0.4-5,1-7.5,1.7c-0.1,0-0.3,0.1-0.4,0.2c-0.1,1,0,7.1,0,7.8C183.5,132.8,191.3,137.3,199.1,141.8
			 M247.8,145.4c-0.7-0.5-22.7-13.2-23.2-13.4c0,0-0.1,0-0.1,0c-7.7,4.4-15.4,8.8-23,13.3c-0.1,0.1-0.2,0.1-0.3,0.2c0,0,0,0-0.1,0.1
			c0,0,0,0,0,0.1v26.6c0,0.1,0,0.1,0.1,0.1c0,0,0.1,0.1,0.1,0.1c7.5,4.3,14.9,8.6,22.4,12.9c0.2,0.1,0.5,0.2,0.7,0.4c0,0,0,0,0.1,0
			h0.1c7.6-4.4,15.2-8.8,22.9-13.2c0.1-0.1,0.2-0.1,0.3-0.2c0,0,0,0,0-0.1c0,0,0,0,0-0.1C247.8,163.3,247.8,154.3,247.8,145.4
			 M173.7,131.8c-7.8,4.5-15.6,9-23.3,13.4c0,0.1,0,0.1,0,0.2c0,0.1,0,0.3,0,0.4c0,8.8,0,17.5,0,26.2c0,0,0,0,0,0.1c0,0,0,0,0.1,0.1
			c7.7,4.5,15.5,9,23.3,13.5c0.2-0.1,0.4-0.3,0.6-0.4c3.3-1.9,6.6-3.8,9.9-5.7c4.1-2.3,8.2-4.7,12.2-7.1c0.2-0.1,0.4-0.2,0.6-0.4
			V146c0-0.2,0-0.3,0-0.4c0,0,0,0,0-0.1c0,0,0,0-0.1-0.1C189.3,140.9,181.5,136.4,173.7,131.8 M125.2,189.2c0,0.1-0.1,0.2-0.1,0.2
			c0,8.6,0,17.3,0,25.9c0,0.2,0,0.5,0,0.7c0,0,0,0,0,0.1c0,0,0,0,0,0.1c0,0,0.1,0.1,0.1,0.1c7.6,4.4,15.1,8.7,22.6,13.1
			c0.1,0.1,0.2,0.1,0.4,0.2c0,0,0,0,0.1,0c0,0,0.1,0,0.1,0c0.7-0.3,22.9-13.1,23.3-13.5v-26.9c-0.3-0.2-0.6-0.3-0.9-0.5
			c-4.3-2.5-8.5-4.9-12.8-7.4c-3-1.7-6-3.5-9.1-5.2c-0.2-0.1-0.4-0.3-0.7-0.3C140.6,180.2,132.9,184.7,125.2,189.2 M175.7,216.2
			c7.8,4.5,15.6,9,23.3,13.5c0.1,0,0.2,0,0.2-0.1c7.4-4.3,14.9-8.6,22.3-12.8c0.3-0.2,0.6-0.3,0.8-0.5c0,0,0,0,0.1,0c0,0,0,0,0-0.1
			c0-0.1,0-0.2,0-0.3c0-8.8,0-17.6,0-26.4c0,0,0,0,0-0.1c0,0,0,0,0-0.1c-1-0.6-22.8-13.2-23.3-13.4c-0.2,0.1-0.4,0.2-0.6,0.3
			c-5,2.9-10.1,5.8-15.2,8.8c-2.3,1.3-4.6,2.7-6.9,4c-0.2,0.1-0.5,0.2-0.7,0.5V216.2z M249.8,175.7c-7.8,4.5-15.5,9-23.3,13.4
			c-0.1,1-0.2,26.2-0.1,27c0,0,0.1,0.1,0.1,0.1c0.1,0.1,0.2,0.1,0.3,0.2c7.6,4.4,15.2,8.8,22.8,13.2c0,0,0,0,0.1,0c0,0,0,0,0.1,0
			c7.7-4.4,15.5-8.9,23.3-13.4c0-0.3,0-0.6,0-0.9c0-8.4,0-16.7,0-25.1c0-1.2,0.2-0.9-0.9-1.5c-6.6-3.8-13.1-7.6-19.7-11.4
			C251.7,176.8,250.7,176.3,249.8,175.7 M302.2,235.4c-0.2-0.1-0.4-0.3-0.6-0.4c-8.6-5-17.3-10-25.9-15c-0.2-0.1-0.5-0.2-0.7-0.4
			c-8.4,4.9-16.9,9.7-25.3,14.6c-8.4-4.9-16.8-9.7-25.3-14.6c-1.4,0.8-2.8,1.6-4.2,2.4c-1.4,0.8-2.8,1.6-4.3,2.5
			c-1.4,0.8-2.8,1.6-4.2,2.4c-1.4,0.8-2.8,1.6-4.2,2.4c-1.4,0.8-2.8,1.6-4.3,2.5c-1.4,0.8-2.8,1.6-4.2,2.4c-0.2-0.1-0.4-0.2-0.7-0.4
			c-5.1-2.9-10.1-5.9-15.2-8.8c-3-1.7-5.9-3.4-8.9-5.1c-0.2-0.1-0.4-0.2-0.7-0.4c-1.1,0.6-2.1,1.2-3.2,1.8c-1.1,0.6-2.1,1.2-3.2,1.8
			c-1.1,0.6-2.1,1.2-3.2,1.8c-1.1,0.6-2.1,1.2-3.2,1.8c-1,0.6-2.1,1.2-3.1,1.8c-1.1,0.6-2.1,1.2-3.2,1.8c-1.1,0.6-2.1,1.2-3.2,1.8
			c-1.1,0.6-2.1,1.2-3.2,1.8c-0.3-0.1-0.5-0.3-0.8-0.4c-7.9-4.6-15.9-9.2-23.8-13.7c-0.9-0.5-0.6-0.5-1.4,0
			c-4.2,2.2-8.5,4.4-12.7,6.6c-2.6,1.4-5.3,2.8-7.9,4.1c-0.1,0-0.2,0.1-0.3,0.1c-0.6-0.2-1.1-0.6-1.7-0.8c-0.6-0.3-1.2-0.6-1.7-0.9
			c-0.6-0.3-1.1-0.6-1.7-0.9c-0.6-0.3-1.2-0.6-1.7-0.9c-0.6-0.3-1.2-0.5-1.6-0.9c0.8-4.2,1.7-8.3,2.9-12.3
			c3.2-10.5,7.1-20.7,11.8-30.6c2.7-5.7,5.7-11.3,9-16.8c3.7-6.1,7.7-11.9,12.1-17.5c2.3-2.8,4.7-5.6,7.3-8.2
			c1.3-1.3,2.5-2.6,3.8-3.9c1.6-1.6,3.2-3,4.9-4.4c4.5-3.7,9.2-6.9,14.3-9.7c3.7-2,7.6-3.8,11.6-5c3.4-1,6.9-2,10.4-2.7
			c2-0.4,4-0.7,6-0.9c1.7-0.2,3.5-0.4,5.2-0.5c1.3-0.1,2.6-0.1,3.9-0.2c0.2,0,0.4,0,0.5-0.1h6.9c0.1,0,0.2,0.1,0.2,0.1
			c0.9,0.1,1.7,0.1,2.6,0.2c1.7,0.1,3.4,0.3,5.1,0.5c2.2,0.3,4.4,0.6,6.6,1.1c3.5,0.7,6.9,1.6,10.2,2.7c3.3,1.1,6.5,2.5,9.6,4.2
			c5.4,2.9,10.3,6.4,15,10.3c1.7,1.5,3.4,3,5,4.6c4,4.2,7.5,8.7,10.7,13.4c3.7,5.5,6.9,11.4,9.7,17.4c2.3,4.9,4.4,9.9,6.4,15
			c0.6,1.6,1.2,3.1,1.8,4.7c0.6,1.6,1.1,3.3,1.6,4.9c0.7,2,1.4,4,2.2,5.9c0.2,0.6,0.5,1.1,0.8,1.6c0.1,0.3,0.4,0.5,0.7,0.5
			c0.5,0.1,0.9,0.2,1.4,0.2c0.7,0,1.5,0,2.2-0.1c0.7-0.1,1.4-0.2,2.2-0.3c1.5-0.2,3.1-0.5,4.7-0.7v34.9c0,0.2,0,0.4,0,0.6
			L302.2,235.4L302.2,235.4z"/>
	</g>
	<g>
		<defs>
			<rect id="SVGID_7_" y="2.7" width="432" height="498.7"/>
		</defs>
		<clipPath id="SVGID_8_">
			<use xlink:href="#SVGID_7_"  style="overflow:visible;"/>
		</clipPath>
		<g class="st4">
			<g class="st5">
				<path class="st6" d="M71,360.2l1.7,2l45.2-22.7l10.1,11.6l-28.8,41.6l1.7,2l-6.4,5.6l-12.2-13.9l6.4-5.6l2.4,2.8l5.7-7.4
					L88.2,366l-8.2,4.6l2.6,3l-6.4,5.6l-11.6-13.3L71,360.2z M102,369.7l8.2-11.1c0.6-0.9,3.1-3.8,7.1-8.7c-5.5,3.2-9,5.1-10.1,5.8
					l-11.9,6.4L102,369.7z"/>
			</g>
		</g>
	</g>
	<g>
		<defs>
			<rect id="SVGID_9_" y="2.7" width="432" height="498.7"/>
		</defs>
		<clipPath id="SVGID_10_">
			<use xlink:href="#SVGID_9_"  style="overflow:visible;"/>
		</clipPath>
		<g class="st7">
			<g class="st5">
				<path class="st6" d="M110.6,402.1l2.8,1.7l22.2-36.1l-2.8-1.7l4.2-6.8l12.8,7.9l-11.2,18.2c3.5-1.8,6.6-1.8,9.6,0.1
					c6.5,4,6.2,10.3,0.2,20.1l-4.9,7.9c-5.7,9.3-11.8,12.1-17.5,8.6c-3.9-2.4-5.7-6.1-5.3-10.8l-3.1,5l-11.3-7L110.6,402.1z
					 M126.1,412c2.7,1.7,4.6-0.3,7.4-4.8l5.5-8.9c2.8-4.6,3.6-7.1,1.1-8.7c-2.3-1.4-5.2,0.4-8.2,5.2l-5,8.2
					C124,407.6,123.5,410.5,126.1,412z"/>
			</g>
		</g>
	</g>
	<g>
		<defs>
			<rect id="SVGID_11_" y="2.7" width="432" height="498.7"/>
		</defs>
		<clipPath id="SVGID_12_">
			<use xlink:href="#SVGID_11_"  style="overflow:visible;"/>
		</clipPath>
		<g class="st8">
			<g class="st5">
				<path class="st6" d="M177.3,397.6c9.9,2.9,14.1,9.8,11.3,19.2l-3.4,11.9c-2.7,9.5-9.9,13.1-19.8,10.2
					c-9.9-2.9-14.1-9.8-11.3-19.2l3.4-11.9C160.2,398.3,167.4,394.7,177.3,397.6z M177.8,412.5c1.2-4.1,0.3-6.5-2.6-7.4
					c-2.9-0.8-5.1,0.7-6.3,4.8l-4.1,14.1c-1.2,4.1-0.2,6.6,2.7,7.4c3,0.9,5-0.8,6.2-4.8L177.8,412.5z"/>
			</g>
		</g>
	</g>
	<g>
		<defs>
			<rect id="SVGID_13_" y="2.7" width="432" height="498.7"/>
		</defs>
		<clipPath id="SVGID_14_">
			<use xlink:href="#SVGID_13_"  style="overflow:visible;"/>
		</clipPath>
		<g class="st9">
			<g class="st5">
				<path class="st6" d="M221.7,438.4c-1.9,4.8-5.8,7.4-11.3,7.5c-8.2,0.1-11-4.5-11.2-14.6l-0.3-19l-3.3,0.1l-0.1-7.9l14.9-0.2
					l0.4,25.1c0.1,5.5,0.5,8.4,4.3,8.3c3.3-0.1,5.2-2.8,5.1-8.3l-0.3-17.4l-3.5,0.1l-0.1-7.9l15.2-0.2l0.5,32.8l2.9,0l0.1,8.2
					l-13.1,0.2L221.7,438.4z"/>
			</g>
		</g>
	</g>
	<g>
		<defs>
			<rect id="SVGID_15_" y="2.7" width="432" height="498.7"/>
		</defs>
		<clipPath id="SVGID_16_">
			<use xlink:href="#SVGID_15_"  style="overflow:visible;"/>
		</clipPath>
		<g class="st10">
			<g class="st5">
				<path class="st6" d="M243.4,409.7l-4.5,1.1l-1.9-7.7l4.6-1.1l-1.6-7.6l10.4-6.7l2.5,11.5l6.6-1.6l1.9,7.7l-6.7,1.6l4.1,18.4
					c0,0.2,0.1,0.3,0.1,0.4c1,4.3,2.6,5.5,6.2,4.6c0.6-0.1,1.3-0.3,2.2-0.6l2,8.1c-1.5,0.6-3.8,1.4-6.7,2.1
					c-8.7,2.1-12.5-0.9-14.7-9.7c-0.1-0.3-0.1-0.5-0.2-0.8L243.4,409.7z"/>
			</g>
		</g>
	</g>
	<g>
		<defs>
			<rect id="SVGID_17_" y="2.7" width="432" height="498.7"/>
		</defs>
		<clipPath id="SVGID_18_">
			<use xlink:href="#SVGID_17_"  style="overflow:visible;"/>
		</clipPath>
		<g class="st11">
			<text transform="matrix(0.9231 -0.3846 0.3846 0.9231 276.2539 435.1456)" class="st6 st12 st13"> </text>
		</g>
	</g>
	<g>
		<defs>
			<rect id="SVGID_19_" y="2.7" width="432" height="498.7"/>
		</defs>
		<clipPath id="SVGID_20_">
			<use xlink:href="#SVGID_19_"  style="overflow:visible;"/>
		</clipPath>
		<g class="st14">
			<g class="st5">
				<path class="st6" d="M278.5,381.3l-2.6,1.9l-4.8-6.7l15.1-10.9l4.8,6.7l-2.5,1.8l19.1,26.5c3.6,4.9,6.3,6.5,9.8,4
					c3.6-2.6,3.1-5.9-0.6-11.2l-18.9-26.2l-2.5,1.8l-4.8-6.7l14.1-10.1l4.8,6.7l-2.6,1.9l16.9,23.5c8.7,12,8.5,20.6-1.4,27.7
					c-10,7.2-18,5-26.2-6.3L278.5,381.3z"/>
			</g>
		</g>
	</g>
	<g>
		<defs>
			<rect id="SVGID_21_" y="2.7" width="432" height="498.7"/>
		</defs>
		<clipPath id="SVGID_22_">
			<use xlink:href="#SVGID_21_"  style="overflow:visible;"/>
		</clipPath>
		<g class="st15">
			<g class="st5">
				<path class="st6" d="M337.1,378.5l6.1-7.7c3.9,2.9,6.9,3.2,8.7,0.9c1.5-1.9,1.2-4-0.6-5.4c-3-2.4-5.8,0-11.3,2.5
					c-6.4,2.9-10.7,3.2-15-0.1c-5.4-4.3-6.2-10.5-2.1-15.6c2.8-3.5,5.9-5,9.2-4.4l-2.8-2.2l5.4-6.8l10.1,8l-6,7.5
					c-3.5-2.7-6.5-2.8-8-0.8c-1.4,1.7-1.2,3.6,0.6,5c2.9,2.3,5.9,0.2,11.3-2.4c6.2-3,10.5-3.4,15.4,0.5c5.7,4.5,6.5,11.2,2.3,16.6
					c-2.5,3.1-5.7,4.5-9.7,4.1l3.5,2.8l-5.5,6.9L337.1,378.5z"/>
			</g>
		</g>
	</g>
</g>
</svg>
