{
    "_links": {
        "self": {
            "href": "http:\/\/guts.local\/node\/10?_format=hal_json"
        },
        "type": {
            "href": "http:\/\/drupal.org\/rest\/type\/node\/resource"
        },
        "http:\/\/drupal.org\/rest\/relation\/node\/resource\/uid": [
            {
                "href": "http:\/\/guts.local\/user\/1?_format=hal_json",
                "lang": "en"
            }
        ],
        "http:\/\/drupal.org\/rest\/relation\/node\/resource\/revision_uid": [
            {
                "href": "http:\/\/guts.local\/user\/1?_format=hal_json"
            }
        ],
        "http:\/\/drupal.org\/rest\/relation\/node\/resource\/field_content_type": [
            {
                "href": "http:\/\/guts.local\/taxonomy_redirect\/term\/33?_format=hal_json"
            }
        ],
        "http:\/\/drupal.org\/rest\/relation\/node\/resource\/field_curricular_area": [
            {
                "href": "http:\/\/guts.local\/taxonomy_redirect\/term\/15?_format=hal_json"
            }
        ],
        "http:\/\/drupal.org\/rest\/relation\/node\/resource\/field_education_level": [
            {
                "href": "http:\/\/guts.local\/taxonomy_redirect\/term\/22?_format=hal_json"
            }
        ],
        "http:\/\/drupal.org\/rest\/relation\/node\/resource\/field_tools": [
            {
                "href": "http:\/\/guts.local\/taxonomy_redirect\/term\/45?_format=hal_json"
            }
        ]
    },
    "nid": [
        {
            "value": "10"
        }
    ],
    "uuid": [
        {
            "value": "71cbc253-a574-4280-814b-86edb783c411"
        }
    ],
    "vid": [
        {
            "value": "10"
        }
    ],
    "langcode": [
        {
            "value": "en",
            "lang": "en"
        }
    ],
    "type": [
        {
            "target_id": "resource"
        }
    ],
    "title": [
        {
            "value": "An example link resource",
            "lang": "en"
        }
    ],
    "_embedded": {
        "http:\/\/drupal.org\/rest\/relation\/node\/resource\/uid": [
            {
                "_links": {
                    "self": {
                        "href": "http:\/\/guts.local\/user\/1?_format=hal_json"
                    },
                    "type": {
                        "href": "http:\/\/drupal.org\/rest\/type\/user\/user"
                    }
                },
                "uuid": [
                    {
                        "value": "56e42a6a-7bd6-4fb8-ad95-33c35c3637d3"
                    }
                ],
                "lang": "en"
            }
        ],
        "http:\/\/drupal.org\/rest\/relation\/node\/resource\/revision_uid": [
            {
                "_links": {
                    "self": {
                        "href": "http:\/\/guts.local\/user\/1?_format=hal_json"
                    },
                    "type": {
                        "href": "http:\/\/drupal.org\/rest\/type\/user\/user"
                    }
                },
                "uuid": [
                    {
                        "value": "56e42a6a-7bd6-4fb8-ad95-33c35c3637d3"
                    }
                ]
            }
        ],
        "http:\/\/drupal.org\/rest\/relation\/node\/resource\/field_content_type": [
            {
                "_links": {
                    "self": {
                        "href": "http:\/\/guts.local\/taxonomy_redirect\/term\/33?_format=hal_json"
                    },
                    "type": {
                        "href": "http:\/\/drupal.org\/rest\/type\/taxonomy_term\/content_type"
                    }
                },
                "uuid": [
                    {
                        "value": "9a4c7917-4eaa-42e8-b63f-bfb76d2e2c39"
                    }
                ]
            }
        ],
        "http:\/\/drupal.org\/rest\/relation\/node\/resource\/field_curricular_area": [
            {
                "_links": {
                    "self": {
                        "href": "http:\/\/guts.local\/taxonomy_redirect\/term\/15?_format=hal_json"
                    },
                    "type": {
                        "href": "http:\/\/drupal.org\/rest\/type\/taxonomy_term\/curricular_area"
                    }
                },
                "uuid": [
                    {
                        "value": "14b4724a-3b72-49d7-b813-051aa0b284c8"
                    }
                ]
            }
        ],
        "http:\/\/drupal.org\/rest\/relation\/node\/resource\/field_education_level": [
            {
                "_links": {
                    "self": {
                        "href": "http:\/\/guts.local\/taxonomy_redirect\/term\/22?_format=hal_json"
                    },
                    "type": {
                        "href": "http:\/\/drupal.org\/rest\/type\/taxonomy_term\/education_level"
                    }
                },
                "uuid": [
                    {
                        "value": "035723b0-28e7-4670-b5b9-2527a2e6d86f"
                    }
                ]
            }
        ],
        "http:\/\/drupal.org\/rest\/relation\/node\/resource\/field_tools": [
            {
                "_links": {
                    "self": {
                        "href": "http:\/\/guts.local\/taxonomy_redirect\/term\/45?_format=hal_json"
                    },
                    "type": {
                        "href": "http:\/\/drupal.org\/rest\/type\/taxonomy_term\/tools"
                    }
                },
                "uuid": [
                    {
                        "value": "73e6635b-a950-4b0e-84a0-227239e1a6b4"
                    }
                ]
            }
        ]
    },
    "status": [
        {
            "value": "1",
            "lang": "en"
        }
    ],
    "created": [
        {
            "value": "1467592010",
            "lang": "en"
        }
    ],
    "changed": [
        {
            "value": "1467592086",
            "lang": "en"
        }
    ],
    "promote": [
        {
            "value": "1",
            "lang": "en"
        }
    ],
    "sticky": [
        {
            "value": "0",
            "lang": "en"
        }
    ],
    "revision_timestamp": [
        {
            "value": "1467592086"
        }
    ],
    "revision_translation_affected": [
        {
            "value": "1",
            "lang": "en"
        }
    ],
    "default_langcode": [
        {
            "value": "1",
            "lang": "en"
        }
    ],
    "body": [
        {
            "value": "<p>This resource will link to a web site.<\/p>\r\n",
            "format": "full_html",
            "summary": "",
            "lang": "en"
        }
    ],
    "field_links": [
        {
            "uri": "http:\/\/example.com\/",
            "title": "Example.com",
            "options": []
        }
    ]
}