{
    "_links": {
        "self": {
            "href": "http:\/\/guts.local\/taxonomy\/term\/206?_format=hal_json"
        },
        "type": {
            "href": "http:\/\/drupal.org\/rest\/type\/taxonomy_term\/languages"
        }
    },
    "tid": [
        {
            "value": "206"
        }
    ],
    "uuid": [
        {
            "value": "6a49321a-cfcd-46e1-8d17-1e3dc94d2b14"
        }
    ],
    "langcode": [
        {
            "value": "en",
            "lang": "en"
        }
    ],
    "vid": [
        {
            "target_id": "languages"
        }
    ],
    "name": [
        {
            "value": "French",
            "lang": "en"
        }
    ],
    "weight": [
        {
            "value": "0"
        }
    ],
    "changed": [
        {
            "value": "1490185762",
            "lang": "en"
        }
    ],
    "default_langcode": [
        {
            "value": "1",
            "lang": "en"
        }
    ]
}