{
    "_links": {
        "self": {
            "href": "http:\/\/guts.local\/block\/15?_format=hal_json"
        },
        "type": {
            "href": "http:\/\/drupal.org\/rest\/type\/block_content\/basic"
        }
    },
    "id": [
        {
            "value": 15
        }
    ],
    "uuid": [
        {
            "value": "f3a251a9-1e84-487d-9cc6-3196c0fd6bec"
        }
    ],
    "revision_id": [
        {
            "value": 16
        }
    ],
    "langcode": [
        {
            "value": "en",
            "lang": "en"
        }
    ],
    "type": [
        {
            "target_id": "basic"
        }
    ],
    "info": [
        {
            "value": "Join the Mailing List",
            "lang": "en"
        }
    ],
    "changed": [
        {
            "value": 1502310117,
            "lang": "en"
        }
    ],
    "revision_created": [
        {
            "value": 1502310117
        }
    ],
    "revision_translation_affected": [
        {
            "value": true,
            "lang": "en"
        }
    ],
    "default_langcode": [
        {
            "value": true,
            "lang": "en"
        }
    ],
    "body": [
        {
            "value": "<p>Get notified about upcoming events by signing up for our Quarterly Newsletter.&nbsp;<\/p>\r\n\r\n<p>Check out previous issues of our TWIG newsletter or sign up below.<\/p>\r\n",
            "format": "full_html",
            "summary": "",
            "lang": "en"
        }
    ]
}