{
    "_links": {
        "self": {
            "href": "http:\/\/guts.local\/user\/2?_format=hal_json"
        },
        "type": {
            "href": "http:\/\/drupal.org\/rest\/type\/user\/user"
        }
    },
    "uuid": [
        {
            "value": "9aa571a8-de6b-49f9-a4e3-bb71cbab36b8"
        }
    ],
    "langcode": [
        {
            "value": "en",
            "lang": "en"
        }
    ],
    "name": [
        {
            "value": "connie"
        }
    ],
    "created": [
        {
            "value": "1465429073"
        }
    ],
    "changed": [
        {
            "value": "1465429073",
            "lang": "en"
        }
    ],
    "default_langcode": [
        {
            "value": "1",
            "lang": "en"
        }
    ],
    "field_email_frequency": [
        {
            "value": "immediate"
        }
    ],
    "field_first_name": [
        {
            "value": "Connie"
        }
    ],
    "field_last_name": [
        {
            "value": "Editor"
        }
    ],
    "field_roles": [
        {
            "value": "Curriculum developer"
        }
    ]
}