<?xml version="1.0" encoding="utf-8"?>
<!-- Generator: Adobe Illustrator 21.0.0, SVG Export Plug-In . SVG Version: 6.00 Build 0)  -->
<svg version="1.1" id="Layer_1" xmlns="http://www.w3.org/2000/svg" xmlns:xlink="http://www.w3.org/1999/xlink" x="0px" y="0px"
	 viewBox="0 0 100 100" style="enable-background:new 0 0 100 100;" xml:space="preserve">
<style type="text/css">
	.st0{clip-path:url(#SVGID_2_);fill:#9D1C52;}
	.st1{clip-path:url(#SVGID_2_);fill:none;stroke:#000000;stroke-width:2;stroke-miterlimit:10;}
	.st2{clip-path:url(#SVGID_2_);}
	.st3{clip-path:url(#SVGID_2_);fill:#FFFFFF;}
	.st4{fill:#52564B;}
</style>
<g>
	<defs>
		<rect id="SVGID_1_" x="-10" y="-5" width="120.4" height="120.4"/>
	</defs>
	<clipPath id="SVGID_2_">
		<use xlink:href="#SVGID_1_"  style="overflow:visible;"/>
	</clipPath>
	<path class="st0" d="M50.2,98.2c21.3,0,38.5-17.2,38.5-38.5S71.5,21.2,50.2,21.2S11.7,38.4,11.7,59.7S28.9,98.2,50.2,98.2"/>
	<circle class="st1" cx="50.2" cy="59.7" r="38.5"/>
	<path class="st2" d="M45.4,56.7c-11.8,1.5-15.9,18-16,18.5c-0.1,0.5-0.2,0.9-0.2,0.9l1.2,0.6c0,0.2-0.8,2.1-2.1,2.8
		c-1.3,0.7-2.8,0.3-2.8,0.3s-0.4-0.1-0.5,0c-0.3,0.3,0,0.7,0,0.7s1.2,1,3.1,1.2c2.1,0.3,4.7-1,4.7-1s-0.5,1.8-0.5,2.9
		c-0.1,1,1.1,1.3,1.1,1.3s1.9,0.3,3.2,0.5c0.9,0.1,3.9,0.6,4.2-0.3c0.2-0.6,0.4-3.4,0.4-3.4s1.5,0.2,3.2,0c1.7-0.2,3.6-1.4,3.6-1.4
		s1.9,1.3,3.6,1.6c1.7,0.3,3.2-0.1,3.2-0.1s0,0.4,0.3,2.5c0.1,1.3,1.4,1.1,1.4,1.1s5-0.6,6.8-1c0.9-0.2,0.3-2.7,0.3-2.7L63,80
		c0,0,2.9,0.9,7-1c2.7-1.3,4.1-4.6,4.1-4.6s1,0,2.4-0.4c1.5-0.4,3-1.3,3.1-4.4c0,0,0,0,0,0v-0.1c0-2.9-3-5.2-5.2-5.5
		c-2.3-0.4-3.7,0.9-4.3,1.9c-0.7,1.2-1.5,5.4-2.1,6.1c-0.5,0.7-2.1,0.7-2.1,0.7s-0.3,0.1-0.3-0.1l0-0.4c0,0-1.3,0.3-1.6,0
		c-0.3-0.3-1.1-2.6-1.1-2.6c-1.9-5-5.3-12.9-15-12.9C47.1,56.5,46.2,56.6,45.4,56.7"/>
	<path class="st3" d="M42.8,57.7c-0.1,0-0.1,0-0.1,0c-0.5,0.2-1.1,0.4-1.6,0.7c-0.9,0.4-1.6,1-2.4,1.6c-0.3,0.2-0.6,0.5-0.9,0.8
		c0,0-0.1,0-0.1,0.1c0.3,0.2,0.6,0.3,0.8,0.5c0.4-0.2,0.7-0.4,1.1-0.6s0.7-0.4,1.1-0.6c0.4-0.2,0.7-0.4,1.1-0.6
		c0.4-0.2,0.7-0.4,1.1-0.6V57.7z M57.7,60.8c-0.1-0.1-0.1-0.1-0.2-0.2c-0.6-0.6-1.3-1.1-2.1-1.6c-0.6-0.4-1.3-0.8-2-1.1
		c-0.2-0.1-0.5-0.2-0.7-0.3c0,0-0.1,0-0.1,0v1.2c0.1,0.1,4.1,2.4,4.2,2.4C57.2,61.1,57.5,61,57.7,60.8 M65.7,72.6
		C65.7,72.6,65.7,72.6,65.7,72.6c-0.2,0-0.4,0.1-0.5,0.1c-0.3,0-0.5,0-0.8,0c-0.1,0-0.2-0.1-0.3-0.1c-0.2-0.1-0.3-0.2-0.4-0.4
		c-0.1-0.2-0.1-0.3-0.2-0.5c-0.2-0.5-0.4-1.1-0.6-1.7c-0.1-0.2-0.1-0.4-0.2-0.6c0,0,0-0.1,0-0.1c-0.1,0-0.8,0.4-0.9,0.5
		c0,0,0,0,0,0.1c0,1.6,0,3.2,0,4.8c0,0,0,0,0,0c0,0,0,0,0,0c1.3,0.7,2.5,1.5,3.8,2.2c0,0,0,0,0,0c0-0.1,0-2.7,0-4.2
		C65.7,72.7,65.7,72.7,65.7,72.6 M30.1,76.6c0.2-0.1,0.3-0.2,0.5-0.3c1-0.5,1.9-1,2.9-1.5c0.1-0.1,0.1,0,0.1-0.2c0-1.5,0-3.1,0-4.6
		v-0.1c-0.1-0.1-1.5-0.9-1.6-1c0,0-0.1,0.1-0.1,0.2c-0.8,1.6-1.4,3.3-2,5c-0.2,0.6-0.4,1.3-0.5,1.9c0,0.1,0,0.1,0,0.2
		C29.4,76.3,29.9,76.5,30.1,76.6 M57.3,66.8c0.1,0.1,4.1,2.4,4.2,2.4c0.2-0.1,0.9-0.5,1-0.6c0,0,0-0.1,0-0.1c-0.4-1-0.9-2.1-1.4-3.1
		c-0.5-0.9-1-1.8-1.6-2.6c-0.4-0.5-0.7-1-1.1-1.4c0,0-0.1-0.1-0.1-0.1c-0.3,0.2-0.7,0.4-1,0.6C57.3,62.1,57.3,66.6,57.3,66.8
		 M34,69.2c0,0,0.1,0,0.1-0.1c0.8-0.5,1.6-0.9,2.3-1.4c0.5-0.3,1.1-0.6,1.7-1c0,0,0.1,0,0.1-0.1c0-1.5,0-2.9,0-4.4
		c0-0.2,0-0.3,0-0.5c0,0,0,0,0,0c0,0,0,0,0,0c-0.2-0.1-0.9-0.6-1-0.6c0,0-0.1,0.1-0.1,0.1c-0.2,0.2-0.3,0.3-0.5,0.5
		c-1,1-1.8,2.1-2.6,3.3c-0.6,0.9-1.2,1.9-1.7,2.9c0,0,0,0.1-0.1,0.1c0,0,0,0,0,0C32.9,68.6,33.4,68.9,34,69.2 M47.7,61.3
		c1.4-0.8,2.8-1.6,4.1-2.4c0,0,0,0,0.1,0c0,0,0,0,0,0c0,0,0,0,0,0c0-0.1,0-1.3,0-1.4c0,0-0.1,0-0.1,0c-0.3-0.1-0.7-0.2-1-0.2
		c-0.5-0.1-1-0.2-1.5-0.2c-0.4,0-0.9,0-1.3-0.1c-0.1,0-0.2,0-0.4,0c-0.5,0-1,0-1.5,0.1c-0.4,0-0.8,0.1-1.3,0.2
		c-0.5,0.1-0.9,0.2-1.3,0.3c0,0-0.1,0-0.1,0c0,0.2,0,1.3,0,1.4C44.9,59.7,46.3,60.5,47.7,61.3 M56.5,61.9c-0.1-0.1-4.1-2.4-4.2-2.4
		c0,0,0,0,0,0c-1.4,0.8-2.8,1.6-4.2,2.4c0,0,0,0-0.1,0c0,0,0,0,0,0c0,0,0,0,0,0v4.8c0,0,0,0,0,0c0,0,0,0,0,0
		c1.3,0.8,2.7,1.6,4.1,2.3c0,0,0.1,0,0.1,0.1c0,0,0,0,0,0c0,0,0,0,0,0c1.4-0.8,2.8-1.6,4.1-2.4c0,0,0,0,0.1,0c0,0,0,0,0,0
		c0,0,0,0,0,0C56.5,65.2,56.5,63.5,56.5,61.9 M43.1,59.5c-1.4,0.8-2.8,1.6-4.2,2.4c0,0,0,0,0,0c0,0,0,0.1,0,0.1c0,1.6,0,3.2,0,4.7
		c0,0,0,0,0,0c0,0,0,0,0,0c1.4,0.8,2.8,1.6,4.2,2.4c0,0,0.1,0,0.1-0.1c0.6-0.3,1.2-0.7,1.8-1c0.7-0.4,1.5-0.9,2.2-1.3
		c0,0,0.1,0,0.1-0.1V62c0,0,0-0.1,0-0.1c0,0,0,0,0,0c0,0,0,0,0,0C46,61.1,44.6,60.3,43.1,59.5 M34.4,69.8
		C34.4,69.9,34.4,69.9,34.4,69.8c0,1.6,0,3.2,0,4.7c0,0,0,0.1,0,0.1c0,0,0,0,0,0c0,0,0,0,0,0c0,0,0,0,0,0c1.4,0.8,2.7,1.6,4.1,2.4
		c0,0,0,0,0.1,0c0,0,0,0,0,0c0,0,0,0,0,0c0.1-0.1,4.1-2.4,4.2-2.4v-4.9c-0.1,0-0.1-0.1-0.2-0.1c-0.8-0.4-1.5-0.9-2.3-1.3
		c-0.5-0.3-1.1-0.6-1.6-0.9c0,0-0.1-0.1-0.1-0.1C37.2,68.2,35.8,69,34.4,69.8 M43.5,74.7c1.4,0.8,2.8,1.6,4.2,2.4c0,0,0,0,0,0
		c1.3-0.8,2.7-1.5,4-2.3c0.1,0,0.1-0.1,0.2-0.1c0,0,0,0,0,0c0,0,0,0,0,0c0,0,0,0,0-0.1c0-1.6,0-3.2,0-4.8c0,0,0,0,0,0c0,0,0,0,0,0
		c-0.2-0.1-4.1-2.4-4.2-2.4c0,0-0.1,0-0.1,0.1c-0.9,0.5-1.8,1.1-2.7,1.6c-0.4,0.2-0.8,0.5-1.2,0.7c0,0-0.1,0-0.1,0.1V74.7z
		 M56.9,67.4c-1.4,0.8-2.8,1.6-4.2,2.4c0,0.2,0,4.7,0,4.9c0,0,0,0,0,0c0,0,0,0,0.1,0c1.4,0.8,2.8,1.6,4.1,2.4c0,0,0,0,0,0
		c0,0,0,0,0,0c1.4-0.8,2.8-1.6,4.2-2.4c0-0.1,0-0.1,0-0.2c0-1.5,0-3,0-4.5c0-0.2,0-0.2-0.2-0.3c-1.2-0.7-2.4-1.4-3.6-2.1
		C57.2,67.6,57.1,67.5,56.9,67.4 M66.4,78.2c0,0-4.9-2.8-4.9-2.9c-1.5,0.9-3.1,1.8-4.6,2.6c-1.5-0.9-3-1.8-4.6-2.6
		c-0.3,0.1-4.3,2.5-4.6,2.6c0,0-0.1,0-0.1-0.1c-0.9-0.5-4.4-2.6-4.5-2.6c-0.2,0.1-4.4,2.5-4.6,2.6c0,0-0.1-0.1-0.1-0.1
		c-1.4-0.8-2.9-1.7-4.3-2.5c-0.2-0.1-0.1-0.1-0.3,0c-0.8,0.4-1.5,0.8-2.3,1.2c-0.5,0.2-1,0.5-1.4,0.7c0,0,0,0-0.1,0
		c-0.1,0-0.2-0.1-0.3-0.2c-0.1-0.1-0.2-0.1-0.3-0.2c-0.1-0.1-0.2-0.1-0.3-0.2c-0.1-0.1-0.2-0.1-0.3-0.2c-0.1-0.1-0.2-0.1-0.3-0.2
		c0.1-0.8,0.3-1.5,0.5-2.2c0.6-1.9,1.3-3.7,2.1-5.5c0.5-1,1-2.1,1.6-3c0.7-1.1,1.4-2.2,2.2-3.2c0.4-0.5,0.9-1,1.3-1.5
		c0.2-0.2,0.5-0.5,0.7-0.7c0.3-0.3,0.6-0.5,0.9-0.8c0.8-0.7,1.7-1.3,2.6-1.8c0.7-0.4,1.4-0.7,2.1-0.9c0.6-0.2,1.2-0.4,1.9-0.5
		c0.4-0.1,0.7-0.1,1.1-0.2c0.3,0,0.6-0.1,0.9-0.1c0.2,0,0.5,0,0.7,0c0,0,0.1,0,0.1,0h1.2c0,0,0,0,0,0c0.2,0,0.3,0,0.5,0
		c0.3,0,0.6,0.1,0.9,0.1c0.4,0,0.8,0.1,1.2,0.2c0.6,0.1,1.2,0.3,1.9,0.5c0.6,0.2,1.2,0.5,1.7,0.8c1,0.5,1.9,1.2,2.7,1.9
		c0.3,0.3,0.6,0.5,0.9,0.8c0.7,0.8,1.4,1.6,1.9,2.4c0.7,1,1.2,2.1,1.8,3.1c0.4,0.9,0.8,1.8,1.2,2.7c0.1,0.3,0.2,0.6,0.3,0.8
		c0.1,0.3,0.2,0.6,0.3,0.9c0.1,0.4,0.3,0.7,0.4,1.1c0,0.1,0.1,0.2,0.1,0.3c0,0.1,0.1,0.1,0.1,0.1c0.1,0,0.2,0,0.2,0
		c0.1,0,0.3,0,0.4,0c0.1,0,0.3,0,0.4-0.1c0.3,0,0.6-0.1,0.8-0.1C66.4,73.9,66.4,78.2,66.4,78.2C66.4,78.2,66.4,78.2,66.4,78.2"/>
	<path class="st2" d="M46,34.2C36,35.5,32.4,49.6,32.3,50c-0.1,0.4-0.2,0.8-0.2,0.8l1,0.6c0,0.2-0.7,1.8-1.8,2.4
		c-1.1,0.6-2.4,0.2-2.4,0.2s-0.3-0.1-0.4,0c-0.3,0.3,0,0.6,0,0.6s1,0.8,2.6,1.1c1.8,0.2,4-0.9,4-0.9s-0.4,1.6-0.5,2.5
		c-0.1,0.9,0.9,1.1,0.9,1.1s1.7,0.3,2.7,0.4c0.7,0.1,3.3,0.5,3.6-0.3c0.2-0.5,0.3-2.9,0.3-2.9s1.3,0.2,2.7,0
		c1.5-0.2,3.1-1.2,3.1-1.2s1.6,1.1,3,1.4c1.5,0.2,2.8-0.1,2.8-0.1s0,0.3,0.2,2.2c0.1,1.1,1.2,0.9,1.2,0.9s4.3-0.5,5.8-0.9
		c0.8-0.2,0.2-2.3,0.2-2.3L61,54.1c0,0,2.5,0.8,6-0.9c2.3-1.1,3.5-3.9,3.5-3.9s0.8,0,2.1-0.4c1.2-0.4,2.6-1.1,2.6-3.8c0,0,0,0,0,0
		v-0.1c0-2.5-2.5-4.4-4.5-4.7c-1.9-0.3-3.2,0.8-3.7,1.6c-0.6,1-1.3,4.6-1.8,5.2c-0.5,0.6-1.8,0.6-1.8,0.6s-0.3,0.1-0.3-0.1l0-0.3
		c0,0-1.1,0.3-1.4,0c-0.2-0.2-0.9-2.2-0.9-2.2c-1.6-4.3-4.5-11-12.8-11C47.5,34.1,46.7,34.1,46,34.2"/>
	<path class="st3" d="M43.8,35c0,0-0.1,0-0.1,0c-0.5,0.2-0.9,0.3-1.3,0.6c-0.7,0.4-1.4,0.8-2.1,1.3c-0.3,0.2-0.5,0.4-0.8,0.7
		c0,0,0,0,0,0.1c0.2,0.1,0.5,0.3,0.7,0.4c0.3-0.2,0.6-0.3,0.9-0.5c0.3-0.2,0.6-0.3,0.9-0.5c0.3-0.2,0.6-0.3,0.9-0.5
		c0.3-0.2,0.6-0.3,0.9-0.5V35z M56.6,37.7c-0.1-0.1-0.1-0.1-0.2-0.2c-0.5-0.5-1.1-1-1.8-1.4c-0.5-0.4-1.1-0.7-1.7-0.9
		c-0.2-0.1-0.4-0.1-0.6-0.2c0,0-0.1,0-0.1,0v1c0.1,0.1,3.5,2,3.6,2.1C56.1,38,56.3,37.9,56.6,37.7 M63.3,47.8
		C63.3,47.8,63.3,47.8,63.3,47.8c-0.2,0-0.3,0-0.4,0.1c-0.2,0-0.4,0-0.7,0c-0.1,0-0.2,0-0.2-0.1c-0.1-0.1-0.2-0.2-0.3-0.3
		c-0.1-0.1-0.1-0.3-0.2-0.4c-0.2-0.5-0.3-0.9-0.5-1.4c-0.1-0.2-0.1-0.3-0.2-0.5c0,0,0-0.1,0-0.1c-0.1,0-0.7,0.4-0.8,0.4
		c0,0,0,0,0,0.1c0,1.4,0,2.7,0,4.1c0,0,0,0,0,0c0,0,0,0,0,0c1.1,0.6,2.2,1.2,3.2,1.9c0,0,0,0,0,0c0-0.1,0-2.3,0-3.6
		C63.4,47.9,63.4,47.8,63.3,47.8 M33,51.2c0.1-0.1,0.3-0.2,0.4-0.2c0.8-0.4,1.6-0.9,2.5-1.3c0.1-0.1,0.1,0,0.1-0.2
		c0-1.3,0-2.6,0-3.9v-0.1c-0.1-0.1-1.3-0.8-1.4-0.8c0,0-0.1,0.1-0.1,0.1c-0.7,1.4-1.2,2.8-1.7,4.2c-0.2,0.5-0.3,1.1-0.5,1.7
		c0,0.1,0,0.1,0,0.2C32.4,50.9,32.8,51.1,33,51.2 M56.1,42.8c0.1,0.1,3.5,2,3.6,2.1c0.2-0.1,0.8-0.4,0.8-0.5c0,0,0-0.1,0-0.1
		c-0.4-0.9-0.7-1.8-1.2-2.6c-0.4-0.8-0.8-1.5-1.3-2.2c-0.3-0.4-0.6-0.8-1-1.2c0,0,0-0.1-0.1-0.1c-0.3,0.2-0.6,0.3-0.8,0.5
		C56.1,38.8,56.1,42.7,56.1,42.8 M36.3,44.9C36.3,44.9,36.3,44.9,36.3,44.9c0.8-0.4,1.4-0.8,2.1-1.2c0.5-0.3,0.9-0.5,1.4-0.8
		c0,0,0.1,0,0.1-0.1c0-1.3,0-2.5,0-3.7c0-0.1,0-0.3,0-0.4c0,0,0,0,0,0c0,0,0,0,0,0c-0.1-0.1-0.8-0.5-0.9-0.5c0,0,0,0-0.1,0.1
		c-0.1,0.1-0.3,0.3-0.4,0.4c-0.8,0.9-1.5,1.8-2.2,2.8c-0.5,0.8-1,1.6-1.4,2.5c0,0,0,0.1,0,0.1c0,0,0,0,0,0
		C35.3,44.4,35.8,44.6,36.3,44.9 M48,38.1c1.2-0.7,2.4-1.4,3.5-2c0,0,0,0,0.1,0c0,0,0,0,0,0c0,0,0,0,0,0c0-0.1,0-1.1,0-1.2
		c0,0,0,0-0.1,0c-0.3-0.1-0.6-0.1-0.9-0.2c-0.4-0.1-0.9-0.1-1.3-0.2c-0.4,0-0.7,0-1.1-0.1c-0.1,0-0.2,0-0.3,0c-0.4,0-0.8,0-1.3,0.1
		c-0.4,0-0.7,0.1-1.1,0.1c-0.4,0.1-0.8,0.2-1.2,0.3c0,0,0,0-0.1,0c0,0.2,0,1.1,0,1.2C45.6,36.8,46.8,37.5,48,38.1 M55.5,38.7
		c-0.1-0.1-3.5-2-3.6-2.1c0,0,0,0,0,0c-1.2,0.7-2.4,1.4-3.6,2c0,0,0,0,0,0c0,0,0,0,0,0c0,0,0,0,0,0v4.1c0,0,0,0,0,0c0,0,0,0,0,0
		c1.2,0.7,2.3,1.3,3.5,2c0,0,0.1,0,0.1,0.1c0,0,0,0,0,0c0,0,0,0,0,0c1.2-0.7,2.4-1.4,3.5-2c0,0,0,0,0,0c0,0,0,0,0,0c0,0,0,0,0,0
		C55.5,41.4,55.5,40.1,55.5,38.7 M44.1,36.6c-1.2,0.7-2.4,1.4-3.6,2.1c0,0,0,0,0,0c0,0,0,0,0,0.1c0,1.3,0,2.7,0,4c0,0,0,0,0,0
		c0,0,0,0,0,0c1.2,0.7,2.4,1.4,3.6,2.1c0,0,0.1,0,0.1-0.1c0.5-0.3,1-0.6,1.5-0.9c0.6-0.4,1.3-0.7,1.9-1.1c0,0,0.1,0,0.1-0.1
		c0-1.3,0-2.7,0-4c0,0,0,0,0-0.1c0,0,0,0,0,0c0,0,0,0,0,0C46.5,38,45.3,37.3,44.1,36.6 M36.6,45.4C36.6,45.5,36.6,45.5,36.6,45.4
		c0,1.4,0,2.7,0,4c0,0,0,0.1,0,0.1c0,0,0,0,0,0c0,0,0,0,0,0c0,0,0,0,0,0c1.2,0.7,2.3,1.3,3.5,2c0,0,0,0,0.1,0c0,0,0,0,0,0
		c0,0,0,0,0,0c0.1,0,3.5-2,3.6-2.1v-4.1c0,0-0.1-0.1-0.1-0.1c-0.7-0.4-1.3-0.8-2-1.1c-0.5-0.3-0.9-0.5-1.4-0.8c0,0-0.1,0-0.1,0
		C39,44.1,37.8,44.8,36.6,45.4 M44.4,49.6c1.2,0.7,2.4,1.4,3.6,2.1c0,0,0,0,0,0c1.1-0.7,2.3-1.3,3.4-2c0,0,0.1-0.1,0.1-0.1
		c0,0,0,0,0,0c0,0,0,0,0,0c0,0,0,0,0,0c0-1.4,0-2.7,0-4.1c0,0,0,0,0,0c0,0,0,0,0,0c-0.2-0.1-3.5-2-3.6-2.1c0,0-0.1,0-0.1,0.1
		c-0.8,0.5-1.6,0.9-2.3,1.3c-0.4,0.2-0.7,0.4-1.1,0.6c0,0-0.1,0-0.1,0.1V49.6z M55.8,43.4c-1.2,0.7-2.4,1.4-3.6,2.1c0,0.2,0,4,0,4.2
		c0,0,0,0,0,0c0,0,0,0,0,0c1.2,0.7,2.3,1.4,3.5,2c0,0,0,0,0,0c0,0,0,0,0,0c1.2-0.7,2.4-1.4,3.6-2.1c0,0,0-0.1,0-0.1
		c0-1.3,0-2.6,0-3.9c0-0.2,0-0.1-0.1-0.2c-1-0.6-2-1.2-3-1.8C56.1,43.5,56,43.5,55.8,43.4 M63.9,52.6c0,0-4.2-2.4-4.2-2.4
		c-1.3,0.8-2.6,1.5-3.9,2.3c-1.3-0.8-2.6-1.5-3.9-2.3c-0.2,0.1-3.7,2.1-3.9,2.3c0,0-0.1,0-0.1-0.1c-0.8-0.5-3.8-2.2-3.8-2.2
		c-0.2,0.1-3.7,2.1-3.9,2.2c0,0-0.1,0-0.1-0.1c-1.2-0.7-2.4-1.4-3.7-2.1c-0.1-0.1-0.1-0.1-0.2,0c-0.7,0.3-1.3,0.7-2,1
		c-0.4,0.2-0.8,0.4-1.2,0.6c0,0,0,0,0,0c-0.1,0-0.2-0.1-0.3-0.1c-0.1,0-0.2-0.1-0.3-0.1c-0.1,0-0.2-0.1-0.3-0.1
		c-0.1,0-0.2-0.1-0.3-0.1c-0.1,0-0.2-0.1-0.3-0.1c0.1-0.6,0.3-1.3,0.5-1.9c0.5-1.6,1.1-3.2,1.8-4.7c0.4-0.9,0.9-1.8,1.4-2.6
		c0.6-0.9,1.2-1.8,1.9-2.7c0.4-0.4,0.7-0.9,1.1-1.3c0.2-0.2,0.4-0.4,0.6-0.6c0.2-0.2,0.5-0.5,0.8-0.7c0.7-0.6,1.4-1.1,2.2-1.5
		c0.6-0.3,1.2-0.6,1.8-0.8c0.5-0.2,1.1-0.3,1.6-0.4c0.3-0.1,0.6-0.1,0.9-0.1c0.3,0,0.5-0.1,0.8-0.1c0.2,0,0.4,0,0.6,0
		c0,0,0.1,0,0.1,0h1.1c0,0,0,0,0,0c0.1,0,0.3,0,0.4,0c0.3,0,0.5,0,0.8,0.1c0.3,0,0.7,0.1,1,0.2c0.5,0.1,1.1,0.3,1.6,0.4
		c0.5,0.2,1,0.4,1.5,0.6c0.8,0.4,1.6,1,2.3,1.6c0.3,0.2,0.5,0.5,0.8,0.7c0.6,0.6,1.2,1.3,1.7,2.1c0.6,0.9,1.1,1.8,1.5,2.7
		c0.4,0.8,0.7,1.5,1,2.3c0.1,0.2,0.2,0.5,0.3,0.7c0.1,0.2,0.2,0.5,0.2,0.8c0.1,0.3,0.2,0.6,0.3,0.9c0,0.1,0.1,0.2,0.1,0.3
		c0,0,0.1,0.1,0.1,0.1c0.1,0,0.1,0,0.2,0c0.1,0,0.2,0,0.3,0c0.1,0,0.2,0,0.3-0.1c0.2,0,0.5-0.1,0.7-0.1
		C63.9,48.9,63.9,52.5,63.9,52.6L63.9,52.6z"/>
</g>
<g>
	<path class="st4" d="M12.5,33c-1.1,1.9-2.8,2.3-4.8,1.1l-3.2-1.9c-2.1-1.2-2.5-2.8-1.4-4.7c1.1-1.9,2.8-2.3,4.8-1.1l3.2,1.9
		C13.1,29.5,13.6,31.1,12.5,33z M6.6,28.1c-1-0.6-1.8-0.6-2.2,0.1c-0.4,0.7-0.1,1.3,1,1.9L9,32.3c1,0.6,1.8,0.6,2.2-0.1
		c0.4-0.7,0.1-1.3-1-1.9L6.6,28.1z"/>
</g>
<g>
	<path class="st4" d="M17.7,27.4l1.1,1l-2.1,2.5l-1.1-1l0.4-0.5l-5.5-4.7L10,25.3l-1.1-0.9l1.6-1.8l0.8,0.7
		c-0.4-0.8-0.3-1.6,0.2-2.2c0.8-0.9,2-0.8,3.5,0.5l1.3,1.1c1.6,1.3,2,2.4,1.1,3.5c-0.4,0.5-1,0.7-1.6,0.6l1.5,1.3L17.7,27.4z
		 M15.7,25.7c0.3-0.4,0-0.8-0.7-1.4L13.6,23c-0.7-0.6-1.2-0.8-1.5-0.4c-0.3,0.4-0.1,0.9,0.7,1.6l1.3,1.1
		C14.8,25.9,15.4,26.1,15.7,25.7z"/>
</g>
<g>
	<path class="st4" d="M21.5,22.1c-1.3,1.1-2.6,0.9-3.9-0.6l-1.1-1.3c-1.3-1.6-1.3-2.9,0-4.1c1.3-1.1,2.6-1,3.7,0.3l1.1,1.4l-2.5,2.1
		l0.5,0.6c0.5,0.6,1,0.8,1.4,0.5c0.4-0.3,0.3-0.8-0.3-1.4l1.4-1.2C23,19.6,22.9,20.9,21.5,22.1z M19.1,17.9l-0.5-0.6
		c-0.4-0.5-0.8-0.6-1.2-0.3c-0.4,0.3-0.3,0.7,0.2,1.3l0.5,0.5L19.1,17.9z"/>
</g>
<g>
	<path class="st4" d="M23.5,18.3l0.5-0.3l-2.4-3.8l-0.5,0.3l-0.8-1.2l2.1-1.3l0.6,0.9c-0.1-1,0.3-1.7,1.1-2.2c1.2-0.7,2.2-0.4,3.1,1
		l1.9,3.1l0.5-0.3l0.8,1.3l-2.7,1.7l-0.8-1.3l0.4-0.3L25.4,13c-0.4-0.7-0.9-0.9-1.4-0.6c-0.5,0.3-0.5,0.8-0.1,1.5l1.8,2.9l0.4-0.3
		l0.8,1.3l-2.7,1.7L23.5,18.3z"/>
</g>
<g>
	<path class="st4" d="M40,9.5c0.6,1.9-0.2,3.1-2.2,3.7c-2.1,0.6-3.5-0.2-4.2-2.5L32.6,7c-0.6-2.2-0.1-3.6,1.5-4
		c0.8-0.2,1.5-0.1,2.2,0.4l-0.2-0.8l1.7-0.5l1.1,3.8l-2,0.6c0-0.1-0.1-0.2-0.1-0.4c-0.4-1.5-0.8-2-1.6-1.8c-0.9,0.3-0.8,0.9-0.4,2.2
		l1.1,3.6c0.4,1.3,0.7,1.8,1.6,1.6c0.8-0.2,0.9-0.8,0.5-2c0-0.2-0.1-0.4-0.2-0.5l2-0.6L40,9.5z"/>
</g>
<g>
	<path class="st4" d="M41.6,10.4l0.6-0.1l-0.9-7.6l-0.6,0.1l-0.2-1.4L43.3,1l0.4,3.8c0.4-0.7,0.9-1,1.7-1.1c1.4-0.2,2.1,0.6,2.3,2.2
		l0.4,3.6l0.6-0.1l0.2,1.5l-3.2,0.4L45.5,10L46,9.9l-0.4-3.4c-0.1-0.8-0.4-1.2-1-1.1c-0.6,0.1-0.8,0.5-0.7,1.3l0.4,3.4l0.5-0.1
		l0.2,1.5l-3.2,0.4L41.6,10.4z"/>
</g>
<g>
	<path class="st4" d="M53.8,10.1c-0.5,0.9-1.2,1.2-2.1,1.2c-1.2-0.1-1.8-0.9-1.7-2.4c0.1-1.7,1.1-2.4,3.2-2.2l0.7,0l0-0.8
		c0-0.7-0.2-1-0.7-1c-0.4,0-0.8,0.2-0.8,0.7l0,0.5L50.4,6c0-0.1,0-0.2,0-0.3c0.1-1.5,1-2.2,2.8-2.1c2,0.1,2.7,1,2.6,2.8L55.6,10
		l0.6,0L56,11.5l-2.3-0.1L53.8,10.1z M53.6,7.9c-1.1-0.1-1.6,0.2-1.6,1c0,0.6,0.2,0.9,0.7,1c0.6,0,1-0.5,1-1.4l0-0.6
		C53.7,7.9,53.6,7.9,53.6,7.9z"/>
</g>
<g>
	<path class="st4" d="M57.1,10.2l0.7,0.1l1.4-7.6l-0.5-0.1L59,1.3l2.6,0.5l-1.7,9l0.7,0.1l-0.3,1.5l-3.4-0.7L57.1,10.2z"/>
</g>
<g>
	<path class="st4" d="M61.5,11.1l0.7,0.2l2.2-7.4l-0.5-0.2l0.4-1.4l2.6,0.8l-2.6,8.8l0.6,0.2l-0.4,1.4l-3.3-1L61.5,11.1z"/>
</g>
<g>
	<path class="st4" d="M67.7,15c-1.5-0.7-2-2-1.2-3.8l0.7-1.6c0.8-1.9,2-2.5,3.7-1.8c1.6,0.7,2,1.9,1.4,3.4l-0.7,1.6l-3-1.3l-0.3,0.7
		c-0.3,0.8-0.3,1.3,0.2,1.5c0.5,0.2,0.8-0.1,1.2-0.9l1.7,0.7C70.4,15.2,69.2,15.7,67.7,15z M70.2,11l0.3-0.7c0.3-0.6,0.2-1-0.2-1.2
		c-0.4-0.2-0.8,0-1.1,0.7L69,10.4L70.2,11z"/>
</g>
<g>
	<path class="st4" d="M72,15.1l0.5,0.3l2.5-3.8l-0.5-0.3l0.8-1.2l2.1,1.4l-0.6,0.9c0.8-0.5,1.6-0.4,2.4,0.1c1.2,0.8,1.3,1.8,0.3,3.2
		l-2,3.1l0.5,0.3l-0.8,1.2l-2.7-1.8l0.8-1.2l0.4,0.3l1.9-2.9c0.5-0.7,0.5-1.2-0.1-1.5c-0.5-0.3-1-0.1-1.4,0.6l-1.9,2.9l0.4,0.3
		l-0.8,1.2l-2.7-1.8L72,15.1z"/>
</g>
<g>
	<path class="st4" d="M80.5,25.6c-0.9,0.2-1.8,0-2.6-0.7c-1.3-1.2-1.4-2.4-0.3-3.5c0,0,0,0,0.1-0.1l1.4,1.3
		c-0.5,0.6-0.6,0.9-0.2,1.3c0.4,0.4,0.9,0.2,1.6-0.6l0.7-0.7c-0.7,0.1-1.3-0.1-1.7-0.5c-0.9-0.9-0.8-2.1,0.6-3.5l0.9-1
		c1.4-1.5,2.4-1.9,3.5-0.9c0.6,0.6,0.8,1.2,0.6,2.1l0.7-0.7l1.7,1.6l-1,1L86,20.3l-3.2,3.4C81.9,24.7,81.1,25.4,80.5,25.6z
		 M83.6,19.9c0.7-0.8,0.9-1.4,0.5-1.7c-0.4-0.4-0.8-0.1-1.5,0.6l-1.2,1.2c-0.7,0.7-0.9,1.1-0.5,1.5c0.4,0.4,0.9,0.2,1.5-0.6
		L83.6,19.9z"/>
</g>
<g>
	<path class="st4" d="M84.5,28c-1.1-1.3-0.8-2.7,0.7-3.9l1.4-1.1c1.6-1.3,2.9-1.3,4.1,0.1c1.1,1.3,0.9,2.6-0.4,3.7l-1.4,1.1
		l-2.1-2.6l-0.6,0.5c-0.7,0.5-0.8,1-0.5,1.4c0.3,0.4,0.8,0.3,1.4-0.3l1.2,1.4C86.9,29.5,85.6,29.3,84.5,28z M88.7,25.6l0.6-0.5
		c0.5-0.4,0.6-0.8,0.4-1.2c-0.3-0.4-0.7-0.3-1.3,0.1l-0.6,0.5L88.7,25.6z"/>
</g>
<g>
	<path class="st4" d="M89.2,29.4l0.9,1.5c-0.8,0.5-1,1-0.7,1.4c0.2,0.4,0.6,0.5,1,0.2c0.6-0.4,0.4-1,0.3-2.1c-0.1-1.3,0.1-2,1-2.5
		c1.1-0.6,2.2-0.4,2.8,0.7c0.4,0.7,0.5,1.3,0.1,1.8l0.6-0.3l0.8,1.4l-2,1.2L93,31.2c0.7-0.4,0.9-0.9,0.7-1.3
		c-0.2-0.3-0.5-0.4-0.9-0.2c-0.6,0.3-0.4,1-0.3,2.1c0.1,1.3-0.1,2-1.1,2.6c-1.1,0.7-2.3,0.4-3-0.7c-0.4-0.6-0.4-1.3-0.1-1.9
		l-0.7,0.4l-0.8-1.4L89.2,29.4z"/>
</g>
</svg>
