{
    "_links": {
        "self": {
            "href": "http:\/\/guts.local\/taxonomy\/term\/204?_format=hal_json"
        },
        "type": {
            "href": "http:\/\/drupal.org\/rest\/type\/taxonomy_term\/languages"
        }
    },
    "tid": [
        {
            "value": "204"
        }
    ],
    "uuid": [
        {
            "value": "cc1c119a-213d-475d-972e-200ee31a8510"
        }
    ],
    "langcode": [
        {
            "value": "en",
            "lang": "en"
        }
    ],
    "vid": [
        {
            "target_id": "languages"
        }
    ],
    "name": [
        {
            "value": "Dakota",
            "lang": "en"
        }
    ],
    "weight": [
        {
            "value": "0"
        }
    ],
    "changed": [
        {
            "value": "1490185732",
            "lang": "en"
        }
    ],
    "default_langcode": [
        {
            "value": "1",
            "lang": "en"
        }
    ]
}