<?xml version="1.0" encoding="utf-8"?>
<!-- Generator: Adobe Illustrator 16.0.0, SVG Export Plug-In . SVG Version: 6.00 Build 0)  -->
<!DOCTYPE svg PUBLIC "-//W3C//DTD SVG 1.1//EN" "http://www.w3.org/Graphics/SVG/1.1/DTD/svg11.dtd">
<svg version="1.1" id="Layer_1" xmlns="http://www.w3.org/2000/svg" xmlns:xlink="http://www.w3.org/1999/xlink" x="0px" y="0px"
	 width="521px" height="499.68px" viewBox="0 0 521 499.68" enable-background="new 0 0 521 499.68" xml:space="preserve">
<rect x="0.083" y="-0.158" fill="#64A083" width="520.833" height="499.996"/>
<g>
	<defs>
		<rect id="SVGID_1_" x="0.083" y="-0.158" width="520.833" height="499.996"/>
	</defs>
	<clipPath id="SVGID_2_">
		<use xlink:href="#SVGID_1_"  overflow="visible"/>
	</clipPath>
	<path clip-path="url(#SVGID_2_)" fill="#231F20" d="M75.587,356.975v-221.73c0,0-2.937-27.906,21.291-27.906h327.467
		c0,0,23.498,2.204,23.498,28.632v221.004H75.587z"/>
</g>
<rect x="102.758" y="135.238" fill="#FFFFFF" width="317.912" height="193.105"/>
<g>
	<defs>
		<rect id="SVGID_3_" x="0.083" y="-0.158" width="520.833" height="499.996"/>
	</defs>
	<clipPath id="SVGID_4_">
		<use xlink:href="#SVGID_3_"  overflow="visible"/>
	</clipPath>
	<path clip-path="url(#SVGID_4_)" fill="#231F20" d="M17.583,370.932H196c0,0-2.937,14.689,15.418,14.689h96.188
		c0,0,12.485-2.211,12.485-12.479h176.208c0,0-2.197,37.436-38.913,37.436H52.828C52.828,410.578,17.583,406.902,17.583,370.932"/>
	<path clip-path="url(#SVGID_4_)" fill="#231F20" d="M250.45,328.1c-1.77,3.309-5.11,3.986-8.131,1.764
		c-3.543-2.592-7.016-5.318-10.749-7.582c-2.306-1.398-3.14-3.527-3.876-5.711c-0.681-1.98-0.875-4.137-1.119-6.252
		c-0.333-2.863-0.675-5.738-0.708-8.613c-0.027-2.115,0.458-4.219,0.675-6.334c0.278-2.74,0.458-5.48,0.79-8.221
		c0.125-0.963,0.461-1.979,0.966-2.807c0.973-1.6,0.312-2.74-0.936-3.553c-2.384-1.561-4.869-2.943-7.334-4.422
		c-1.994,0.582-2.645,2.236-3.265,3.893c-0.173,0.461-2.14,15.34-2.275,22.311c-0.044,2.238,1.122,4.504,1.817,7.08
		c-0.715,1.193-1.817,1.303-3.181,0.123c-2.513-2.17-3.598-5.047-4.028-8.221c-0.332-2.346,0.661-23.938,2.954-28.4
		c0.326-1.451-0.509-2.455-1.597-3.174c-1.994-1.33-4.035-2.564-6.062-3.812c-1.251-0.771-2.333-0.379-2.757,0.91
		c-4.222,11.812-3.266,24.672-2.896,27.52c0.139,1.086,0.339,2.156,0.59,3.758c-1.343-0.137-2.458,0.08-3.133-0.367
		c-7.673-5.234-15.262-10.566-22.895-15.855c-2.062-1.424-4.113-2.848-6.209-4.232c-2.499-1.654-3.689-3.838-3.689-6.984
		c-0.014-4.639-0.56-9.277-0.665-13.934c-0.112-5.133-0.285-10.294,1.98-15.177c0.274-0.604-0.329-2.021-0.939-2.543
		c-1.916-1.613-3.937-3.126-6.097-4.381c-1.346-0.787-2.791-0.366-3.327,1.35c-1.061,3.323-2.499,6.619-2.943,10.037
		c-0.821,6.457,0.478,12.753,2.878,18.802c0.424,1.059,0.586,2.211,0.481,3.5c-5.551-2.564-9.813-6.131-11.8-11.98
		c-1.957-5.792-2.791-11.712-2.292-17.816c0.125-1.479,0.278-3.004,0.767-4.395c1.207-3.397,2.444-6.795,3.984-10.05
		c1.403-2.977,5.133-3.608,7.839-1.756c8.07,5.521,16.14,11.027,24.285,16.445c6.66,4.449,13.496,8.667,20.138,13.15
		c8.731,5.893,17.307,12.008,26.028,17.893c6.653,4.504,13.458,8.75,20.142,13.197c2.075,1.398,4.018,2.998,5.873,4.68
		c1.736,1.574,2.068,3.311,0.979,5.725c-2.153,4.746-4.279,9.629-3.638,15.096c0.18,1.479,0.38,2.971,0.729,4.422
		c0.811,3.391,4.438,9.223,4.473,8.627c0.166-3.445,2.729-4.68,5.27-5.725c4.598-1.871,9.284-3.541,13.994-5.154
		c5.865-2.021,11.82-3.797,17.673-5.859c6.239-2.197,12.362-4.693,18.582-6.918c5.275-1.885,10.653-3.525,15.95-5.385
		c3.635-1.287,7.161-2.875,10.797-4.15c6.144-2.129,12.309-4.096,18.459-6.184c1.052-0.354,1.98-1.031,3.005-1.451
		c2.942-1.193,6.232,0.258,7.357,3.215c1.004,2.672-0.284,5.424-3.269,6.605c-6.368,2.494-12.641,5.33-19.179,7.311
		c-6.714,2.047-13.17,4.652-19.748,6.971c-7.989,2.834-15.978,5.643-23.953,8.49c-6.239,2.225-12.438,4.559-18.69,6.729
		c-6.242,2.17-12.576,4.109-18.812,6.307c-2.292,0.814-4.103,0.529-5.839-1.086C253.43,325.115,251.04,327,250.45,328.1"/>
	<path clip-path="url(#SVGID_4_)" fill="#231F20" d="M171.399,215.906c2.028,1.601,72.055,48.473,77.074,52.215
		c4.059,3.039,7.612,5.412,13.008,2.334c7.3-2.809,77.911-26.92,78.352-27.381c0.149-1.546-18.073-12.533-20.67-14.167
		c-3.222-2.014-3.351-3.771-0.36-6.178c1.561-1.254,4.511-1.851,6.016-3.282c4.625,3.106,20.766,13.78,25.323,16.805
		c2.102,1.39,4.326,2.577,6.307,4.103c4.463,3.459,2.333,7.42-1.363,9.236c-2.983,1.458-6.327,2.164-9.487,3.255
		c-3.404,1.201-6.762,2.477-10.18,3.676c-3.642,1.309-7.297,2.58-10.966,3.842c-3.743,1.303-7.514,2.551-11.298,3.852
		c-3.526,1.221-7.054,2.496-10.593,3.717c-3.88,1.344-7.772,2.658-11.651,3.961c-3.676,1.248-7.345,2.482-11,3.73
		c-3.526,1.207-7.039,2.469-10.552,3.703c-4.348,1.504-8.62,3.295-13.062,4.395c-1.695,0.434-4.106-0.219-5.656-1.209
		c-7.908-5.072-92.289-61.838-94.255-63.161c-1.953-1.329-3.411-2.923-3.015-5.547c0.383-2.591,2.153-4.035,4.34-4.802
		c9.176-3.221,45.064-15.476,47.278-16.316c2.062-0.794,3.855,0.102,4.056,2.271c0.159,1.845-1.021,3.737-1.312,5.548
		c-0.471,2.773-2.96,3.621-5.194,4.388C198.926,206.141,174.766,214.631,171.399,215.906"/>
	<path clip-path="url(#SVGID_4_)" fill="#231F20" d="M256.97,298.559c6.222-2.211,12.536-4.178,18.805-6.268
		c2.242-0.758,4.452-1.627,6.684-2.428c5.521-2.006,11.048-4.014,16.561-6.008c6.477-2.346,12.939-4.666,19.396-7.025
		c5.75-2.104,11.475-4.273,17.238-6.307c5.534-1.967,11.108-3.785,16.663-5.684c0.115-0.055,0.217-0.15,0.332-0.176
		c1.411-0.381,3.146-1.303,3.866,0.719c0.738,2.047-1.126,2.184-2.503,2.793c-9.04,4.002-18.487,6.891-27.805,10.105
		c-6.016,2.061-11.902,4.422-17.884,6.551c-5.859,2.088-11.786,3.988-17.639,6.035c-5.188,1.846-10.315,3.799-15.493,5.67
		c-4.222,1.52-16.222,5.832-17.896,6.66C255.4,304.119,255.394,299.127,256.97,298.559"/>
	<path clip-path="url(#SVGID_4_)" fill="#231F20" d="M257.312,147.696c-35.505,4.442-48.146,54.498-48.485,55.956
		c-0.333,1.465-0.59,2.773-0.59,2.773l3.506,1.946c-0.105,0.651-2.55,6.206-6.409,8.335c-3.875,2.109-8.535,0.834-8.535,0.834
		s-1.19-0.196-1.438,0.061c-0.912,0.895,0.068,1.96,0.068,1.96s3.591,3.011,9.284,3.737c6.239,0.793,14.085-3.059,14.085-3.059
		s-1.431,5.561-1.655,8.877c-0.2,3.086,3.194,3.859,3.194,3.859s5.856,1.003,9.549,1.396c2.628,0.278,11.848,1.812,12.814-0.929
		c0.688-1.933,1.173-10.139,1.173-10.139s4.459,0.739,9.701,0.027c5.229-0.712,10.966-4.313,10.966-4.313s5.599,3.981,10.756,4.835
		c5.161,0.868,9.8-0.359,9.8-0.359s0.026,1.187,0.766,7.677c0.441,3.804,4.381,3.228,4.381,3.228s15.13-1.675,20.454-3.045
		c2.692-0.678,0.827-8.172,0.827-8.172l-0.908-5.073c0,0,8.693,2.76,21.117-3.079c8.288-3.913,12.533-13.753,12.533-13.753
		s2.902,0.034,7.331-1.309c4.415-1.35,9.073-4.042,9.271-13.394v-0.136v-0.224c-0.068-8.742-8.986-15.632-15.761-16.683
		c-6.891-1.065-11.189,2.706-12.967,5.602c-2.197,3.608-4.469,16.256-6.253,18.439c-1.641,2.007-6.266,2.109-6.266,2.109
		s-0.983,0.359-1.024-0.353l-0.048-1.105c0,0-3.879,0.963-4.978-0.041c-0.827-0.766-3.188-7.915-3.188-7.915
		c-5.71-15.177-15.882-39.069-45.454-39.062C262.521,147.208,259.978,147.364,257.312,147.696"/>
	<path clip-path="url(#SVGID_4_)" fill="#FFFFFF" d="M249.561,150.592c-0.152,0.047-0.264,0.082-0.366,0.115
		c-1.655,0.542-3.231,1.241-4.764,2.042c-2.57,1.343-4.981,2.943-7.263,4.727c-0.959,0.746-1.882,1.533-2.78,2.354
		c-0.068,0.068-0.18,0.122-0.153,0.265c0.841,0.488,1.689,0.983,2.557,1.478c1.075-0.624,2.14-1.234,3.201-1.844
		c1.062-0.617,2.133-1.228,3.194-1.845c1.061-0.61,2.133-1.228,3.194-1.838c1.064-0.61,2.126-1.221,3.18-1.838V150.592z
		 M294.774,160.08c-0.244-0.23-0.434-0.414-0.624-0.597c-1.953-1.804-4.049-3.432-6.266-4.89c-1.926-1.262-3.934-2.394-6.076-3.269
		c-0.679-0.285-1.377-0.529-2.076-0.787c-0.095-0.034-0.189-0.081-0.298,0v3.622c0.237,0.183,12.343,7.182,12.79,7.399
		C293.052,161.083,293.893,160.595,294.774,160.08 M318.822,195.765c-0.115,0.007-0.169,0.007-0.244,0.014
		c-0.427,0.075-0.881,0.149-1.315,0.19c-0.8,0.074-1.587,0.074-2.367-0.115c-0.291-0.075-0.562-0.177-0.827-0.312
		c-0.495-0.265-0.827-0.685-1.064-1.173c-0.23-0.461-0.441-0.929-0.645-1.397c-0.671-1.634-1.214-3.316-1.776-4.998
		c-0.197-0.577-0.4-1.146-0.604-1.736c-0.027-0.088-0.082-0.176-0.122-0.264c-0.326,0.129-2.422,1.336-2.679,1.539
		c-0.007,0.055-0.014,0.115-0.014,0.183c0,4.815,0.007,9.637,0.014,14.445c0,0.014,0.007,0.027,0.007,0.041
		c0.014,0.014,0.014,0.021,0.054,0.075c3.784,2.19,7.63,4.401,11.461,6.612c0.034,0.021,0.082,0.021,0.108,0.021
		c0.041-0.305,0.068-8.206,0.041-12.75C318.85,196.016,318.836,195.914,318.822,195.765 M211.18,207.754
		c0.512-0.271,1.048-0.549,1.59-0.827c2.909-1.519,5.825-3.052,8.735-4.578c0.403-0.21,0.363-0.122,0.363-0.604
		c0.007-4.639,0-9.277,0-13.909v-0.359c-0.278-0.231-4.659-2.76-4.981-2.882c-0.125,0.136-0.18,0.326-0.261,0.502
		c-2.306,4.869-4.286,9.881-5.924,15.015c-0.621,1.939-1.197,3.893-1.607,5.887c-0.034,0.196-0.074,0.393-0.115,0.59
		C209.22,206.765,210.729,207.565,211.18,207.754 M293.31,178.173c0.407,0.285,12.465,7.236,12.75,7.345
		c0.597-0.285,2.726-1.533,2.943-1.729c-0.027-0.102-0.055-0.21-0.103-0.319c-1.261-3.16-2.624-6.279-4.184-9.304
		c-1.404-2.719-2.957-5.337-4.707-7.826c-1.064-1.512-2.197-2.963-3.418-4.34c-0.095-0.108-0.169-0.237-0.325-0.285
		c-0.977,0.577-1.98,1.146-2.943,1.709C293.275,163.871,293.263,177.658,293.31,178.173 M222.937,185.518
		c0.118-0.061,0.23-0.122,0.349-0.19c2.353-1.363,4.713-2.72,7.083-4.089c1.658-0.956,3.326-1.913,4.991-2.875
		c0.112-0.068,0.23-0.143,0.339-0.21c0.007-4.442,0.024-8.837,0.031-13.245c0-0.461-0.007-0.922-0.007-1.376
		c0-0.02-0.017-0.027-0.024-0.041c0-0.007-0.007-0.027-0.007-0.034c-0.525-0.353-2.858-1.682-3.143-1.783
		c-0.084,0.081-0.176,0.163-0.265,0.258c-0.488,0.508-0.98,1.01-1.458,1.525c-2.875,3.1-5.418,6.45-7.717,9.983
		c-1.838,2.821-3.513,5.744-5.056,8.742c-0.055,0.129-0.115,0.251-0.173,0.386c0.051,0.041,0.078,0.082,0.125,0.102
		C219.644,183.619,221.285,184.568,222.937,185.518 M264.498,161.571c4.188-2.414,8.348-4.815,12.509-7.215
		c0.061-0.041,0.132-0.082,0.193-0.122c0.014,0,0.014-0.014,0.021-0.027c0.006-0.007,0.023-0.021,0.023-0.034
		c0.034-0.414,0.027-4.035-0.018-4.354c-0.081-0.027-0.173-0.075-0.268-0.102c-1-0.271-2.007-0.488-3.027-0.685
		c-1.529-0.292-3.056-0.495-4.605-0.631c-1.312-0.122-2.631-0.149-3.943-0.183c-0.363-0.014-0.723,0.021-1.078,0.027
		c-1.485,0.007-2.964,0.108-4.445,0.237c-1.275,0.108-2.547,0.258-3.812,0.475c-1.383,0.224-2.736,0.529-4.076,0.922
		c-0.085,0.02-0.153,0.068-0.224,0.095c-0.041,0.57-0.027,3.906,0.014,4.246C255.987,156.655,260.235,159.11,264.498,161.571
		 M291.133,163.484c-0.4-0.278-12.41-7.209-12.675-7.311c-0.027,0.007-0.055,0.007-0.081,0.021
		c-4.185,2.407-8.379,4.821-12.573,7.243c-0.055,0.034-0.108,0.068-0.16,0.102c-0.007,0.007-0.021,0.027-0.021,0.027
		c-0.013,0.014-0.02,0.027-0.033,0.041v14.526c0.021,0.041,0.027,0.047,0.033,0.061c0.014,0.014,0.034,0.034,0.064,0.047
		c4.069,2.354,8.152,4.707,12.228,7.066c0.122,0.075,0.251,0.136,0.366,0.204c0.014,0.007,0.027,0.007,0.041,0.007
		c0.014,0.007,0.027,0,0.068,0c4.143-2.387,8.327-4.794,12.484-7.195c0.062-0.034,0.115-0.068,0.17-0.102
		c0.014-0.007,0.014-0.013,0.027-0.027c0-0.007,0-0.021,0.014-0.047C291.112,173.27,291.112,168.38,291.133,163.484 M250.64,156.078
		c-4.252,2.462-8.501,4.903-12.723,7.352c-0.014,0.041-0.027,0.068-0.027,0.088c-0.01,0.074-0.01,0.149-0.01,0.237
		c0,4.774,0,9.548,0.01,14.323c0,0.013,0,0.027,0.007,0.034c0.007,0.014,0.014,0.034,0.034,0.068
		c4.229,2.441,8.484,4.903,12.736,7.352c0.139-0.068,0.251-0.129,0.353-0.204c1.8-1.024,3.598-2.068,5.398-3.099
		c2.228-1.289,4.449-2.57,6.68-3.859c0.111-0.061,0.233-0.102,0.312-0.244c0-4.747,0-9.508,0-14.275c0-0.075,0-0.143-0.014-0.23
		c0-0.014,0-0.027-0.007-0.034c0-0.014-0.007-0.021-0.033-0.067C259.137,161.049,254.902,158.574,250.64,156.078 M224.109,187.423
		c-0.027,0.081-0.034,0.102-0.034,0.129c0,4.706,0,9.426,0,14.14c0,0.129,0,0.258,0.007,0.38v0.041c0,0.014,0.013,0.021,0.027,0.034
		c0.014,0.021,0.027,0.048,0.051,0.055c4.124,2.387,8.243,4.768,12.367,7.147c0.078,0.034,0.139,0.075,0.2,0.109
		c0.024,0.006,0.038,0.013,0.044,0.013c0.013,0,0.027,0,0.034,0c0.376-0.176,12.506-7.182,12.756-7.372V187.43
		c-0.166-0.095-0.319-0.19-0.471-0.271c-2.326-1.35-4.659-2.699-6.985-4.035c-1.647-0.956-3.306-1.912-4.96-2.862
		c-0.116-0.068-0.227-0.169-0.394-0.176C232.532,182.534,228.324,184.975,224.109,187.423 M251.735,202.187
		c4.252,2.455,8.494,4.91,12.722,7.352c0.058-0.014,0.085-0.014,0.105-0.027c4.062-2.34,8.117-4.673,12.18-7.019
		c0.152-0.095,0.305-0.183,0.458-0.271c0.014-0.013,0.021-0.02,0.026-0.027c0.008-0.014,0.018-0.027,0.031-0.068
		c0-0.034,0.014-0.095,0.014-0.163c-0.014-4.815-0.014-9.624-0.014-14.445c0-0.007-0.014-0.021-0.014-0.034
		c0-0.014-0.018-0.021-0.023-0.034c-0.526-0.359-12.445-7.222-12.743-7.351c-0.102,0.061-0.214,0.129-0.325,0.189
		c-2.764,1.587-5.527,3.181-8.284,4.774c-1.251,0.726-2.509,1.445-3.764,2.177c-0.125,0.068-0.278,0.122-0.37,0.264V202.187z
		 M292.197,180.085c-4.259,2.448-8.497,4.896-12.722,7.338c-0.055,0.562-0.089,14.296-0.027,14.743
		c0.014,0.014,0.027,0.034,0.054,0.054c0.041,0.034,0.102,0.068,0.156,0.095c4.157,2.4,8.321,4.808,12.472,7.209
		c0.014,0,0.027,0,0.041,0c0.013,0,0.026,0,0.067,0c4.219-2.435,8.471-4.883,12.723-7.331c0-0.177,0-0.333,0-0.481
		c0-4.571,0.014-9.148,0-13.713c0-0.651,0.108-0.481-0.475-0.82c-3.581-2.075-7.162-4.144-10.742-6.212
		C293.235,180.675,292.727,180.384,292.197,180.085 M320.844,212.685c-0.108-0.068-14.703-8.538-14.853-8.62
		c-4.611,2.659-9.223,5.317-13.848,7.989c-4.611-2.658-9.196-5.323-13.821-7.982c-0.773,0.42-13.064,7.521-13.852,7.975
		c-0.119-0.067-0.24-0.136-0.366-0.196c-2.764-1.607-13.384-7.738-13.522-7.806c-0.577,0.312-13.221,7.609-13.791,7.955
		c-0.152-0.088-0.285-0.156-0.417-0.237c-4.34-2.496-8.667-5.005-13-7.5c-0.485-0.278-0.346-0.258-0.79-0.021
		c-2.319,1.2-4.632,2.414-6.944,3.622c-1.444,0.752-2.882,1.512-4.32,2.265c-0.041,0.021-0.092,0.041-0.153,0.061
		c-0.319-0.102-0.604-0.298-0.918-0.448c-0.319-0.163-0.631-0.332-0.943-0.502c-0.312-0.163-0.617-0.318-0.922-0.481
		c-0.322-0.163-0.641-0.325-0.953-0.495c-0.298-0.169-0.624-0.285-0.895-0.509c0.431-2.278,0.943-4.517,1.618-6.714
		c1.743-5.744,3.896-11.332,6.459-16.744c1.485-3.14,3.109-6.206,4.9-9.176c1.994-3.323,4.188-6.524,6.632-9.548
		c1.258-1.553,2.563-3.052,3.96-4.483c0.692-0.712,1.36-1.431,2.062-2.129c0.848-0.854,1.75-1.641,2.689-2.407
		c2.435-2.001,5.025-3.784,7.795-5.297c2.035-1.119,4.141-2.096,6.368-2.76c1.875-0.557,3.75-1.112,5.683-1.472
		c1.088-0.204,2.194-0.387,3.299-0.502c0.956-0.095,1.909-0.19,2.865-0.271c0.716-0.054,1.431-0.074,2.146-0.115
		c0.099,0,0.21,0.021,0.292-0.061h3.757c0.04,0.021,0.091,0.054,0.132,0.061c0.472,0.027,0.946,0.041,1.418,0.082
		c0.929,0.075,1.861,0.156,2.783,0.257c1.207,0.149,2.411,0.353,3.598,0.597c1.896,0.386,3.758,0.902,5.596,1.492
		c1.817,0.597,3.553,1.397,5.235,2.306c2.93,1.594,5.642,3.493,8.192,5.649c0.956,0.807,1.878,1.634,2.739,2.529
		c2.17,2.266,4.109,4.734,5.846,7.345c2.021,3.025,3.771,6.212,5.331,9.508c1.268,2.679,2.407,5.412,3.485,8.186
		c0.318,0.848,0.651,1.689,0.949,2.55c0.312,0.882,0.583,1.771,0.889,2.659c0.373,1.092,0.76,2.177,1.214,3.228
		c0.136,0.305,0.285,0.604,0.427,0.902c0.075,0.163,0.197,0.271,0.373,0.298c0.244,0.055,0.502,0.115,0.753,0.129
		c0.394,0.014,0.794,0.014,1.188-0.047c0.386-0.068,0.772-0.122,1.173-0.183c0.848-0.122,1.702-0.251,2.543-0.373v19.437H320.844z"
		/>
</g>
</svg>
