{
    "_links": {
        "self": {
            "href": "http:\/\/guts.local\/admin\/structure\/menu\/item\/17\/edit?_format=hal_json"
        },
        "type": {
            "href": "http:\/\/drupal.org\/rest\/type\/menu_link_content\/menu_link_content"
        }
    },
    "id": [
        {
            "value": 17
        }
    ],
    "uuid": [
        {
            "value": "4b175c94-2912-43af-806a-60c87e6554b5"
        }
    ],
    "langcode": [
        {
            "value": "en",
            "lang": "en"
        }
    ],
    "bundle": [
        {
            "value": "menu_link_content"
        }
    ],
    "title": [
        {
            "value": "My pages",
            "lang": "en"
        }
    ],
    "description": [
        {
            "value": "My Pages: Your personal pages: profile, backpack, pacing guide, and self\u00ad-assessment.",
            "lang": "en"
        }
    ],
    "menu_name": [
        {
            "value": "account"
        }
    ],
    "link": [
        {
            "uri": "internal:\/user",
            "title": "",
            "options": []
        }
    ],
    "external": [
        {
            "value": false
        }
    ],
    "rediscover": [
        {
            "value": true
        }
    ],
    "weight": [
        {
            "value": -50
        }
    ],
    "expanded": [
        {
            "value": true
        }
    ],
    "enabled": [
        {
            "value": true
        }
    ],
    "changed": [
        {
            "value": 1500564061,
            "lang": "en"
        }
    ],
    "default_langcode": [
        {
            "value": true,
            "lang": "en"
        }
    ]
}