<?xml version="1.0" encoding="utf-8"?>
<!-- Generator: Adobe Illustrator 19.2.1, SVG Export Plug-In . SVG Version: 6.00 Build 0)  -->
<svg version="1.1" id="Layer_1" xmlns="http://www.w3.org/2000/svg" xmlns:xlink="http://www.w3.org/1999/xlink" x="0px" y="0px"
	 viewBox="0 0 63 63" style="enable-background:new 0 0 63 63;" xml:space="preserve">
<style type="text/css">
	.st0{clip-path:url(#SVGID_2_);fill:#65A184;}
	.st1{clip-path:url(#SVGID_2_);fill:none;stroke:#000000;stroke-width:2.414;}
	.st2{clip-path:url(#SVGID_2_);}
	.st3{clip-path:url(#SVGID_2_);fill:#FFFFFF;}
</style>
<g>
	<defs>
		<rect id="SVGID_1_" x="6" y="6.1" width="50" height="50.9"/>
	</defs>
	<clipPath id="SVGID_2_">
		<use xlink:href="#SVGID_1_"  style="overflow:visible;"/>
	</clipPath>
	<path class="st0" d="M31,54c13.1,0,23.8-10.4,23.8-23.3S44.1,7.3,31,7.3C17.9,7.3,7.2,17.8,7.2,30.7S17.9,54,31,54"/>
	<ellipse class="st1" cx="31" cy="30.7" rx="23.8" ry="23.3"/>
	<path class="st2" d="M29.2,49.4c-0.3,0.6-0.9,0.7-1.4,0.3c-0.6-0.5-1.2-0.9-1.9-1.3c-0.4-0.2-0.5-0.6-0.7-1
		c-0.1-0.3-0.2-0.7-0.2-1.1c-0.1-0.5-0.1-1-0.1-1.5c0-0.4,0.1-0.7,0.1-1.1c0-0.5,0.1-1,0.1-1.4c0-0.2,0.1-0.3,0.2-0.5
		c0.2-0.3,0.1-0.5-0.2-0.6c-0.4-0.3-0.8-0.5-1.3-0.8c-0.3,0.1-0.5,0.4-0.6,0.7c0,0.1-0.4,2.7-0.4,3.9c0,0.4,0.2,0.8,0.3,1.2
		c-0.1,0.2-0.3,0.2-0.6,0c-0.4-0.4-0.6-0.9-0.7-1.4c-0.1-0.4,0.1-4.2,0.5-4.9c0.1-0.3-0.1-0.4-0.3-0.6c-0.3-0.2-0.7-0.4-1.1-0.7
		c-0.2-0.1-0.4-0.1-0.5,0.2c-0.7,2.1-0.6,4.3-0.5,4.8c0,0.2,0.1,0.4,0.1,0.7c-0.2,0-0.4,0-0.5-0.1c-1.3-0.9-2.7-1.8-4-2.8
		c-0.4-0.2-0.7-0.5-1.1-0.7c-0.4-0.3-0.6-0.7-0.6-1.2c0-0.8-0.1-1.6-0.1-2.4c0-0.9,0-1.8,0.3-2.6c0-0.1-0.1-0.4-0.2-0.4
		c-0.3-0.3-0.7-0.5-1.1-0.8c-0.2-0.1-0.5-0.1-0.6,0.2c-0.2,0.6-0.4,1.2-0.5,1.7c-0.1,1.1,0.1,2.2,0.5,3.3c0.1,0.2,0.1,0.4,0.1,0.6
		c-1-0.4-1.7-1.1-2-2.1c-0.3-1-0.5-2-0.4-3.1c0-0.3,0-0.5,0.1-0.8c0.2-0.6,0.4-1.2,0.7-1.7c0.2-0.5,0.9-0.6,1.4-0.3
		c1.4,1,2.8,1.9,4.2,2.9c1.2,0.8,2.3,1.5,3.5,2.3c1.5,1,3,2.1,4.5,3.1c1.2,0.8,2.3,1.5,3.5,2.3c0.4,0.2,0.7,0.5,1,0.8
		c0.3,0.3,0.4,0.6,0.2,1c-0.4,0.8-0.7,1.7-0.6,2.6c0,0.3,0.1,0.5,0.1,0.8c0.1,0.6,0.8,1.6,0.8,1.5c0-0.6,0.5-0.8,0.9-1
		c0.8-0.3,1.6-0.6,2.4-0.9c1-0.3,2.1-0.7,3.1-1c1.1-0.4,2.1-0.8,3.2-1.2c0.9-0.3,1.9-0.6,2.8-0.9c0.6-0.2,1.2-0.5,1.9-0.7
		c1.1-0.4,2.1-0.7,3.2-1.1c0.2-0.1,0.3-0.2,0.5-0.3c0.5-0.2,1.1,0,1.3,0.6c0.2,0.5,0,0.9-0.6,1.1c-1.1,0.4-2.2,0.9-3.3,1.3
		c-1.2,0.4-2.3,0.8-3.4,1.2c-1.4,0.5-2.8,1-4.2,1.5c-1.1,0.4-2.2,0.8-3.2,1.2c-1.1,0.4-2.2,0.7-3.3,1.1c-0.4,0.1-0.7,0.1-1-0.2
		C29.8,48.8,29.3,49.2,29.2,49.4"/>
	<path class="st2" d="M15.5,29.9c0.4,0.3,12.5,8.4,13.4,9.1c0.7,0.5,1.3,0.9,2.3,0.4c1.3-0.5,13.5-4.7,13.6-4.8
		c0-0.3-3.1-2.2-3.6-2.5c-0.6-0.3-0.6-0.7-0.1-1.1c0.3-0.2,0.8-0.3,1-0.6c0.8,0.5,3.6,2.4,4.4,2.9c0.4,0.2,0.8,0.4,1.1,0.7
		c0.8,0.6,0.4,1.3-0.2,1.6c-0.5,0.3-1.1,0.4-1.6,0.6c-0.6,0.2-1.2,0.4-1.8,0.6c-0.6,0.2-1.3,0.4-1.9,0.7c-0.7,0.2-1.3,0.4-2,0.7
		c-0.6,0.2-1.2,0.4-1.8,0.6c-0.7,0.2-1.3,0.5-2,0.7c-0.6,0.2-1.3,0.4-1.9,0.6c-0.6,0.2-1.2,0.4-1.8,0.6c-0.8,0.3-1.5,0.6-2.3,0.8
		c-0.3,0.1-0.7,0-1-0.2c-1.4-0.9-16-10.7-16.4-11c-0.3-0.2-0.6-0.5-0.5-1c0.1-0.5,0.4-0.7,0.8-0.8c1.6-0.6,7.8-2.7,8.2-2.8
		c0.4-0.1,0.7,0,0.7,0.4c0,0.3-0.2,0.6-0.2,1c-0.1,0.5-0.5,0.6-0.9,0.8C20.3,28.2,16.1,29.6,15.5,29.9"/>
	<path class="st2" d="M30.4,44.2c1.1-0.4,2.2-0.7,3.3-1.1c0.4-0.1,0.8-0.3,1.2-0.4c1-0.3,1.9-0.7,2.9-1c1.1-0.4,2.2-0.8,3.4-1.2
		c1-0.4,2-0.7,3-1.1c1-0.3,1.9-0.7,2.9-1c0,0,0,0,0.1,0c0.2-0.1,0.5-0.2,0.7,0.1c0.1,0.4-0.2,0.4-0.4,0.5c-1.6,0.7-3.2,1.2-4.8,1.8
		c-1,0.4-2.1,0.8-3.1,1.1c-1,0.4-2,0.7-3.1,1c-0.9,0.3-1.8,0.7-2.7,1c-0.7,0.3-2.8,1-3.1,1.2C30.1,45.2,30.1,44.3,30.4,44.2"/>
	<path class="st2" d="M30.4,18c-6.2,0.8-8.4,9.5-8.4,9.7c-0.1,0.3-0.1,0.5-0.1,0.5l0.6,0.3c0,0.1-0.4,1.1-1.1,1.4
		c-0.7,0.4-1.5,0.1-1.5,0.1s-0.2,0-0.2,0c-0.2,0.2,0,0.3,0,0.3s0.6,0.5,1.6,0.6c1.1,0.1,2.4-0.5,2.4-0.5s-0.2,1-0.3,1.5
		c0,0.5,0.6,0.7,0.6,0.7s1,0.2,1.7,0.2c0.5,0,2.1,0.3,2.2-0.2c0.1-0.3,0.2-1.8,0.2-1.8s0.8,0.1,1.7,0c0.9-0.1,1.9-0.8,1.9-0.8
		s1,0.7,1.9,0.8c0.9,0.2,1.7-0.1,1.7-0.1s0,0.2,0.1,1.3c0.1,0.7,0.8,0.6,0.8,0.6s2.6-0.3,3.6-0.5c0.5-0.1,0.1-1.4,0.1-1.4l-0.2-0.9
		c0,0,1.5,0.5,3.7-0.5c1.4-0.7,2.2-2.4,2.2-2.4s0.5,0,1.3-0.2c0.8-0.2,1.6-0.7,1.6-2.3v0v0c0-1.5-1.6-2.7-2.7-2.9
		c-1.2-0.2-1.9,0.5-2.3,1c-0.4,0.6-0.8,2.8-1.1,3.2c-0.3,0.3-1.1,0.4-1.1,0.4s-0.2,0.1-0.2-0.1l0-0.2c0,0-0.7,0.2-0.9,0
		c-0.1-0.1-0.6-1.4-0.6-1.4c-1-2.6-2.8-6.8-7.9-6.8C31.3,17.9,30.9,17.9,30.4,18"/>
	<path class="st3" d="M29.1,18.3C29.1,18.4,29,18.4,29.1,18.3c-0.4,0.1-0.6,0.2-0.9,0.4c-0.4,0.2-0.9,0.5-1.3,0.8
		c-0.2,0.1-0.3,0.3-0.5,0.4c0,0,0,0,0,0c0.1,0.1,0.3,0.2,0.4,0.3c0.2-0.1,0.4-0.2,0.6-0.3c0.2-0.1,0.4-0.2,0.6-0.3
		c0.2-0.1,0.4-0.2,0.6-0.3c0.2-0.1,0.4-0.2,0.6-0.3V18.3z M36.9,20c0,0-0.1-0.1-0.1-0.1c-0.3-0.3-0.7-0.6-1.1-0.9
		c-0.3-0.2-0.7-0.4-1.1-0.6c-0.1,0-0.2-0.1-0.4-0.1c0,0,0,0-0.1,0V19c0,0,2.1,1.2,2.2,1.3C36.6,20.2,36.8,20.1,36.9,20 M41.1,26.2
		C41.1,26.2,41.1,26.2,41.1,26.2c-0.1,0-0.2,0-0.3,0c-0.1,0-0.3,0-0.4,0c-0.1,0-0.1,0-0.1-0.1c-0.1,0-0.1-0.1-0.2-0.2
		c0-0.1-0.1-0.2-0.1-0.2c-0.1-0.3-0.2-0.6-0.3-0.9c0-0.1-0.1-0.2-0.1-0.3c0,0,0,0,0,0c-0.1,0-0.4,0.2-0.5,0.3c0,0,0,0,0,0
		c0,0.8,0,1.7,0,2.5c0,0,0,0,0,0c0,0,0,0,0,0c0.7,0.4,1.3,0.8,2,1.2c0,0,0,0,0,0C41.1,28.4,41.1,27.1,41.1,26.2
		C41.1,26.2,41.1,26.2,41.1,26.2 M22.4,28.3c0.1,0,0.2-0.1,0.3-0.1c0.5-0.3,1-0.5,1.5-0.8c0.1,0,0.1,0,0.1-0.1c0-0.8,0-1.6,0-2.4
		v-0.1c0,0-0.8-0.5-0.9-0.5c0,0,0,0.1,0,0.1c-0.4,0.8-0.7,1.7-1,2.6c-0.1,0.3-0.2,0.7-0.3,1c0,0,0,0.1,0,0.1
		C22.1,28.1,22.3,28.3,22.4,28.3 M36.7,23.1c0.1,0,2.2,1.3,2.2,1.3c0.1,0,0.5-0.3,0.5-0.3c0,0,0,0,0-0.1c-0.2-0.5-0.5-1.1-0.7-1.6
		c-0.2-0.5-0.5-0.9-0.8-1.4c-0.2-0.3-0.4-0.5-0.6-0.8c0,0,0,0-0.1,0c-0.2,0.1-0.3,0.2-0.5,0.3C36.7,20.7,36.7,23.1,36.7,23.1
		 M24.5,24.4C24.5,24.4,24.5,24.4,24.5,24.4c0.5-0.3,0.9-0.5,1.3-0.7c0.3-0.2,0.6-0.3,0.9-0.5c0,0,0,0,0.1,0c0-0.8,0-1.5,0-2.3
		c0-0.1,0-0.2,0-0.2c0,0,0,0,0,0c0,0,0,0,0,0c-0.1-0.1-0.5-0.3-0.5-0.3c0,0,0,0,0,0c-0.1,0.1-0.2,0.2-0.3,0.3
		c-0.5,0.5-0.9,1.1-1.3,1.7c-0.3,0.5-0.6,1-0.9,1.5c0,0,0,0,0,0.1c0,0,0,0,0,0C23.9,24.1,24.2,24.3,24.5,24.4 M31.7,20.3
		c0.7-0.4,1.5-0.8,2.2-1.3c0,0,0,0,0,0c0,0,0,0,0,0c0,0,0,0,0,0c0-0.1,0-0.7,0-0.8c0,0,0,0,0,0c-0.2,0-0.3-0.1-0.5-0.1
		C33,18,32.8,18,32.5,18c-0.2,0-0.5,0-0.7,0c-0.1,0-0.1,0-0.2,0c-0.3,0-0.5,0-0.8,0c-0.2,0-0.4,0-0.7,0.1c-0.2,0-0.5,0.1-0.7,0.2
		c0,0,0,0,0,0c0,0.1,0,0.7,0,0.7C30.2,19.4,30.9,19.8,31.7,20.3 M36.3,20.6c-0.1,0-2.2-1.3-2.2-1.3c0,0,0,0,0,0
		c-0.7,0.4-1.5,0.8-2.2,1.3c0,0,0,0,0,0c0,0,0,0,0,0c0,0,0,0,0,0v2.5c0,0,0,0,0,0c0,0,0,0,0,0c0.7,0.4,1.4,0.8,2.1,1.2
		c0,0,0,0,0.1,0c0,0,0,0,0,0c0,0,0,0,0,0c0.7-0.4,1.4-0.8,2.2-1.3c0,0,0,0,0,0c0,0,0,0,0,0c0,0,0,0,0,0
		C36.3,22.3,36.3,21.4,36.3,20.6 M29.3,19.3c-0.7,0.4-1.5,0.9-2.2,1.3c0,0,0,0,0,0c0,0,0,0,0,0c0,0.8,0,1.7,0,2.5c0,0,0,0,0,0
		c0,0,0,0,0,0c0.7,0.4,1.5,0.9,2.2,1.3c0,0,0,0,0.1,0c0.3-0.2,0.6-0.4,0.9-0.5c0.4-0.2,0.8-0.4,1.2-0.7c0,0,0,0,0.1,0
		c0-0.8,0-1.7,0-2.5c0,0,0,0,0,0c0,0,0,0,0,0c0,0,0,0,0,0C30.7,20.2,30,19.7,29.3,19.3 M24.7,24.8C24.7,24.8,24.6,24.8,24.7,24.8
		c0,0.8,0,1.7,0,2.5c0,0,0,0,0,0.1v0c0,0,0,0,0,0c0,0,0,0,0,0c0.7,0.4,1.4,0.8,2.1,1.2c0,0,0,0,0,0c0,0,0,0,0,0c0,0,0,0,0,0
		c0.1,0,2.2-1.2,2.2-1.3v-2.6c0,0-0.1,0-0.1,0c-0.4-0.2-0.8-0.5-1.2-0.7c-0.3-0.2-0.6-0.3-0.9-0.5c0,0,0,0-0.1,0
		C26.1,23.9,25.4,24.3,24.7,24.8 M29.5,27.3c0.7,0.4,1.5,0.9,2.2,1.3c0,0,0,0,0,0c0.7-0.4,1.4-0.8,2.1-1.2c0,0,0.1,0,0.1,0
		c0,0,0,0,0,0c0,0,0,0,0,0c0,0,0,0,0,0c0-0.8,0-1.7,0-2.5c0,0,0,0,0,0c0,0,0,0,0,0c-0.1-0.1-2.2-1.3-2.2-1.3c0,0,0,0-0.1,0
		c-0.5,0.3-1,0.6-1.4,0.8c-0.2,0.1-0.4,0.2-0.7,0.4c0,0,0,0-0.1,0V27.3z M36.5,23.5c-0.7,0.4-1.5,0.9-2.2,1.3c0,0.1,0,2.5,0,2.6
		c0,0,0,0,0,0c0,0,0,0,0,0c0.7,0.4,1.4,0.8,2.2,1.3c0,0,0,0,0,0c0,0,0,0,0,0c0.7-0.4,1.5-0.8,2.2-1.3c0,0,0-0.1,0-0.1
		c0-0.8,0-1.6,0-2.4c0-0.1,0-0.1-0.1-0.1c-0.6-0.4-1.2-0.7-1.9-1.1C36.7,23.6,36.6,23.5,36.5,23.5 M41.5,29.1c0,0-2.6-1.5-2.6-1.5
		c-0.8,0.5-1.6,0.9-2.4,1.4c-0.8-0.5-1.6-0.9-2.4-1.4c-0.1,0.1-2.3,1.3-2.4,1.4c0,0,0,0-0.1,0c-0.5-0.3-2.3-1.3-2.4-1.4
		C29.2,27.7,27,29,26.9,29c0,0,0,0-0.1,0c-0.8-0.4-1.5-0.9-2.3-1.3c-0.1,0-0.1,0-0.1,0c-0.4,0.2-0.8,0.4-1.2,0.6
		c-0.3,0.1-0.5,0.3-0.8,0.4c0,0,0,0,0,0c-0.1,0-0.1-0.1-0.2-0.1c-0.1,0-0.1-0.1-0.2-0.1c-0.1,0-0.1-0.1-0.2-0.1
		c-0.1,0-0.1-0.1-0.2-0.1c-0.1,0-0.1,0-0.2-0.1c0.1-0.4,0.2-0.8,0.3-1.2c0.3-1,0.7-2,1.1-2.9c0.3-0.5,0.5-1.1,0.9-1.6
		c0.3-0.6,0.7-1.1,1.2-1.7c0.2-0.3,0.4-0.5,0.7-0.8c0.1-0.1,0.2-0.2,0.4-0.4c0.1-0.1,0.3-0.3,0.5-0.4c0.4-0.3,0.9-0.7,1.4-0.9
		c0.4-0.2,0.7-0.4,1.1-0.5c0.3-0.1,0.7-0.2,1-0.3c0.2,0,0.4-0.1,0.6-0.1c0.2,0,0.3,0,0.5,0c0.1,0,0.2,0,0.4,0c0,0,0,0,0,0h0.7
		c0,0,0,0,0,0c0.1,0,0.2,0,0.2,0c0.2,0,0.3,0,0.5,0c0.2,0,0.4,0.1,0.6,0.1c0.3,0.1,0.7,0.2,1,0.3c0.3,0.1,0.6,0.2,0.9,0.4
		c0.5,0.3,1,0.6,1.4,1c0.2,0.1,0.3,0.3,0.5,0.4c0.4,0.4,0.7,0.8,1,1.3c0.4,0.5,0.7,1.1,0.9,1.7c0.2,0.5,0.4,0.9,0.6,1.4
		c0.1,0.1,0.1,0.3,0.2,0.4c0.1,0.2,0.1,0.3,0.2,0.5c0.1,0.2,0.1,0.4,0.2,0.6c0,0.1,0,0.1,0.1,0.2c0,0,0,0,0.1,0.1c0,0,0.1,0,0.1,0
		c0.1,0,0.1,0,0.2,0c0.1,0,0.1,0,0.2,0c0.1,0,0.3,0,0.4-0.1L41.5,29.1L41.5,29.1z"/>
</g>
</svg>
