<?xml version="1.0" encoding="utf-8"?>
<!-- Generator: Adobe Illustrator 16.0.0, SVG Export Plug-In . SVG Version: 6.00 Build 0)  -->
<!DOCTYPE svg PUBLIC "-//W3C//DTD SVG 1.1//EN" "http://www.w3.org/Graphics/SVG/1.1/DTD/svg11.dtd">
<svg version="1.1" id="Layer_1" xmlns="http://www.w3.org/2000/svg" xmlns:xlink="http://www.w3.org/1999/xlink" x="0px" y="0px"
	 width="521px" height="499.68px" viewBox="0 0 521 499.68" enable-background="new 0 0 521 499.68" xml:space="preserve">
<rect x="-0.104" y="-0.34" fill="#B3B5AB" width="521.209" height="500.359"/>
<g>
	<defs>
		<rect id="SVGID_1_" x="-0.104" y="-0.34" width="521.209" height="500.359"/>
	</defs>
	<clipPath id="SVGID_2_">
		<use xlink:href="#SVGID_1_"  overflow="visible"/>
	</clipPath>
	<path clip-path="url(#SVGID_2_)" fill="#231F20" d="M116.218,429.359c0,0,22.951-13.991,26.975-27.329
		c2.67-8.848,0-22.782,0-22.782s-122.449-6.461-122.449-86.906c0-80.448,81.57-106.61,160.874-106.61
		c79.304,0,154.517,41.168,154.517,99.478c0,58.308-62.128,98.37-148.791,98.37C187.344,383.579,170.181,427.726,116.218,429.359"/>
	<path clip-path="url(#SVGID_2_)" fill="#FFFFFF" d="M224.13,179.189c0,0,72.128,10.995,104.616,53.991
		c24.876,32.922,27.515,72.695-4.87,111.007c0,0,37.606,8.021,68.675,0c31.066-8.024,40.879-16.361,40.879-16.361
		s32.24,3.703,40.871,37.768c0,0,13.866-16.997,0-43.328c-4.613-8.762-10.625-13.888-10.625-13.888s80.186-98.875-25.348-172.516
		C344.86,70.641,224.13,122.778,224.13,179.189"/>
</g>
</svg>
