{
    "_links": {
        "self": {
            "href": "http:\/\/guts.local\/taxonomy\/term\/33?_format=hal_json"
        },
        "type": {
            "href": "http:\/\/drupal.org\/rest\/type\/taxonomy_term\/content_type"
        }
    },
    "tid": [
        {
            "value": "33"
        }
    ],
    "uuid": [
        {
            "value": "9a4c7917-4eaa-42e8-b63f-bfb76d2e2c39"
        }
    ],
    "vid": [
        {
            "target_id": "content_type"
        }
    ],
    "langcode": [
        {
            "value": "en",
            "lang": "en"
        }
    ],
    "name": [
        {
            "value": "Presentation",
            "lang": "en"
        }
    ],
    "weight": [
        {
            "value": "0"
        }
    ],
    "changed": [
        {
            "value": "1466116640",
            "lang": "en"
        }
    ],
    "default_langcode": [
        {
            "value": "1",
            "lang": "en"
        }
    ]
}