<?xml version="1.0" encoding="utf-8"?>
<!-- Generator: Adobe Illustrator 19.2.1, SVG Export Plug-In . SVG Version: 6.00 Build 0)  -->
<svg version="1.1" id="Layer_1" xmlns="http://www.w3.org/2000/svg" xmlns:xlink="http://www.w3.org/1999/xlink" x="0px" y="0px"
	 viewBox="0 0 140 120" style="enable-background:new 0 0 140 120;" xml:space="preserve">
<style type="text/css">
	.st0{clip-path:url(#SVGID_2_);fill:#52564B;}
	.st1{clip-path:url(#SVGID_2_);fill:#80B098;}
	.st2{clip-path:url(#SVGID_2_);}
	.st3{fill:#FFFFFF;}
	.st4{clip-path:url(#SVGID_4_);}
	.st5{clip-path:url(#SVGID_4_);fill:#FFFFFF;}
	.st6{clip-path:url(#SVGID_4_);fill:#52564B;}
</style>
<g>
	<defs>
		<rect id="SVGID_1_" x="3" y="4.1" width="128.8" height="113.2"/>
	</defs>
	<clipPath id="SVGID_2_">
		<use xlink:href="#SVGID_1_"  style="overflow:visible;"/>
	</clipPath>
	<path class="st0" d="M12.8,117.3c2.3-1.5,4.6-3,7-4.5c8.4-5.4,16.9-10.7,25.3-16.1c2.1-1.4,2.7-3.5,1.6-5.8c0,0,0-0.1,0-0.1
		c3.8-2.4,7.5-4.8,11.3-7.2c1,1,1.9,2.2,3,3.2c4.3,4.2,9.3,7.3,15,9.2c18.8,6.3,39.3-2.2,48-20.1c0.9-1.8,1.5-3.7,2.2-5.6
		c0.1-0.2,0.1-0.3,0.2-0.4c0.4-1.8,0.8-3.6,1.2-5.4c0-0.2,0-0.4,0-0.5c0.1-1,0.3-2.1,0.3-3.1c0.5-9.7-2.2-18.5-8.2-26.2
		c-4.4-5.8-10.1-10-16.9-12.6c-1-0.4-2.1-0.8-3.1-1.1c-1.8-0.4-3.6-0.8-5.4-1.2c-1.1-0.1-2.2-0.2-3.3-0.3
		c-6.3-0.4-12.4,0.6-18.2,3.2c-9,4-15.8,10.3-19.9,19.3c-5.3,11.4-5.2,22.9,0.2,34.4c0,0.1,0.1,0.2,0.1,0.3c0,0,0,0,0,0
		c-3.8,2.4-7.5,4.8-11.2,7.1c-0.6-0.5-1.2-1.1-1.9-1.4c-1.4-0.7-2.8-0.5-4.1,0.4c-4.9,3.2-9.9,6.3-14.8,9.4
		c-5.8,3.7-11.7,7.4-17.5,11.1c-0.2,0.1-0.3,0.2-0.5,0.3c-0.1,0.4-0.2,0.8-0.3,1.2c2.6,4.1,5.2,8.2,7.8,12.2
		C11.5,117,12.2,117.2,12.8,117.3"/>
	<path class="st1" d="M120.7,56.3c-0.1-0.7,0.4-1.4,1.1-1.6c0,0,0,0,0,0c-0.7,0-1.3-0.5-1.4-1.2c-0.1-0.7,0.3-1.4,0.9-1.7
		c0,0,0,0,0,0c-0.7,0-1.3-0.4-1.5-1.1c-0.2-0.7,0.1-1.5,0.8-1.8c0,0,0,0,0,0c-0.7,0.1-1.4-0.3-1.6-0.9c-0.3-0.7,0-1.5,0.6-1.8
		c0,0,0,0,0,0c-0.7,0.2-1.4-0.1-1.7-0.8c-0.3-0.7-0.1-1.4,0.4-1.9c0,0,0,0,0,0c-0.7,0.2-1.4,0-1.7-0.6c-0.4-0.6-0.3-1.4,0.3-1.9
		c0,0,0,0,0,0c-0.7,0.3-1.4,0.1-1.8-0.5c-0.4-0.6-0.4-1.4,0.1-1.9c0,0,0,0,0,0c-0.6,0.3-1.4,0.2-1.8-0.3c-0.5-0.6-0.5-1.4-0.1-1.9
		c0,0,0,0,0,0c-0.6,0.4-1.3,0.3-1.8-0.1c-0.5-0.5-0.6-1.3-0.2-1.9c0,0,0,0,0,0c-0.6,0.4-1.3,0.5-1.9,0c-0.6-0.5-0.7-1.3-0.4-1.9
		c0,0,0,0,0,0c-0.5,0.5-1.3,0.6-1.9,0.2c-0.6-0.4-0.8-1.2-0.6-1.9c0,0,0,0,0,0c-0.5,0.5-1.2,0.7-1.8,0.4c-0.7-0.3-1-1.1-0.7-1.8
		c0,0,0,0,0,0c-0.4,0.6-1.2,0.8-1.8,0.5c-0.7-0.3-1-1-0.9-1.7c0,0,0,0,0,0c-0.4,0.6-1.1,0.9-1.8,0.7c-0.7-0.2-1.1-0.9-1-1.7
		c0,0,0,0,0,0c-0.3,0.6-1,1-1.7,0.8c-0.7-0.2-1.2-0.8-1.2-1.6c0,0,0,0,0,0c-0.2,0.7-0.9,1.1-1.6,1c-0.7-0.1-1.3-0.7-1.3-1.5
		c0,0,0,0,0,0c-0.2,0.7-0.8,1.2-1.5,1.1c-0.6,0-1.1-0.4-1.3-0.9c-0.2,0.5-0.6,0.9-1.2,0.9c-0.7,0.1-1.3-0.3-1.5-0.9
		c-0.2,0.5-0.7,0.9-1.2,1c-0.7,0.1-1.4-0.4-1.6-1.1c0,0,0,0,0,0c0,0.7-0.5,1.3-1.2,1.5c-0.7,0.2-1.4-0.2-1.7-0.9c0,0,0,0,0,0
		c0.1,0.7-0.4,1.4-1.1,1.6c-0.7,0.2-1.5-0.1-1.8-0.8c0,0,0,0,0,0c0.1,0.7-0.2,1.4-0.9,1.6c-0.7,0.3-1.5,0-1.9-0.6c0,0,0,0,0,0
		c0.2,0.7-0.1,1.4-0.7,1.7c-0.7,0.3-1.5,0.2-1.9-0.4c0,0,0,0,0,0c0.2,0.7,0,1.4-0.6,1.8c-0.6,0.4-1.4,0.3-1.9-0.3c0,0,0,0,0,0
		c0.3,0.6,0.1,1.4-0.4,1.8c-0.6,0.5-1.4,0.4-1.9-0.1c0,0,0,0,0,0c0.3,0.6,0.2,1.4-0.3,1.8c-0.5,0.5-1.4,0.5-1.9,0.1c0,0,0,0,0,0
		c0.4,0.6,0.4,1.4-0.1,1.9c-0.5,0.5-1.3,0.6-1.9,0.2c0,0,0,0,0,0c0.4,0.5,0.5,1.3,0.1,1.9c-0.5,0.6-1.2,0.8-1.9,0.4c0,0,0,0,0,0
		c0.5,0.5,0.6,1.3,0.2,1.8c-0.4,0.6-1.2,0.9-1.9,0.6c0,0,0,0,0,0c0.5,0.5,0.7,1.2,0.4,1.8c-0.3,0.7-1.1,1-1.8,0.7c0,0,0,0,0,0
		c0.6,0.4,0.8,1.1,0.6,1.8c-0.3,0.7-1,1.1-1.7,0.9c0,0,0,0,0,0c0.6,0.4,0.9,1.1,0.7,1.7c-0.2,0.7-0.9,1.2-1.6,1.1c0,0,0,0,0,0
		c0.6,0.3,1,1,0.9,1.7c-0.2,0.7-0.8,1.2-1.6,1.2c0,0,0,0,0,0c0.7,0.2,1.1,0.9,1,1.6c-0.1,0.7-0.7,1.3-1.4,1.3c0,0,0,0,0,0
		c0.7,0.2,1.2,0.8,1.2,1.5c0,0.8-0.6,1.3-1.3,1.4c0,0,0,0,0,0c0.7,0.1,1.2,0.7,1.3,1.4c0,0.8-0.5,1.4-1.2,1.6c0,0,0,0,0,0
		c0.7,0.1,1.3,0.6,1.4,1.3c0.1,0.7-0.3,1.4-1.1,1.7c0,0,0,0,0,0c0.7,0,1.3,0.4,1.5,1.1c0.2,0.7-0.2,1.5-0.9,1.8c0,0,0,0,0,0
		c0.7-0.1,1.4,0.3,1.6,1c0.2,0.7-0.1,1.5-0.7,1.8c0,0,0,0,0,0c0.7-0.1,1.4,0.2,1.7,0.9c0.3,0.7,0.1,1.5-0.6,1.9c0,0,0,0,0,0
		c0.7-0.2,1.4,0.1,1.7,0.7c0.4,0.7,0.2,1.4-0.4,1.9c0,0,0,0,0,0c0.7-0.3,1.4,0,1.8,0.6c0.4,0.6,0.3,1.4-0.2,1.9c0,0,0,0,0,0
		c0.6-0.3,1.4-0.2,1.8,0.4c0.5,0.6,0.4,1.4,0,1.9c0,0,0,0,0,0c0.6-0.4,1.4-0.3,1.8,0.2c0.5,0.5,0.6,1.3,0.1,1.9c0,0,0,0,0,0
		c0.6-0.4,1.4-0.4,1.9,0.1c0.6,0.5,0.7,1.3,0.3,1.9c0,0,0,0,0,0c0.5-0.5,1.3-0.5,1.9-0.1c0.6,0.4,0.8,1.2,0.5,1.9c0,0,0,0,0,0
		c0.5-0.5,1.2-0.6,1.8-0.3c0.6,0.4,0.9,1.2,0.6,1.8c0,0,0,0,0,0c0.4-0.6,1.2-0.7,1.8-0.4c0.7,0.3,1,1.1,0.8,1.8c0,0,0,0,0,0
		c0.4-0.6,1.1-0.8,1.8-0.6c0.7,0.3,1.1,1,0.9,1.7c0,0,0,0,0,0c0.3-0.6,1-0.9,1.7-0.8c0.7,0.2,1.2,0.9,1.1,1.6c0,0,0,0,0,0
		c0.3-0.7,1-1,1.7-0.9c0.7,0.1,1.2,0.8,1.2,1.5c0,0,0,0,0,0c0.2-0.7,0.9-1.1,1.5-1c0.8,0.1,1.3,0.7,1.4,1.4c0,0,0,0,0,0
		c0.2-0.7,0.8-1.2,1.5-1.2c0.8,0,1.4,0.6,1.5,1.3c0,0,0,0,0,0c0.1-0.7,0.6-1.2,1.3-1.3c0.8-0.1,1.4,0.4,1.6,1.1c0,0,0,0,0,0
		c0-0.7,0.5-1.3,1.2-1.4c0.7-0.1,1.4,0.3,1.7,1c0,0,0,0,0,0c0-0.7,0.4-1.3,1.1-1.5c0.7-0.2,1.5,0.2,1.8,0.8c0,0,0,0,0,0
		c-0.1-0.7,0.3-1.4,1-1.6c0.7-0.2,1.5,0.1,1.8,0.7c0,0,0,0,0,0c-0.1-0.7,0.2-1.4,0.8-1.7c0.7-0.3,1.5-0.1,1.9,0.5c0,0,0,0,0,0
		c-0.2-0.7,0.1-1.4,0.7-1.7c0.6-0.4,1.4-0.2,1.9,0.3c0,0,0,0,0,0c-0.3-0.7-0.1-1.4,0.5-1.8c0.6-0.4,1.4-0.3,1.9,0.2c0,0,0,0,0,0
		c-0.3-0.6-0.2-1.4,0.3-1.8c0.6-0.5,1.4-0.5,1.9,0c0,0,0,0,0,0c-0.4-0.6-0.3-1.3,0.2-1.8c0.5-0.5,1.3-0.6,1.9-0.2c0,0,0,0,0,0
		c-0.4-0.6-0.4-1.3,0-1.9c0.5-0.6,1.3-0.7,1.9-0.3c0,0,0,0,0,0c-0.5-0.5-0.5-1.3-0.1-1.9c0.4-0.6,1.2-0.8,1.9-0.5c0,0,0,0,0,0
		c-0.5-0.5-0.7-1.2-0.3-1.8c0.4-0.7,1.1-0.9,1.8-0.7c0,0,0,0,0,0c-0.6-0.4-0.8-1.2-0.5-1.8c0.3-0.7,1-1,1.8-0.8c0,0,0,0,0,0
		c-0.6-0.4-0.9-1.1-0.6-1.8c0.2-0.7,1-1.1,1.7-1c0,0,0,0,0,0c-0.6-0.3-1-1-0.8-1.7c0.2-0.7,0.8-1.2,1.6-1.2c0,0,0,0,0,0
		c-0.7-0.3-1.1-0.9-0.9-1.6c0.1-0.7,0.7-1.3,1.5-1.3c0,0,0,0,0,0c-0.7-0.2-1.1-0.8-1.1-1.5c0-0.8,0.6-1.3,1.4-1.4c0,0,0,0,0,0
		c-0.7-0.1-1.2-0.7-1.2-1.4c0-0.7,0.5-1.4,1.2-1.5c0,0,0,0,0,0C121.4,57.6,120.8,57,120.7,56.3"/>
	<path class="st2" d="M67.4,68.7v-26c0,0-0.3-3.3,2.5-3.3h38.5c0,0,2.8,0.3,2.8,3.4v26H67.4z"/>
</g>
<rect x="70.6" y="42.6" class="st3" width="37.3" height="22.7"/>
<g>
	<defs>
		<rect id="SVGID_3_" x="3" y="4.1" width="128.8" height="113.2"/>
	</defs>
	<clipPath id="SVGID_4_">
		<use xlink:href="#SVGID_3_"  style="overflow:visible;"/>
	</clipPath>
	<path class="st4" d="M60.6,70.3h20.9c0,0-0.3,1.7,1.8,1.7h11.3c0,0,1.5-0.3,1.5-1.5h20.7c0,0-0.3,4.4-4.6,4.4H64.7
		C64.7,74.9,60.6,74.5,60.6,70.3"/>
	<path class="st4" d="M87.9,65.3c-0.2,0.4-0.6,0.5-1,0.2c-0.4-0.3-0.8-0.6-1.3-0.9c-0.3-0.2-0.4-0.4-0.5-0.7
		c-0.1-0.2-0.1-0.5-0.1-0.7c0-0.3-0.1-0.7-0.1-1c0-0.2,0.1-0.5,0.1-0.7c0-0.3,0.1-0.6,0.1-1c0-0.1,0.1-0.2,0.1-0.3
		c0.1-0.2,0-0.3-0.1-0.4c-0.3-0.2-0.6-0.3-0.9-0.5c-0.2,0.1-0.3,0.3-0.4,0.5c0,0.1-0.3,1.8-0.3,2.6c0,0.3,0.1,0.5,0.2,0.8
		c-0.1,0.1-0.2,0.2-0.4,0c-0.3-0.3-0.4-0.6-0.5-1c0-0.3,0.1-2.8,0.3-3.3c0-0.2-0.1-0.3-0.2-0.4c-0.2-0.2-0.5-0.3-0.7-0.4
		c-0.1-0.1-0.3,0-0.3,0.1c-0.5,1.4-0.4,2.9-0.3,3.2c0,0.1,0,0.3,0.1,0.4c-0.2,0-0.3,0-0.4,0c-0.9-0.6-1.8-1.2-2.7-1.9
		c-0.2-0.2-0.5-0.3-0.7-0.5c-0.3-0.2-0.4-0.5-0.4-0.8c0-0.5-0.1-1.1-0.1-1.6c0-0.6,0-1.2,0.2-1.8c0-0.1,0-0.2-0.1-0.3
		c-0.2-0.2-0.5-0.4-0.7-0.5c-0.2-0.1-0.3,0-0.4,0.2c-0.1,0.4-0.3,0.8-0.3,1.2c-0.1,0.8,0.1,1.5,0.3,2.2c0,0.1,0.1,0.3,0.1,0.4
		c-0.7-0.3-1.2-0.7-1.4-1.4c-0.2-0.7-0.3-1.4-0.3-2.1c0-0.2,0-0.4,0.1-0.5c0.1-0.4,0.3-0.8,0.5-1.2c0.2-0.4,0.6-0.4,0.9-0.2
		c0.9,0.6,1.9,1.3,2.9,1.9c0.8,0.5,1.6,1,2.4,1.5c1,0.7,2,1.4,3.1,2.1c0.8,0.5,1.6,1,2.4,1.5c0.2,0.2,0.5,0.4,0.7,0.5
		c0.2,0.2,0.2,0.4,0.1,0.7c-0.3,0.6-0.5,1.1-0.4,1.8c0,0.2,0,0.3,0.1,0.5c0.1,0.4,0.5,1.1,0.5,1c0-0.4,0.3-0.5,0.6-0.7
		c0.5-0.2,1.1-0.4,1.6-0.6c0.7-0.2,1.4-0.4,2.1-0.7c0.7-0.3,1.5-0.5,2.2-0.8c0.6-0.2,1.2-0.4,1.9-0.6c0.4-0.2,0.8-0.3,1.3-0.5
		c0.7-0.2,1.4-0.5,2.2-0.7c0.1,0,0.2-0.1,0.4-0.2c0.3-0.1,0.7,0,0.9,0.4c0.1,0.3,0,0.6-0.4,0.8c-0.7,0.3-1.5,0.6-2.3,0.9
		c-0.8,0.2-1.5,0.5-2.3,0.8c-0.9,0.3-1.9,0.7-2.8,1c-0.7,0.3-1.5,0.5-2.2,0.8c-0.7,0.3-1.5,0.5-2.2,0.7c-0.3,0.1-0.5,0.1-0.7-0.1
		C88.3,64.9,88,65.1,87.9,65.3"/>
	<path class="st4" d="M78.6,52.1c0.2,0.2,8.5,5.7,9,6.1c0.5,0.4,0.9,0.6,1.5,0.3c0.9-0.3,9.1-3.2,9.2-3.2c0-0.2-2.1-1.5-2.4-1.7
		c-0.4-0.2-0.4-0.4,0-0.7c0.2-0.1,0.5-0.2,0.7-0.4c0.5,0.4,2.4,1.6,3,2c0.2,0.2,0.5,0.3,0.7,0.5c0.5,0.4,0.3,0.9-0.2,1.1
		c-0.4,0.2-0.7,0.3-1.1,0.4c-0.4,0.1-0.8,0.3-1.2,0.4c-0.4,0.2-0.9,0.3-1.3,0.5c-0.4,0.2-0.9,0.3-1.3,0.5c-0.4,0.1-0.8,0.3-1.2,0.4
		c-0.5,0.2-0.9,0.3-1.4,0.5c-0.4,0.1-0.9,0.3-1.3,0.4c-0.4,0.1-0.8,0.3-1.2,0.4c-0.5,0.2-1,0.4-1.5,0.5c-0.2,0-0.5,0-0.7-0.1
		c-0.9-0.6-10.8-7.3-11.1-7.4c-0.2-0.2-0.4-0.3-0.4-0.7c0-0.3,0.3-0.5,0.5-0.6c1.1-0.4,5.3-1.8,5.6-1.9c0.2-0.1,0.5,0,0.5,0.3
		c0,0.2-0.1,0.4-0.2,0.7c-0.1,0.3-0.3,0.4-0.6,0.5C81.9,50.9,79,51.9,78.6,52.1"/>
	<path class="st4" d="M88.7,61.8c0.7-0.3,1.5-0.5,2.2-0.7c0.3-0.1,0.5-0.2,0.8-0.3c0.6-0.2,1.3-0.5,1.9-0.7c0.8-0.3,1.5-0.5,2.3-0.8
		c0.7-0.2,1.3-0.5,2-0.7c0.6-0.2,1.3-0.4,2-0.7c0,0,0,0,0,0c0.2,0,0.4-0.2,0.5,0.1c0.1,0.2-0.1,0.3-0.3,0.3
		c-1.1,0.5-2.2,0.8-3.3,1.2c-0.7,0.2-1.4,0.5-2.1,0.8c-0.7,0.2-1.4,0.5-2.1,0.7c-0.6,0.2-1.2,0.4-1.8,0.7c-0.5,0.2-1.9,0.7-2.1,0.8
		C88.5,62.4,88.5,61.9,88.7,61.8"/>
	<path class="st4" d="M88.7,44.1c-4.2,0.5-5.7,6.4-5.7,6.6C83,50.8,83,51,83,51l0.4,0.2c0,0.1-0.3,0.7-0.8,1c-0.5,0.2-1,0.1-1,0.1
		s-0.1,0-0.2,0c-0.1,0.1,0,0.2,0,0.2s0.4,0.4,1.1,0.4c0.7,0.1,1.7-0.4,1.7-0.4s-0.2,0.7-0.2,1c0,0.4,0.4,0.5,0.4,0.5
		s0.7,0.1,1.1,0.2c0.3,0,1.4,0.2,1.5-0.1c0.1-0.2,0.1-1.2,0.1-1.2s0.5,0.1,1.1,0c0.6-0.1,1.3-0.5,1.3-0.5s0.7,0.5,1.3,0.6
		c0.6,0.1,1.1,0,1.1,0s0,0.1,0.1,0.9c0.1,0.4,0.5,0.4,0.5,0.4s1.8-0.2,2.4-0.4c0.3-0.1,0.1-1,0.1-1L95,52.3c0,0,1,0.3,2.5-0.4
		c1-0.5,1.5-1.6,1.5-1.6s0.3,0,0.9-0.2c0.5-0.2,1.1-0.5,1.1-1.6v0v0c0-1-1.1-1.8-1.9-2c-0.8-0.1-1.3,0.3-1.5,0.7
		c-0.3,0.4-0.5,1.9-0.7,2.2c-0.2,0.2-0.7,0.2-0.7,0.2s-0.1,0-0.1,0l0-0.1c0,0-0.5,0.1-0.6,0c-0.1-0.1-0.4-0.9-0.4-0.9
		c-0.7-1.8-1.9-4.6-5.3-4.6C89.3,44,89,44,88.7,44.1"/>
	<path class="st5" d="M87.8,44.4C87.8,44.4,87.8,44.4,87.8,44.4c-0.2,0.1-0.4,0.2-0.6,0.3c-0.3,0.2-0.6,0.3-0.9,0.6
		c-0.1,0.1-0.2,0.2-0.3,0.3c0,0,0,0,0,0c0.1,0.1,0.2,0.1,0.3,0.2c0.1-0.1,0.3-0.1,0.4-0.2s0.3-0.1,0.4-0.2c0.1-0.1,0.2-0.1,0.4-0.2
		c0.1-0.1,0.2-0.1,0.4-0.2V44.4z M93.1,45.5C93.1,45.5,93.1,45.5,93.1,45.5c-0.3-0.3-0.5-0.5-0.8-0.6c-0.2-0.1-0.5-0.3-0.7-0.4
		c-0.1,0-0.2-0.1-0.2-0.1c0,0,0,0,0,0v0.4c0,0,1.4,0.8,1.5,0.9C92.9,45.7,93,45.6,93.1,45.5 M96,49.7C95.9,49.7,95.9,49.7,96,49.7
		c-0.1,0-0.1,0-0.2,0c-0.1,0-0.2,0-0.3,0c0,0-0.1,0-0.1,0c-0.1,0-0.1-0.1-0.1-0.1c0-0.1-0.1-0.1-0.1-0.2c-0.1-0.2-0.1-0.4-0.2-0.6
		c0-0.1,0-0.1-0.1-0.2c0,0,0,0,0,0c0,0-0.3,0.2-0.3,0.2c0,0,0,0,0,0c0,0.6,0,1.1,0,1.7c0,0,0,0,0,0c0,0,0,0,0,0
		c0.4,0.3,0.9,0.5,1.3,0.8c0,0,0,0,0,0C96,51.2,96,50.3,96,49.7C96,49.8,96,49.7,96,49.7 M83.3,51.1c0.1,0,0.1-0.1,0.2-0.1
		c0.3-0.2,0.7-0.4,1-0.5c0,0,0,0,0-0.1c0-0.5,0-1.1,0-1.6v0c0,0-0.5-0.3-0.6-0.3c0,0,0,0,0,0.1c-0.3,0.6-0.5,1.2-0.7,1.8
		c-0.1,0.2-0.1,0.5-0.2,0.7c0,0,0,0,0,0.1C83.1,51,83.3,51.1,83.3,51.1 M93,47.7c0,0,1.5,0.8,1.5,0.9c0.1,0,0.3-0.2,0.3-0.2
		c0,0,0,0,0,0c-0.1-0.4-0.3-0.7-0.5-1.1c-0.2-0.3-0.3-0.6-0.6-0.9c-0.1-0.2-0.3-0.3-0.4-0.5c0,0,0,0,0,0c-0.1,0.1-0.2,0.1-0.3,0.2
		C93,46,93,47.6,93,47.7 M84.7,48.5C84.7,48.5,84.7,48.5,84.7,48.5c0.3-0.2,0.6-0.3,0.9-0.5c0.2-0.1,0.4-0.2,0.6-0.3c0,0,0,0,0,0
		c0-0.5,0-1,0-1.6c0-0.1,0-0.1,0-0.2c0,0,0,0,0,0s0,0,0,0c-0.1,0-0.3-0.2-0.4-0.2c0,0,0,0,0,0c-0.1,0.1-0.1,0.1-0.2,0.2
		c-0.3,0.4-0.6,0.8-0.9,1.2c-0.2,0.3-0.4,0.7-0.6,1c0,0,0,0,0,0c0,0,0,0,0,0C84.3,48.3,84.5,48.4,84.7,48.5 M89.6,45.7
		c0.5-0.3,1-0.6,1.5-0.8c0,0,0,0,0,0c0,0,0,0,0,0c0,0,0,0,0,0c0,0,0-0.5,0-0.5c0,0,0,0,0,0c-0.1,0-0.2-0.1-0.4-0.1
		c-0.2,0-0.4-0.1-0.5-0.1c-0.2,0-0.3,0-0.5,0c0,0-0.1,0-0.1,0c-0.2,0-0.3,0-0.5,0c-0.2,0-0.3,0-0.4,0.1c-0.2,0-0.3,0.1-0.5,0.1
		c0,0,0,0,0,0c0,0.1,0,0.5,0,0.5C88.6,45.1,89.1,45.4,89.6,45.7 M92.7,45.9c0,0-1.5-0.8-1.5-0.9c0,0,0,0,0,0c-0.5,0.3-1,0.6-1.5,0.9
		c0,0,0,0,0,0c0,0,0,0,0,0s0,0,0,0v1.7c0,0,0,0,0,0c0,0,0,0,0,0c0.5,0.3,1,0.6,1.4,0.8c0,0,0,0,0,0c0,0,0,0,0,0c0,0,0,0,0,0
		c0.5-0.3,1-0.6,1.5-0.8c0,0,0,0,0,0c0,0,0,0,0,0s0,0,0,0C92.7,47.1,92.7,46.5,92.7,45.9 M88,45.1c-0.5,0.3-1,0.6-1.5,0.9
		c0,0,0,0,0,0c0,0,0,0,0,0c0,0.6,0,1.1,0,1.7c0,0,0,0,0,0c0,0,0,0,0,0c0.5,0.3,1,0.6,1.5,0.9c0,0,0,0,0,0c0.2-0.1,0.4-0.2,0.6-0.4
		c0.3-0.2,0.5-0.3,0.8-0.5c0,0,0,0,0,0c0-0.6,0-1.1,0-1.7c0,0,0,0,0,0c0,0,0,0,0,0c0,0,0,0,0,0C88.9,45.7,88.5,45.4,88,45.1
		 M84.8,48.7C84.8,48.8,84.8,48.8,84.8,48.7c0,0.6,0,1.1,0,1.7c0,0,0,0,0,0v0c0,0,0,0,0,0c0,0,0,0,0,0c0.5,0.3,1,0.6,1.5,0.8
		c0,0,0,0,0,0c0,0,0,0,0,0s0,0,0,0c0,0,1.5-0.8,1.5-0.9v-1.7c0,0,0,0-0.1,0c-0.3-0.2-0.5-0.3-0.8-0.5c-0.2-0.1-0.4-0.2-0.6-0.3
		c0,0,0,0,0,0C85.8,48.2,85.3,48.5,84.8,48.7 M88.1,50.5c0.5,0.3,1,0.6,1.5,0.9c0,0,0,0,0,0c0.5-0.3,1-0.5,1.4-0.8c0,0,0,0,0.1,0
		c0,0,0,0,0,0s0,0,0,0c0,0,0,0,0,0c0-0.6,0-1.1,0-1.7c0,0,0,0,0,0c0,0,0,0,0,0c-0.1,0-1.5-0.8-1.5-0.9c0,0,0,0,0,0
		c-0.3,0.2-0.6,0.4-1,0.6c-0.1,0.1-0.3,0.2-0.4,0.3c0,0,0,0,0,0V50.5z M92.8,47.9c-0.5,0.3-1,0.6-1.5,0.9c0,0.1,0,1.7,0,1.7
		c0,0,0,0,0,0c0,0,0,0,0,0c0.5,0.3,1,0.6,1.5,0.8c0,0,0,0,0,0s0,0,0,0c0.5-0.3,1-0.6,1.5-0.9c0,0,0,0,0-0.1c0-0.5,0-1.1,0-1.6
		c0-0.1,0-0.1-0.1-0.1c-0.4-0.2-0.8-0.5-1.3-0.7C93,48,92.9,47.9,92.8,47.9 M96.2,51.7c0,0-1.7-1-1.7-1c-0.5,0.3-1.1,0.6-1.6,0.9
		c-0.5-0.3-1.1-0.6-1.6-0.9c-0.1,0-1.5,0.9-1.6,0.9c0,0,0,0,0,0c-0.3-0.2-1.6-0.9-1.6-0.9c-0.1,0-1.6,0.9-1.6,0.9c0,0,0,0,0,0
		c-0.5-0.3-1-0.6-1.5-0.9c-0.1,0,0,0-0.1,0c-0.3,0.1-0.5,0.3-0.8,0.4c-0.2,0.1-0.3,0.2-0.5,0.3c0,0,0,0,0,0c0,0-0.1,0-0.1-0.1
		c0,0-0.1,0-0.1-0.1c0,0-0.1,0-0.1-0.1c0,0-0.1,0-0.1-0.1c0,0-0.1,0-0.1-0.1c0.1-0.3,0.1-0.5,0.2-0.8c0.2-0.7,0.5-1.3,0.8-2
		c0.2-0.4,0.4-0.7,0.6-1.1c0.2-0.4,0.5-0.8,0.8-1.1c0.1-0.2,0.3-0.4,0.5-0.5c0.1-0.1,0.2-0.2,0.2-0.2c0.1-0.1,0.2-0.2,0.3-0.3
		c0.3-0.2,0.6-0.4,0.9-0.6c0.2-0.1,0.5-0.2,0.7-0.3c0.2-0.1,0.4-0.1,0.7-0.2c0.1,0,0.3,0,0.4-0.1c0.1,0,0.2,0,0.3,0
		c0.1,0,0.2,0,0.3,0c0,0,0,0,0,0h0.4c0,0,0,0,0,0c0.1,0,0.1,0,0.2,0c0.1,0,0.2,0,0.3,0c0.1,0,0.3,0,0.4,0.1c0.2,0,0.4,0.1,0.7,0.2
		c0.2,0.1,0.4,0.2,0.6,0.3c0.3,0.2,0.7,0.4,1,0.7c0.1,0.1,0.2,0.2,0.3,0.3c0.3,0.3,0.5,0.6,0.7,0.9c0.2,0.4,0.4,0.7,0.6,1.1
		c0.1,0.3,0.3,0.6,0.4,1c0,0.1,0.1,0.2,0.1,0.3c0,0.1,0.1,0.2,0.1,0.3c0,0.1,0.1,0.3,0.1,0.4c0,0,0,0.1,0,0.1c0,0,0,0,0,0
		c0,0,0.1,0,0.1,0c0,0,0.1,0,0.1,0c0,0,0.1,0,0.1,0c0.1,0,0.2,0,0.3,0L96.2,51.7L96.2,51.7z"/>
	<path class="st6" d="M122.6,29.6l0.9,1.3l0.7-0.5c-0.3,0.7-0.2,1.3,0.2,1.9c0.7,1,1.9,1.2,3,0.5c0.9-0.6,1.1-1.4,0.9-2.7
		c-0.2-1.1-0.4-1.7,0.2-2.1c0.3-0.2,0.7-0.2,0.9,0.2c0.3,0.4,0.1,0.9-0.6,1.3l1,1.4l1.9-1.3l-0.9-1.3l-0.5,0.4
		c0.3-0.5,0.2-1.2-0.3-1.8c-0.7-1-1.8-1.2-2.8-0.5c-0.8,0.6-1,1.3-0.8,2.6c0.1,1.1,0.4,1.7-0.2,2.1c-0.4,0.2-0.7,0.2-1-0.2
		c-0.3-0.4-0.1-0.9,0.6-1.5l-1-1.5L122.6,29.6z M123.1,23.3l0.5-0.5c0.5-0.5,1-0.6,1.3-0.2c0.3,0.3,0.2,0.7-0.3,1.2l-0.6,0.5
		L123.1,23.3z M123.8,27.2l-1.3-1.4c-0.6,0.6-1.1,0.7-1.4,0.4c-0.3-0.4-0.2-0.8,0.4-1.4l0.6-0.6l2.2,2.4l1.3-1.2
		c1.2-1.2,1.3-2.4,0.1-3.7c-1.2-1.3-2.5-1.3-4,0.2l-1.3,1.2c-1.4,1.3-1.6,2.7-0.4,3.9C121.2,28.3,122.5,28.3,123.8,27.2 M119.2,22.1
		l-1.5-1.2c0,0-0.1,0.1-0.1,0.1c-0.6,0.8-1,1-1.4,0.7c-0.4-0.3-0.2-0.7,0.3-1.4l1.5-1.8c0.6-0.7,1-1,1.4-0.7
		c0.4,0.3,0.2,0.8-0.5,1.7l1.4,1.2l1.8-2.2l-1.2-1l-0.5,0.6c0.1-0.8-0.1-1.3-0.6-1.7c-1.1-0.9-2.3-0.5-3.6,1l-1.1,1.4
		c-1.3,1.6-1.2,2.8,0.2,4c1.2,1,2.7,0.8,3.7-0.5C119.1,22.2,119.1,22.1,119.2,22.1 M108.6,18.1l2.9,1.7l0.8-1.3l-0.6-0.4l1.1-1.8
		c0.7-1.2,1.5-1.4,2.4-0.9c0.1,0.1,0.2,0.1,0.3,0.2l1-1.7c-0.1-0.1-0.2-0.1-0.3-0.2c-0.8-0.5-1.6-0.4-2.5,0.4l0.8-1.3l-2.1-1.3
		l-0.7,1.2l0.5,0.3l-2.3,3.9l-0.5-0.3L108.6,18.1z M105.5,16.7l2.2,0.9l0.6-1.4l-0.5-0.2l2.3-5.5l-2.5-1l-0.5,1.3l0.6,0.2l-1.2,2.9
		c-0.4,0.9-0.9,1.2-1.4,1c-0.6-0.3-0.5-0.8-0.1-1.7l1.7-4.2L104,8l-0.5,1.3l0.5,0.2l-1.3,3.2c-0.7,1.7-0.6,2.7,0.8,3.2
		c0.9,0.4,1.8,0.2,2.4-0.4L105.5,16.7z M98.7,11.9c-0.2,0.8-0.5,1.1-1.1,0.9c-0.5-0.1-0.7-0.6-0.6-1.3L97.6,9
		c0.2-0.8,0.5-1.1,1.1-0.9c0.5,0.1,0.7,0.6,0.6,1.3L98.7,11.9z M95.5,8.7L95,10.9c-0.4,1.8,0.5,2.9,2.3,3.3c1.8,0.4,3.1-0.3,3.5-2.1
		l0.5-2.2c0.4-1.8-0.5-2.9-2.3-3.3C97.1,6.3,95.9,7,95.5,8.7 M88.1,13.1l1.6,0.1l0.1-0.8c0.4,0.6,0.9,1,1.6,1
		c1.2,0.1,2.1-0.7,2.2-2.1c0.1-1.1-0.4-1.7-1.5-2.4c-0.9-0.5-1.6-0.8-1.5-1.4c0-0.4,0.3-0.6,0.7-0.6c0.4,0,0.7,0.5,0.7,1.3l1.7,0.1
		L93.8,6l-1.6-0.1l0,0.6C92,6,91.4,5.6,90.6,5.6c-1.2-0.1-2,0.7-2.1,1.9c-0.1,1,0.4,1.6,1.5,2.2c0.9,0.6,1.6,0.7,1.5,1.4
		c0,0.4-0.3,0.7-0.7,0.7c-0.5,0-0.8-0.5-0.8-1.4l-1.8-0.1L88.1,13.1z M83.4,8.8l-0.1-0.7C83.3,7.4,83.5,7,83.9,7
		c0.4,0,0.7,0.3,0.8,0.9l0.1,0.8L83.4,8.8z M86.9,10.6L85,10.8c0.1,0.9-0.1,1.3-0.6,1.3c-0.5,0-0.8-0.4-0.8-1.2l-0.1-0.8l3.3-0.3
		l-0.2-1.8c-0.2-1.7-1.1-2.5-2.8-2.4C82,5.9,81.3,6.9,81.5,9l0.2,1.8c0.2,2,1.2,2.9,2.8,2.8C86.2,13.4,87,12.4,86.9,10.6 M74.8,9
		L74,6.1l0.8-0.2C75.7,5.7,76.2,6,76.4,7c0.3,1,0,1.6-0.8,1.8L74.8,9z M73.6,15.5l3.4-0.9l-0.4-1.5l-0.6,0.2l-0.8-2.8l0.5-0.1
		c1.1-0.3,1.3,0,1.9,1.2l1.3,2.6l2.5-0.7L81,11.9l-0.7,0.2l-0.7-1.4c-0.6-1.3-1.2-1.8-2.2-1.8l0-0.1c1.1-0.5,1.5-1.4,1.1-2.7
		c-0.5-1.8-1.6-2.4-3.4-1.9l-4.3,1.2l0.4,1.4l0.6-0.2l1.9,7.2L73.2,14L73.6,15.5z M65.6,16.1c0.5,0.9,0.5,1.4,0.1,1.6
		c-0.5,0.3-0.8-0.1-1.3-0.9l-0.9-1.6c-0.5-0.9-0.6-1.3-0.1-1.6c0.4-0.2,0.9,0.1,1.4,1L65.6,16.1z M69.3,17.3L68.6,16l-0.5,0.3
		l-4.5-8l-2.3,1.3l0.7,1.3l0.5-0.3l1.2,2.1c-0.6-0.4-1.2-0.4-1.7-0.1c-1.2,0.7-1.2,1.8-0.2,3.6l0.8,1.5c1,1.7,2,2.3,3.1,1.7
		c0.7-0.4,1.1-1.1,1-1.9l0.5,0.9L69.3,17.3z M57.6,25.3l2.5-2l-0.9-1.2l-0.4,0.3l-2.1-2.7c-0.5-0.6-0.5-1.1-0.1-1.5
		c0.5-0.4,0.9-0.3,1.5,0.4l2.1,2.7l-0.4,0.3l0.9,1.2l2.5-2l-0.9-1.2l-0.5,0.4l-2.3-2.9c-1.1-1.3-2.1-1.5-3.1-0.6
		c-0.7,0.6-1,1.3-0.8,2.3L54.8,18l-1.9,1.5l0.9,1.1l0.5-0.4l2.8,3.5l-0.5,0.4L57.6,25.3z M48.9,22.3l1.4-1.5l-1.5-1.4l-1.4,1.5
		L48.9,22.3z M54.7,28.6l2.3-2.4l-1.1-1l-0.4,0.4l-4.4-4.1l-1.8,2l1.1,1l0.4-0.4l3.3,3.1l-0.4,0.5L54.7,28.6z M50.4,34.4l2.2-3.2
		l-1.3-0.9l-0.5,0.8l-2.2-1.6l1.3-1.9l-1.4-1l-1.3,1.9l-2.4-1.7l1.1-1.5l1.5,1l1.1-1.5L45.6,23l-3.8,5.5l1.2,0.8l0.4-0.6l6.1,4.2
		l-0.4,0.6L50.4,34.4z"/>
</g>
</svg>
