{
    "_links": {
        "self": {
            "href": "http:\/\/guts.local\/admin\/structure\/menu\/item\/4\/edit?_format=hal_json"
        },
        "type": {
            "href": "http:\/\/drupal.org\/rest\/type\/menu_link_content\/menu_link_content"
        }
    },
    "id": [
        {
            "value": "4"
        }
    ],
    "uuid": [
        {
            "value": "e0ae9249-8366-415f-ac04-04d110d7ec44"
        }
    ],
    "bundle": [
        {
            "value": "menu_link_content"
        }
    ],
    "title": [
        {
            "value": "Practice",
            "lang": "en"
        }
    ],
    "description": [
        {
            "value": "Practice: the place to practice coding.",
            "lang": "en"
        }
    ],
    "menu_name": [
        {
            "value": "main"
        }
    ],
    "link": [
        {
            "uri": "internal:\/",
            "title": "",
            "options": []
        }
    ],
    "external": [
        {
            "value": "0"
        }
    ],
    "rediscover": [
        {
            "value": "1"
        }
    ],
    "weight": [
        {
            "value": "-47"
        }
    ],
    "expanded": [
        {
            "value": "0"
        }
    ],
    "enabled": [
        {
            "value": "0"
        }
    ],
    "langcode": [
        {
            "value": "en",
            "lang": "en"
        }
    ],
    "changed": [
        {
            "value": "1467741086",
            "lang": "en"
        }
    ],
    "default_langcode": [
        {
            "value": "1",
            "lang": "en"
        }
    ]
}