{
    "_links": {
        "self": {
            "href": "http:\/\/guts.local\/taxonomy\/term\/207?_format=hal_json"
        },
        "type": {
            "href": "http:\/\/drupal.org\/rest\/type\/taxonomy_term\/languages"
        }
    },
    "tid": [
        {
            "value": "207"
        }
    ],
    "uuid": [
        {
            "value": "94dc4db7-0295-4aae-bc78-1caf21b09057"
        }
    ],
    "langcode": [
        {
            "value": "en",
            "lang": "en"
        }
    ],
    "vid": [
        {
            "target_id": "languages"
        }
    ],
    "name": [
        {
            "value": "French Creole",
            "lang": "en"
        }
    ],
    "weight": [
        {
            "value": "0"
        }
    ],
    "changed": [
        {
            "value": "1490185774",
            "lang": "en"
        }
    ],
    "default_langcode": [
        {
            "value": "1",
            "lang": "en"
        }
    ]
}