{
    "_links": {
        "self": {
            "href": "http:\/\/guts.local\/admin\/config\/user-interface\/shortcut\/link\/4?_format=hal_json"
        },
        "type": {
            "href": "http:\/\/drupal.org\/rest\/type\/shortcut\/default"
        }
    },
    "id": [
        {
            "value": 4
        }
    ],
    "uuid": [
        {
            "value": "3d25f386-ef5c-43d3-9790-7312a0c997ad"
        }
    ],
    "langcode": [
        {
            "value": "en",
            "lang": "en"
        }
    ],
    "shortcut_set": [
        {
            "target_id": "default"
        }
    ],
    "title": [
        {
            "value": "Add content",
            "lang": "en"
        }
    ],
    "link": [
        {
            "uri": "internal:\/node\/add",
            "title": null,
            "options": []
        }
    ],
    "default_langcode": [
        {
            "value": true,
            "lang": "en"
        }
    ]
}