{
    "_links": {
        "self": {
            "href": "http:\/\/guts.local\/taxonomy\/term\/6?_format=hal_json"
        },
        "type": {
            "href": "http:\/\/drupal.org\/rest\/type\/taxonomy_term\/forums"
        }
    },
    "tid": [
        {
            "value": "46"
        }
    ],
    "uuid": [
        {
            "value": "ee208ece-340d-4e4b-9b24-67f8d9c501e5"
        }
    ],
    "vid": [
        {
            "target_id": "forums"
        }
    ],
    "langcode": [
        {
            "value": "en",
            "lang": "en"
        }
    ],
    "name": [
        {
            "value": "StarLogo Nova",
            "lang": "en"
        }
    ],
    "weight": [
        {
            "value": "1"
        }
    ],
    "changed": [
        {
            "value": "1465792668",
            "lang": "en"
        }
    ],
    "default_langcode": [
        {
            "value": "1",
            "lang": "en"
        }
    ],
    "forum_container": [
        {
            "value": "0"
        }
    ]
}
