{
    "_links": {
        "self": {
            "href": "http:\/\/guts.local\/curriculum-modules?_format=hal_json"
        },
        "type": {
            "href": "http:\/\/drupal.org\/rest\/type\/node\/page"
        },
        "http:\/\/drupal.org\/rest\/relation\/node\/page\/uid": [
            {
                "href": "http:\/\/guts.local\/user\/1?_format=hal_json",
                "lang": "en"
            }
        ],
        "http:\/\/drupal.org\/rest\/relation\/node\/page\/revision_uid": [
            {
                "href": "http:\/\/guts.local\/user\/1?_format=hal_json"
            }
        ]
    },
    "nid": [
        {
            "value": "21"
        }
    ],
    "uuid": [
        {
            "value": "6822d5e5-fd65-4bd1-ac70-883a71a94953"
        }
    ],
    "vid": [
        {
            "value": "21"
        }
    ],
    "langcode": [
        {
            "value": "en",
            "lang": "en"
        }
    ],
    "type": [
        {
            "target_id": "page"
        }
    ],
    "title": [
        {
            "value": "Curriculum modules",
            "lang": "en"
        }
    ],
    "_embedded": {
        "http:\/\/drupal.org\/rest\/relation\/node\/page\/uid": [
            {
                "_links": {
                    "self": {
                        "href": "http:\/\/guts.local\/user\/1?_format=hal_json"
                    },
                    "type": {
                        "href": "http:\/\/drupal.org\/rest\/type\/user\/user"
                    }
                },
                "uuid": [
                    {
                        "value": "9834b2ca-3d33-4580-9452-a0491e59489a"
                    }
                ],
                "lang": "en"
            }
        ],
        "http:\/\/drupal.org\/rest\/relation\/node\/page\/revision_uid": [
            {
                "_links": {
                    "self": {
                        "href": "http:\/\/guts.local\/user\/1?_format=hal_json"
                    },
                    "type": {
                        "href": "http:\/\/drupal.org\/rest\/type\/user\/user"
                    }
                },
                "uuid": [
                    {
                        "value": "9834b2ca-3d33-4580-9452-a0491e59489a"
                    }
                ]
            }
        ]
    },
    "status": [
        {
            "value": "1",
            "lang": "en"
        }
    ],
    "created": [
        {
            "value": "1467907360",
            "lang": "en"
        }
    ],
    "changed": [
        {
            "value": "1467907517",
            "lang": "en"
        }
    ],
    "promote": [
        {
            "value": "0"
        }
    ],
    "sticky": [
        {
            "value": "0",
            "lang": "en"
        }
    ],
    "revision_timestamp": [
        {
            "value": "1467907517"
        }
    ],
    "revision_translation_affected": [
        {
            "value": "1",
            "lang": "en"
        }
    ],
    "default_langcode": [
        {
            "value": "1",
            "lang": "en"
        }
    ],
    "body": [
        {
            "value": "<p>Here you can share your comments on the Project GUTS curriculum. Click&nbsp;here&nbsp;for help with signing in to add comments (you will need to do this once).<\/p>\r\n",
            "format": "full_html",
            "summary": "",
            "lang": "en"
        }
    ]
}
