{
    "_links": {
        "self": {
            "href": "http:\/\/guts.local\/taxonomy\/term\/4?_format=hal_json"
        },
        "type": {
            "href": "http:\/\/drupal.org\/rest\/type\/taxonomy_term\/forums"
        }
    },
    "tid": [
        {
            "value": "51"
        }
    ],
    "uuid": [
        {
            "value": "e49f717e-78ae-4707-8910-5f571cd5cc13"
        }
    ],
    "vid": [
        {
            "target_id": "forums"
        }
    ],
    "langcode": [
        {
            "value": "en",
            "lang": "en"
        }
    ],
    "name": [
        {
            "value": "Tools",
            "lang": "en"
        }
    ],
    "weight": [
        {
            "value": "7"
        }
    ],
    "changed": [
        {
            "value": "1465792668",
            "lang": "en"
        }
    ],
    "default_langcode": [
        {
            "value": "1",
            "lang": "en"
        }
    ],
    "forum_container": [
        {
            "value": "0"
        }
    ]
}
