<?xml version="1.0" encoding="utf-8"?>
<!-- Generator: Adobe Illustrator 16.0.0, SVG Export Plug-In . SVG Version: 6.00 Build 0)  -->
<!DOCTYPE svg PUBLIC "-//W3C//DTD SVG 1.1//EN" "http://www.w3.org/Graphics/SVG/1.1/DTD/svg11.dtd">
<svg version="1.1" id="Layer_1" xmlns="http://www.w3.org/2000/svg" xmlns:xlink="http://www.w3.org/1999/xlink" x="0px" y="0px"
	 width="521px" height="499.68px" viewBox="0 0 521 499.68" enable-background="new 0 0 521 499.68" xml:space="preserve">
<rect fill="#99BFA3" width="521" height="499.677"/>
<g>
	<defs>
		<rect id="SVGID_1_" width="521" height="499.677"/>
	</defs>
	<clipPath id="SVGID_2_">
		<use xlink:href="#SVGID_1_"  overflow="visible"/>
	</clipPath>
	<path clip-path="url(#SVGID_2_)" fill="#6D6E71" d="M366.966,410.856c-32.793-13.812-64.582-27.218-97.186-40.942
		c-4.369,10.857-8.311,20.61-12.197,30.383c-2.124,5.307,0.882,7.577,5.373,9.204c28.058,10.18,56.096,20.379,84.093,30.722
		c4.925,1.83,7.957,0.685,9.85-4.161C360.046,428.044,363.275,420.053,366.966,410.856 M193.923,97.167
		c91.304,86.926,181.855,173.134,273.097,260.006c-16.166,25.131-32.08,49.888-48.437,75.296
		c-12.489-5.157-24.551-10.125-37.427-15.438c-3.595,8.675-6.933,16.909-10.406,25.097c-6.566,15.517-16.383,19.705-32.312,13.917
		c-27.176-9.864-54.372-19.685-81.542-29.579c-15.474-5.633-19.816-15.385-13.751-31.027c3.921-10.152,8.032-20.224,12.523-31.494
		c-60.96-25.768-121.458-51.345-183.272-77.479C113.046,223.144,153.139,160.698,193.923,97.167"/>
	<path clip-path="url(#SVGID_2_)" fill="#6D6E71" d="M480.12,394.828c-13.581,21.355-17.529,27.394-31.287,48.641
		c-5.888,9.064-13.289,11.532-19.89,7.005c-6.296-4.308-6.791-11.484-1.167-20.295c13.961-21.878,28.011-43.7,42.006-65.564
		c3.684-5.754,10.745-8.417,17.108-5.436C503.66,365.149,481.966,391.927,480.12,394.828"/>
	<path clip-path="url(#SVGID_2_)" fill="#6D6E71" d="M50.811,289.569c-9.179-2.929-12.035-5.958-13.201-9.495
		c-1.574-4.806-0.435-9.638,2.048-13.847c10.746-18.245,22.631-35.818,34.083-53.649c27.529-42.826,55.03-85.666,82.573-128.485
		c2.076-3.233,3.982-6.662,6.533-9.502c5.21-5.794,11.729-6.845,18.222-2.629c6.519,4.243,8.1,10.729,4.796,17.723
		c-2.171,4.609-5.292,8.784-8.073,13.107c-37.609,58.556-75.151,117.16-113.012,175.567
		C61.591,283.286,59.25,289.569,50.811,289.569"/>
	<path clip-path="url(#SVGID_2_)" fill="#FFFFFF" d="M285.465,227.813c37.128,20.834,28.587,81.627,28.302,83.382
		c-0.285,1.756-0.597,3.314-0.597,3.314l-4.742,0.576c-0.169,0.759,0.021,7.983,3.331,12.043c3.324,4.066,9.029,4.765,9.029,4.765
		s1.391,0.305,1.554,0.705c0.597,1.396-0.957,2.135-0.957,2.135s-5.312,1.701-11.912-0.062c-7.231-1.925-14.151-9.691-14.151-9.691
		s-0.929,6.757-2.178,10.519c-1.153,3.49-5.236,2.812-5.236,2.812s-6.906-1.519-11.153-2.745c-3.025-0.874-13.866-3.32-13.717-6.771
		c0.115-2.439,3.256-11.69,3.256-11.69s-5.236-1.187-10.691-4.324c-5.447-3.131-10.148-9.678-10.148-9.678
		s-7.958,1.877-14.036,0.494c-6.078-1.355-10.63-4.791-10.63-4.791s-0.57,1.294-4.301,8.105c-2.185,3.985-6.268,1.6-6.268,1.6
		s-15.929-8.642-21.193-12.531c-2.659-1.959,2.781-9.38,2.781-9.38l3.256-5.178c0,0-10.82-0.875-21.885-12.87
		c-7.381-8.018-7.639-20.766-7.639-20.766s-3.202-1.268-7.476-4.73c-4.274-3.463-8.208-8.526-4.213-18.909
		c0.021-0.054,0.034-0.102,0.061-0.156l0.095-0.244c4.003-9.59,16.926-13.175,24.883-11.291c8.046,1.912,11.112,7.991,11.763,11.969
		c0.801,4.975-2.381,19.912-1.384,23.118c0.909,2.948,5.943,5.144,5.943,5.144s0.922,0.841,1.302,0.074l0.543-1.199
		c0,0,3.853,2.799,5.508,2.189c1.255-0.475,7.069-7.293,7.069-7.293c13.12-14.137,35.052-35.886,67.662-22.602
		C279.949,224.94,282.67,226.255,285.465,227.813"/>
	<path clip-path="url(#SVGID_2_)" fill="#6D6E71" d="M291.082,238.461c0.882,1.152,1.791,2.297,2.686,3.45
		c0.896,1.152,1.791,2.304,2.687,3.457c0.896,1.159,1.798,2.311,2.693,3.463c0.896,1.152,1.798,2.305,2.707,3.47
		c1.181-0.162,2.334-0.325,3.474-0.474c0.095-0.156,0-0.251-0.048-0.366c-0.617-1.301-1.275-2.582-2.001-3.836
		c-1.724-2.989-3.65-5.829-5.889-8.465c-1.33-1.573-2.754-3.05-4.328-4.378c-0.095-0.088-0.203-0.169-0.359-0.292
		C292.153,235.838,291.624,237.139,291.082,238.461 M240.759,227.414c0.597-0.041,17.082-2.318,17.421-2.413
		c0.543-1.328,1.085-2.657,1.628-3.985c-0.082-0.143-0.217-0.129-0.333-0.136c-0.882-0.027-1.764-0.081-2.646-0.074
		c-2.748,0.006-5.475,0.352-8.161,0.881c-3.107,0.61-6.146,1.457-9.104,2.568c-0.292,0.122-0.583,0.237-0.957,0.387
		C239.361,225.598,240.06,226.506,240.759,227.414 M195.87,253.534c-2.083,4.994-5.604,13.703-5.691,14.056
		c0.041,0.007,0.095,0.034,0.136,0.021c5.223-0.705,10.44-1.417,15.603-2.128c0.068-0.048,0.082-0.048,0.095-0.062
		c0.014-0.007,0.027-0.026,0.027-0.033c2.171-5.307,4.342-10.606,6.506-15.907c0.027-0.075,0.047-0.143,0.068-0.204
		c-0.197-0.345-1.96-2.616-2.266-2.9c-0.075,0.081-0.184,0.149-0.251,0.237c-0.489,0.549-0.977,1.084-1.452,1.64
		c-1.37,1.606-2.72,3.199-4.199,4.697c-0.427,0.434-0.875,0.86-1.33,1.254c-0.481,0.434-1.038,0.738-1.703,0.819
		c-0.353,0.034-0.699,0.021-1.058-0.033c-0.937-0.136-1.805-0.488-2.659-0.929c-0.468-0.244-0.923-0.528-1.377-0.8
		c-0.061-0.034-0.129-0.067-0.258-0.129C195.985,253.29,195.917,253.405,195.87,253.534 M312.288,314.354
		c0.027-0.224,0.081-0.461,0.129-0.705c0.44-2.379,0.679-4.777,0.875-7.19c0.502-6.397,0.569-12.803,0.217-19.2
		c-0.014-0.23,0.014-0.454-0.067-0.671c-0.414,0-6.377,0.82-6.784,0.942c-0.041,0.115-0.108,0.257-0.163,0.399
		c-2.082,5.097-4.172,10.2-6.247,15.311c-0.218,0.521-0.225,0.42,0.122,0.826c2.523,2.996,5.054,5.978,7.591,8.96
		c0.454,0.549,0.923,1.098,1.363,1.627C309.914,314.652,311.936,314.441,312.288,314.354 M238.704,228.959
		c-0.808-1.05-1.648-2.121-2.476-3.192c-0.197-0.027-0.339,0.088-0.482,0.156c-1.967,0.983-3.86,2.067-5.719,3.246
		c-3.053,1.959-5.942,4.155-8.704,6.513c-3.073,2.63-5.977,5.456-8.792,8.37c-0.102,0.095-0.183,0.197-0.265,0.298
		c0.163,0.318,1.94,2.65,2.483,3.232c0.339,0,16.77-2.236,17.353-2.365C232.374,244.669,238.547,229.481,238.704,228.959
		 M313.075,283.971c0.054,0,0.108-0.034,0.189-0.054c-0.007-0.177-0.014-0.346-0.027-0.509c-0.353-3.992-0.882-7.963-1.635-11.895
		c-0.949-4.92-2.245-9.759-4.022-14.456c-0.299-0.786-0.61-1.565-0.923-2.331c-0.061-0.143-0.122-0.278-0.177-0.413
		c-0.359-0.014-3.534,0.399-4.273,0.556c0,0.014-0.014,0.021-0.027,0.026c-0.014,0.014-0.014,0.021-0.026,0.034
		c-0.218,0.509-0.421,1.017-0.632,1.525c-1.974,4.846-3.941,9.712-5.915,14.592c0.088,0.128,0.184,0.264,0.285,0.386
		c1.404,1.816,2.802,3.619,4.199,5.422c1.987,2.555,3.988,5.117,5.977,7.679c0.088,0.115,0.196,0.23,0.298,0.359
		C308.611,284.588,310.85,284.282,313.075,283.971 M288.653,237.478c0.203-0.345,1.709-4.005,1.927-4.656
		c-0.068-0.061-0.129-0.149-0.218-0.21c-1.303-1.023-2.659-1.973-4.07-2.854c-1.303-0.793-2.632-1.525-3.981-2.223
		c-1.567-0.813-3.169-1.586-4.797-2.257c-0.394-0.169-0.773-0.359-1.174-0.515c-1.465-0.556-2.93-1.111-4.437-1.565
		c-1.764-0.542-3.548-1.01-5.353-1.369c-1.207-0.25-2.428-0.454-3.649-0.603c-0.122-0.014-0.237-0.014-0.339-0.021
		c-0.19,0.333-1.832,4.324-1.974,4.792c0,0.013,0.006,0.034,0.006,0.054c0,0.013,0,0.027,0.014,0.041
		c0.048,0.068,0.102,0.142,0.163,0.21c3.5,4.514,7.001,9.021,10.542,13.568C277.113,239.071,282.894,238.271,288.653,237.478
		 M234.552,246.173c0,0.034,0.007,0.054,0.014,0.075c0,0.007,0,0.021,0.007,0.041c0.041,0.061,0.088,0.122,0.136,0.183
		c3.514,4.521,7.042,9.034,10.535,13.534c0.041,0.021,0.054,0.027,0.061,0.027c0.021,0.007,0.041,0.014,0.047,0
		c0.17-0.014,0.333-0.027,0.509-0.048c5.549-0.766,11.099-1.531,16.661-2.297c0.027,0,0.055-0.021,0.081-0.027
		c0.014-0.007,0.027-0.021,0.062-0.048c2.178-5.319,4.349-10.66,6.52-15.994c0-0.027-0.014-0.041-0.014-0.054s0-0.034-0.014-0.041
		c-0.041-0.061-0.074-0.129-0.122-0.19c-3.534-4.547-7.069-9.082-10.61-13.629c-0.014-0.02-0.048-0.034-0.075-0.054
		c-0.333,0.007-16.695,2.237-17.251,2.372C238.914,235.418,236.729,240.806,234.552,246.173 M271.707,242.521
		c-0.055,0.047-0.075,0.047-0.081,0.061c-0.007,0.014-0.021,0.027-0.027,0.034c-0.041,0.082-0.082,0.163-0.122,0.251
		c-2.137,5.246-4.274,10.491-6.404,15.717c0.014,0.189,0.143,0.291,0.23,0.406c1.873,2.427,3.759,4.839,5.631,7.252
		c1.526,1.945,3.039,3.891,4.559,5.842c0.095,0.115,0.184,0.237,0.299,0.38c5.793-0.793,11.587-1.586,17.339-2.379
		c0.055-0.034,0.055-0.048,0.068-0.054c0.014-0.014,0.027-0.021,0.027-0.041c2.15-5.26,4.301-10.519,6.444-15.771
		c0.034-0.088,0.068-0.176,0.095-0.264c0.014-0.021,0.014-0.055,0.014-0.115c-3.562-4.582-7.15-9.177-10.731-13.792
		C283.232,240.874,277.446,241.707,271.707,242.521 M293.578,272.714c-0.19-0.068-0.353-0.007-0.516,0.014
		c-2.252,0.305-4.505,0.609-6.757,0.915c-3.175,0.44-6.336,0.874-9.504,1.314c-0.217,0.027-0.428,0.061-0.645,0.088
		c-2.198,5.395-4.396,10.783-6.587,16.157c0.183,0.318,10.406,13.467,10.738,13.833c0.014,0.007,0.021,0.014,0.041,0.02
		c0.014,0,0.027,0.007,0.048,0.007c0.088-0.013,0.183-0.013,0.271-0.033c5.624-0.767,11.234-1.539,16.858-2.312
		c0.027-0.007,0.041-0.027,0.067-0.034c0.027-0.02,0.041-0.02,0.048-0.033c0.007-0.007,0.021-0.027,0.027-0.041
		c0.054-0.136,0.115-0.271,0.169-0.413c2.124-5.191,4.24-10.383,6.363-15.574c0-0.034,0-0.062,0.014-0.163
		C300.66,281.884,297.119,277.288,293.578,272.714 M273.729,274.15c-0.041-0.196-0.177-0.318-0.292-0.461
		c-1.051-1.362-2.116-2.718-3.175-4.08c-2.32-2.988-4.646-5.984-6.98-8.979c-0.081-0.115-0.189-0.237-0.271-0.346
		c-0.387,0-16.613,2.223-17.353,2.365c-0.013,0.014-0.027,0.014-0.034,0.027c-0.014,0.013-0.027,0.02-0.034,0.033
		c-2.157,5.307-4.328,10.606-6.499,15.907c-0.027,0.074-0.054,0.148-0.068,0.189c0,0.04,0,0.061,0.014,0.074
		c0,0.014,0,0.027,0.013,0.041c0.129,0.169,0.258,0.346,0.38,0.508c3.419,4.398,6.852,8.804,10.271,13.195
		c0.014,0.027,0.054,0.034,0.108,0.075c5.753-0.793,11.532-1.579,17.326-2.379C269.34,284.893,271.53,279.519,273.729,274.15
		 M230.366,248.105c-4.884,0.664-9.755,1.335-14.633,2.006c-0.801,0.115-0.604-0.014-0.902,0.691
		c-2.062,5.029-4.111,10.072-6.16,15.1c-0.068,0.176-0.136,0.346-0.217,0.521c3.596,4.623,7.178,9.218,10.732,13.792
		c0.054,0.027,0.061,0.034,0.074,0.041c0.014,0,0.034,0.007,0.041,0c5.665-0.772,11.322-1.545,16.987-2.324
		c0.068-0.014,0.156-0.021,0.224-0.041c0.027-0.007,0.061-0.027,0.088-0.034c0.258-0.468,6.404-15.602,6.573-16.259
		c-3.555-4.567-7.129-9.17-10.705-13.778C231.743,247.909,231.058,248.003,230.366,248.105 M186.149,270.822
		c0.054-0.128,5.882-14.395,8.738-21.409c0.875,0.522,1.75,1.037,2.632,1.559c0.407,0.251,0.814,0.481,1.214,0.726
		c0.414,0.251,0.841,0.434,1.282,0.583c0.285,0.108,0.597,0.148,0.882,0.21c0.217,0.047,0.394-0.021,0.543-0.17
		c0.298-0.264,0.597-0.515,0.882-0.8c0.983-0.962,1.893-1.979,2.788-3.016c0.739-0.833,1.438-1.694,2.178-2.528
		c0.712-0.807,1.452-1.593,2.198-2.379c2.429-2.562,4.912-5.062,7.517-7.455c3.202-2.921,6.546-5.646,10.135-8.072
		c3.093-2.101,6.336-3.944,9.755-5.462c1.357-0.597,2.741-1.098,4.152-1.559c3.772-1.227,7.625-2.101,11.573-2.542
		c2.266-0.237,4.525-0.353,6.797-0.183c2.292,0.169,4.573,0.441,6.838,0.868c1.425,0.264,2.835,0.576,4.233,0.949
		c1.071,0.298,2.13,0.637,3.188,0.976c0.536,0.163,1.072,0.359,1.602,0.536c0.041,0.02,0.115,0,0.17-0.007
		c1.384,0.562,2.761,1.125,4.145,1.681c0.055,0.142,0.183,0.163,0.285,0.21c0.78,0.359,1.56,0.712,2.319,1.098
		c1.018,0.501,2.035,1.043,3.04,1.586c1.173,0.617,2.299,1.314,3.405,2.02c1.967,1.261,3.785,2.725,5.604,4.182
		c2.157,1.735,4.043,3.748,5.779,5.89c2.375,2.914,4.437,6.039,6.214,9.332c0.692,1.261,1.33,2.542,1.887,3.857
		c0.461,1.077,0.875,2.175,1.315,3.267c0.882,2.202,1.669,4.445,2.348,6.723c1.343,4.419,2.32,8.926,3.025,13.494
		c0.638,4.073,1.045,8.173,1.275,12.294c0.387,7.123,0.258,14.232-0.4,21.335c-0.251,2.725-0.685,5.429-1.234,8.119
		c-0.4,0.129-0.814,0.115-1.215,0.163c-0.42,0.054-0.841,0.081-1.275,0.122c-0.406,0.04-0.813,0.074-1.234,0.108
		c-0.421,0.054-0.841,0.108-1.275,0.135c-0.4,0.027-0.801,0.108-1.207,0.082c-0.055-0.048-0.103-0.095-0.143-0.136
		c-1.241-1.471-2.49-2.948-3.738-4.433c-2.008-2.372-4.009-4.737-6.024-7.109c-0.386-0.461-0.217-0.427-0.882-0.332
		c-5.895,0.813-11.804,1.613-17.698,2.427c-0.184,0.033-0.367,0.04-0.563,0.067c-0.475-0.63-11.126-14.334-11.635-14.938
		c-0.183,0.014-14.632,1.999-18.404,2.515c-0.163,0.021-0.332,0.034-0.502,0.054c-0.651-0.847-11.017-14.198-11.682-14.998
		c-6.295,0.861-12.543,1.729-18.818,2.589c-3.894-5.021-7.788-10.017-11.675-15.012c-0.197,0.027-20.101,2.792-20.243,2.819
		C186.203,270.843,186.149,270.822,186.149,270.822"/>
</g>
</svg>
