{
    "_links": {
        "self": {
            "href": "http:\/\/guts.local\/taxonomy\/term\/31?_format=hal_json"
        },
        "type": {
            "href": "http:\/\/drupal.org\/rest\/type\/taxonomy_term\/content_type"
        }
    },
    "tid": [
        {
            "value": "31"
        }
    ],
    "uuid": [
        {
            "value": "43dd1dc2-f137-4070-abac-d529c9205ea9"
        }
    ],
    "vid": [
        {
            "target_id": "content_type"
        }
    ],
    "langcode": [
        {
            "value": "en",
            "lang": "en"
        }
    ],
    "name": [
        {
            "value": "Lesson Plan",
            "lang": "en"
        }
    ],
    "weight": [
        {
            "value": "0"
        }
    ],
    "changed": [
        {
            "value": "1466116596",
            "lang": "en"
        }
    ],
    "default_langcode": [
        {
            "value": "1",
            "lang": "en"
        }
    ]
}