{
    "_links": {
        "self": {
            "href": "http:\/\/guts.local\/taxonomy\/term\/7?_format=hal_json"
        },
        "type": {
            "href": "http:\/\/drupal.org\/rest\/type\/taxonomy_term\/forums"
        }
    },
    "tid": [
        {
            "value": "47"
        }
    ],
    "uuid": [
        {
            "value": "6199d8ae-3af8-4725-92e4-a2cdeffc4f4b"
        }
    ],
    "vid": [
        {
            "target_id": "forums"
        }
    ],
    "langcode": [
        {
            "value": "en",
            "lang": "en"
        }
    ],
    "name": [
        {
            "value": "NetLogo",
            "lang": "en"
        }
    ],
    "weight": [
        {
            "value": "2"
        }
    ],
    "changed": [
        {
            "value": "1465792668",
            "lang": "en"
        }
    ],
    "default_langcode": [
        {
            "value": "1",
            "lang": "en"
        }
    ],
    "forum_container": [
        {
            "value": "0"
        }
    ]
}
