{
    "_links": {
        "self": {
            "href": "http:\/\/guts.local\/admin\/structure\/menu\/item\/9\/edit?_format=hal_json"
        },
        "type": {
            "href": "http:\/\/drupal.org\/rest\/type\/menu_link_content\/menu_link_content"
        }
    },
    "id": [
        {
            "value": "9"
        }
    ],
    "uuid": [
        {
            "value": "c37f4e92-857b-40e3-bf00-bc265e5974e3"
        }
    ],
    "bundle": [
        {
            "value": "menu_link_content"
        }
    ],
    "title": [
        {
            "value": "Join",
            "lang": "en"
        }
    ],
    "description": [
        {
            "value": "Join Teachers with GUTS!",
            "lang": "en"
        }
    ],
    "menu_name": [
        {
            "value": "visitor-menu"
        }
    ],
    "link": [
        {
            "uri": "internal:\/user\/register",
            "title": "",
            "options": []
        }
    ],
    "external": [
        {
            "value": "0"
        }
    ],
    "rediscover": [
        {
            "value": "1"
        }
    ],
    "weight": [
        {
            "value": "0"
        }
    ],
    "expanded": [
        {
            "value": "0"
        }
    ],
    "enabled": [
        {
            "value": "1"
        }
    ],
    "langcode": [
        {
            "value": "en",
            "lang": "en"
        }
    ],
    "changed": [
        {
            "value": "1452553282",
            "lang": "en"
        }
    ],
    "default_langcode": [
        {
            "value": "1",
            "lang": "en"
        }
    ]
}
