<?xml version="1.0" encoding="utf-8"?>
<!-- Generator: Adobe Illustrator 19.2.1, SVG Export Plug-In . SVG Version: 6.00 Build 0)  -->
<svg version="1.1" id="Layer_1" xmlns="http://www.w3.org/2000/svg" xmlns:xlink="http://www.w3.org/1999/xlink" x="0px" y="0px"
	 viewBox="0 0 140 120" style="enable-background:new 0 0 140 120;" xml:space="preserve">
<style type="text/css">
	.st0{fill:#52564B;}
	.st1{font-family:'SerifaBT-BoldCondensed';}
	.st2{font-size:16px;}
	.st3{clip-path:url(#SVGID_2_);fill:#52564B;}
	.st4{clip-path:url(#SVGID_2_);fill:#5EB4C9;}
	.st5{clip-path:url(#SVGID_2_);}
	.st6{clip-path:url(#SVGID_2_);fill:#FFFFFF;}
	.st7{clip-path:url(#SVGID_2_);fill:#B5B6AC;}
</style>
<g>
	<path class="st0" d="M50.8,32.3l0.4-0.5l-5.9-4.5l-0.4,0.5l-1.2-0.9l4-5.3l2.6,2l-1.1,1.5L47.8,24l-1.1,1.5l2.3,1.8l1.4-1.8
		l1.4,1.1l-1.4,1.8l2.2,1.7l0.6-0.8l1.2,0.9L52,33.2L50.8,32.3z"/>
</g>
<g>
	<path class="st0" d="M49.7,19.6l1.5-1.5l1.4,1.5L51.1,21L49.7,19.6z M55.6,26.5l0.4-0.4l-3.2-3.2l-0.4,0.4l-1-1l1.9-1.9l4.2,4.3
		l0.4-0.4l1,1.1l-2.4,2.3L55.6,26.5z"/>
</g>
<g>
	<path class="st0" d="M58.7,23.3l0.5-0.3l-2.7-3.6l-0.5,0.3l-0.8-1.2l2-1.5l0.6,0.9c-0.1-1,0.2-1.7,0.9-2.2c1.1-0.8,2.1-0.6,3.1,0.8
		l2.2,3l0.5-0.3l0.9,1.2l-2.6,1.9L61.9,21l0.4-0.3l-2-2.8c-0.5-0.7-0.9-0.8-1.4-0.5c-0.5,0.3-0.5,0.8,0,1.5l2,2.8l0.4-0.3l0.9,1.2
		l-2.6,1.9L58.7,23.3z"/>
</g>
<g>
	<path class="st0" d="M69.6,18.2l-0.5-0.9c0,0.9-0.4,1.5-1.1,1.9c-1.1,0.5-2.1-0.1-3-1.8l-0.7-1.5c-0.9-1.9-0.9-3,0.4-3.6
		c0.6-0.3,1.1-0.2,1.7,0.1l-1.1-2.2l-0.5,0.2L64.1,9l2.4-1.2l4.1,8.2l0.5-0.3l0.7,1.3L69.6,18.2z M67.4,14.1c-0.5-0.9-1-1.3-1.4-1.1
		c-0.5,0.2-0.4,0.7,0.1,1.6l0.8,1.7c0.4,0.9,0.7,1.3,1.3,1c0.5-0.2,0.4-0.8,0-1.6L67.4,14.1z"/>
</g>
<text transform="matrix(0.9432 -0.3322 0.3322 0.9432 72.1357 17.0121)" class="st0 st1 st2"> </text>
<g>
	<path class="st0" d="M78.4,13.4l0.6-0.1l0.3,1.5l-3.1,0.5l-0.3-1.5l0.7-0.1l-1.2-7.3l-0.7,0.1l-0.2-1.5l4.1-0.7l1.9,5.2
		c0.4,1.1,0.8,2.2,1,3.3l0.1,0c-0.1-1.6-0.1-2.8-0.1-3.5l0.2-5.5l4.1-0.7l0.2,1.5l-0.6,0.1l1.2,7.3l0.6-0.1l0.3,1.5l-3.3,0.5
		l-0.3-1.5l0.6-0.1l-1.3-7.6l-0.1,0l-0.4,9.5l-2.1,0.4l-3.4-8.8l-0.1,0c0.2,0.8,0.3,1.4,0.4,1.9L78.4,13.4z"/>
</g>
<g>
	<path class="st0" d="M91.3,14.2c-1.7-0.1-2.5-1.2-2.4-3.2L89,9.3c0.1-2.1,1-3,2.8-2.9c1.7,0.1,2.5,1.1,2.4,2.8l-0.1,1.8l-3.3-0.2
		l-0.1,0.8c-0.1,0.8,0.2,1.3,0.7,1.3c0.5,0,0.7-0.4,0.8-1.2l1.9,0.1C94,13.4,93,14.3,91.3,14.2z M92.3,9.5l0.1-0.8
		c0-0.7-0.2-1-0.6-1c-0.5,0-0.7,0.3-0.8,1l0,0.7L92.3,9.5z"/>
</g>
<g>
	<path class="st0" d="M95.3,12.7l0.6,0.2l1.2-4.4l-0.6-0.2l0.4-1.4l2.4,0.6l-0.3,1c0.7-0.7,1.4-0.9,2.3-0.7c0.8,0.2,1.4,0.8,1.5,1.5
		c0.6-0.6,1.3-0.7,2.1-0.5c1.2,0.3,1.6,1.3,1.2,2.9l-1,3.5l0.5,0.1l-0.4,1.4l-3-0.8l0.4-1.4l0.5,0.1l0.9-3.3
		c0.2-0.8,0.1-1.2-0.4-1.4c-0.5-0.1-0.9,0.2-1.1,1l-0.9,3.3l0.5,0.1l-0.4,1.4l-3-0.8l0.4-1.4l0.5,0.1l0.9-3.3
		c0.2-0.8,0.1-1.2-0.4-1.4c-0.5-0.1-0.9,0.2-1.1,1L98,13.4l0.5,0.1l-0.4,1.4l-3.1-0.8L95.3,12.7z"/>
</g>
<g>
	<path class="st0" d="M106.8,16.1l0.5,0.3l3.6-6.8l-0.5-0.3L111,8l2.4,1.3l-1.8,3.4c0.6-0.4,1.2-0.4,1.7-0.1
		c1.2,0.6,1.2,1.8,0.3,3.6l-0.8,1.5c-0.9,1.8-2,2.3-3.1,1.8c-0.7-0.4-1.1-1-1.1-1.9l-0.5,0.9l-2.1-1.1L106.8,16.1z M109.7,17.7
		c0.5,0.3,0.8-0.1,1.3-1l0.9-1.7c0.5-0.9,0.6-1.3,0.1-1.6c-0.4-0.2-0.9,0.1-1.4,1l-0.8,1.5C109.3,16.9,109.2,17.5,109.7,17.7z"/>
</g>
<g>
	<path class="st0" d="M114.5,22.6c-1.4-1-1.5-2.4-0.3-3.9l1-1.4c1.2-1.7,2.5-2,3.9-0.9c1.4,1,1.6,2.3,0.6,3.6l-1,1.4l-2.7-1.9
		l-0.5,0.7c-0.5,0.7-0.5,1.2-0.2,1.5c0.4,0.3,0.8,0.1,1.3-0.6l1.5,1.1C117.2,23.5,115.9,23.7,114.5,22.6z M117.9,19.2l0.5-0.6
		c0.4-0.5,0.4-1,0-1.2c-0.4-0.3-0.8-0.1-1.2,0.5l-0.4,0.6L117.9,19.2z"/>
</g>
<g>
	<path class="st0" d="M118.6,23.8l0.4,0.4l3.2-3.2l-0.4-0.4l1-1l1.8,1.7l-1,1.1c1.1-0.6,1.9-0.5,2.6,0.2c0.1,0.1,0.1,0.1,0.2,0.2
		l-1.4,1.4c-0.1-0.1-0.2-0.2-0.2-0.3c-0.8-0.8-1.6-0.7-2.6,0.3l-1.5,1.5l0.5,0.5l-1,1.1l-2.5-2.4L118.6,23.8z"/>
</g>
<g>
	<path class="st0" d="M123.6,27l1.1,1.4c-0.7,0.6-0.8,1.1-0.5,1.5c0.3,0.3,0.7,0.4,1,0.1c0.5-0.4,0.2-1,0-2.1
		c-0.3-1.2-0.1-2,0.6-2.6c1-0.8,2.1-0.7,2.9,0.2c0.5,0.6,0.7,1.2,0.4,1.8l0.5-0.4l1,1.2l-1.8,1.5l-1.1-1.4c0.6-0.5,0.7-1,0.5-1.4
		c-0.3-0.3-0.6-0.3-0.9-0.1c-0.5,0.4-0.3,1,0,2.1c0.3,1.2,0.2,2-0.7,2.7c-1,0.8-2.2,0.7-3-0.3c-0.5-0.6-0.6-1.2-0.3-1.9l-0.6,0.5
		l-1-1.2L123.6,27z"/>
</g>
<g>
	<defs>
		<rect id="SVGID_1_" x="3.3" y="-2.3" width="145.4" height="120.4"/>
	</defs>
	<clipPath id="SVGID_2_">
		<use xlink:href="#SVGID_1_"  style="overflow:visible;"/>
	</clipPath>
	<path class="st3" d="M13.2,118.1c2.3-1.5,4.6-3,7-4.5c8.4-5.4,16.9-10.7,25.3-16.1c2.1-1.4,2.7-3.5,1.6-5.8c0,0,0-0.1,0-0.1
		c3.8-2.4,7.5-4.8,11.3-7.2c1,1,1.9,2.2,3,3.2c4.3,4.2,9.3,7.3,15,9.2c18.8,6.3,39.3-2.2,48-20.1c0.9-1.8,1.5-3.7,2.2-5.6
		c0.1-0.2,0.1-0.3,0.2-0.4c0.4-1.8,0.8-3.6,1.2-5.4c0-0.2,0-0.4,0-0.5c0.1-1,0.3-2.1,0.3-3.1c0.5-9.7-2.2-18.5-8.2-26.2
		c-4.4-5.8-10.1-10-16.9-12.6c-1-0.4-2.1-0.8-3.1-1.1c-1.8-0.4-3.6-0.8-5.4-1.2c-1.1-0.1-2.2-0.2-3.3-0.3
		c-6.3-0.4-12.4,0.6-18.2,3.2c-9,4-15.8,10.3-19.9,19.3C48,54.1,48.1,65.6,53.5,77c0,0.1,0.1,0.2,0.1,0.3c0,0,0,0,0,0
		c-3.8,2.4-7.5,4.8-11.2,7.1c-0.6-0.5-1.2-1.1-1.9-1.4c-1.4-0.7-2.8-0.5-4.1,0.4c-4.9,3.2-9.9,6.3-14.8,9.4
		C15.8,96.5,10,100.3,4.1,104c-0.2,0.1-0.3,0.2-0.5,0.3c-0.1,0.4-0.2,0.8-0.3,1.2c2.6,4.1,5.2,8.2,7.8,12.2
		C11.8,117.8,12.5,118,13.2,118.1"/>
	<path class="st4" d="M121.1,57.1c-0.1-0.7,0.4-1.4,1.1-1.6c0,0,0,0,0,0c-0.7,0-1.3-0.5-1.4-1.2c-0.1-0.7,0.3-1.4,0.9-1.7
		c0,0,0,0,0,0c-0.7,0-1.3-0.4-1.5-1.1c-0.2-0.7,0.1-1.5,0.8-1.8c0,0,0,0,0,0c-0.7,0.1-1.4-0.3-1.6-0.9c-0.3-0.7,0-1.5,0.6-1.8
		c0,0,0,0,0,0c-0.7,0.2-1.4-0.1-1.7-0.8c-0.3-0.7-0.1-1.4,0.4-1.9c0,0,0,0,0,0c-0.7,0.2-1.4,0-1.7-0.6c-0.4-0.6-0.3-1.4,0.3-1.9
		c0,0,0,0,0,0c-0.7,0.3-1.4,0.1-1.8-0.5c-0.4-0.6-0.4-1.4,0.1-1.9c0,0,0,0,0,0c-0.6,0.3-1.4,0.2-1.8-0.3c-0.5-0.6-0.5-1.4-0.1-1.9
		c0,0,0,0,0,0c-0.6,0.4-1.3,0.3-1.8-0.1c-0.5-0.5-0.6-1.3-0.2-1.9c0,0,0,0,0,0c-0.6,0.4-1.3,0.5-1.9,0c-0.6-0.5-0.7-1.3-0.4-1.9
		c0,0,0,0,0,0c-0.5,0.5-1.3,0.6-1.9,0.2c-0.6-0.4-0.8-1.2-0.6-1.9c0,0,0,0,0,0c-0.5,0.5-1.2,0.7-1.8,0.4c-0.7-0.3-1-1.1-0.7-1.8
		c0,0,0,0,0,0c-0.4,0.6-1.2,0.8-1.8,0.5c-0.7-0.3-1-1-0.9-1.7c0,0,0,0,0,0c-0.4,0.6-1.1,0.9-1.8,0.7c-0.7-0.2-1.1-0.9-1-1.7
		c0,0,0,0,0,0c-0.3,0.6-1,1-1.7,0.8c-0.7-0.2-1.2-0.8-1.2-1.6c0,0,0,0,0,0c-0.2,0.7-0.9,1.1-1.6,1c-0.7-0.1-1.3-0.7-1.3-1.5
		c0,0,0,0,0,0c-0.2,0.7-0.8,1.2-1.5,1.1c-0.6,0-1.1-0.4-1.3-0.9c-0.2,0.5-0.6,0.9-1.2,0.9c-0.7,0.1-1.3-0.3-1.5-0.9
		c-0.2,0.5-0.7,0.9-1.2,1c-0.7,0.1-1.4-0.4-1.6-1.1c0,0,0,0,0,0c0,0.7-0.5,1.3-1.2,1.5c-0.7,0.2-1.4-0.2-1.7-0.9c0,0,0,0,0,0
		c0.1,0.7-0.4,1.4-1.1,1.6C79.7,29,79,28.6,78.7,28c0,0,0,0,0,0c0.1,0.7-0.2,1.4-0.9,1.6c-0.7,0.3-1.5,0-1.9-0.6c0,0,0,0,0,0
		c0.2,0.7-0.1,1.4-0.7,1.7c-0.7,0.3-1.5,0.2-1.9-0.4c0,0,0,0,0,0c0.2,0.7,0,1.4-0.6,1.8c-0.6,0.4-1.4,0.3-1.9-0.3c0,0,0,0,0,0
		c0.3,0.6,0.1,1.4-0.4,1.8c-0.6,0.5-1.4,0.4-1.9-0.1c0,0,0,0,0,0c0.3,0.6,0.2,1.4-0.3,1.8c-0.5,0.5-1.4,0.5-1.9,0.1c0,0,0,0,0,0
		c0.4,0.6,0.4,1.4-0.1,1.9C65.4,38,64.6,38,64,37.6c0,0,0,0,0,0c0.4,0.5,0.5,1.3,0.1,1.9c-0.5,0.6-1.2,0.8-1.9,0.4c0,0,0,0,0,0
		c0.5,0.5,0.6,1.3,0.2,1.8c-0.4,0.6-1.2,0.9-1.9,0.6c0,0,0,0,0,0c0.5,0.5,0.7,1.2,0.4,1.8c-0.3,0.7-1.1,1-1.8,0.7c0,0,0,0,0,0
		c0.6,0.4,0.8,1.1,0.6,1.8c-0.3,0.7-1,1.1-1.7,0.9c0,0,0,0,0,0c0.6,0.4,0.9,1.1,0.7,1.7c-0.2,0.7-0.9,1.2-1.6,1.1c0,0,0,0,0,0
		c0.6,0.3,1,1,0.9,1.7c-0.2,0.7-0.8,1.2-1.6,1.2c0,0,0,0,0,0c0.7,0.2,1.1,0.9,1,1.6c-0.1,0.7-0.7,1.3-1.4,1.3c0,0,0,0,0,0
		c0.7,0.2,1.2,0.8,1.2,1.5c0,0.8-0.6,1.3-1.3,1.4c0,0,0,0,0,0c0.7,0.1,1.2,0.7,1.3,1.4c0,0.8-0.5,1.4-1.2,1.6c0,0,0,0,0,0
		c0.7,0.1,1.3,0.6,1.4,1.3c0.1,0.7-0.3,1.4-1.1,1.7c0,0,0,0,0,0c0.7,0,1.3,0.4,1.5,1.1c0.2,0.7-0.2,1.5-0.9,1.8c0,0,0,0,0,0
		c0.7-0.1,1.4,0.3,1.6,1c0.2,0.7-0.1,1.5-0.7,1.8c0,0,0,0,0,0c0.7-0.1,1.4,0.2,1.7,0.9c0.3,0.7,0.1,1.5-0.6,1.9c0,0,0,0,0,0
		c0.7-0.2,1.4,0.1,1.7,0.7c0.4,0.7,0.2,1.4-0.4,1.9c0,0,0,0,0,0c0.7-0.3,1.4,0,1.8,0.6c0.4,0.6,0.3,1.4-0.2,1.9c0,0,0,0,0,0
		c0.6-0.3,1.4-0.2,1.8,0.4c0.5,0.6,0.4,1.4,0,1.9c0,0,0,0,0,0c0.6-0.3,1.4-0.3,1.8,0.2c0.5,0.5,0.6,1.3,0.1,1.9c0,0,0,0,0,0
		c0.6-0.4,1.4-0.4,1.9,0.1c0.6,0.5,0.7,1.3,0.3,1.9c0,0,0,0,0,0c0.5-0.5,1.3-0.5,1.9-0.1c0.6,0.4,0.8,1.2,0.5,1.9c0,0,0,0,0,0
		c0.5-0.5,1.2-0.6,1.8-0.3c0.6,0.4,0.9,1.2,0.6,1.8c0,0,0,0,0,0c0.4-0.6,1.2-0.7,1.8-0.4c0.7,0.3,1,1.1,0.8,1.8c0,0,0,0,0,0
		c0.4-0.6,1.1-0.8,1.8-0.6c0.7,0.3,1.1,1,0.9,1.7c0,0,0,0,0,0c0.3-0.6,1-0.9,1.7-0.8c0.7,0.2,1.2,0.9,1.1,1.6c0,0,0,0,0,0
		c0.3-0.7,1-1,1.7-0.9c0.7,0.1,1.2,0.8,1.2,1.5c0,0,0,0,0,0c0.2-0.7,0.9-1.1,1.5-1c0.8,0.1,1.3,0.7,1.4,1.4c0,0,0,0,0,0
		c0.2-0.7,0.8-1.2,1.5-1.2c0.8,0,1.4,0.6,1.5,1.3c0,0,0,0,0,0c0.1-0.7,0.6-1.2,1.3-1.3c0.8-0.1,1.4,0.4,1.6,1.1c0,0,0,0,0,0
		c0-0.7,0.5-1.3,1.2-1.4c0.7-0.1,1.4,0.3,1.7,1c0,0,0,0,0,0c0-0.7,0.4-1.3,1.1-1.5c0.7-0.2,1.5,0.2,1.8,0.8c0,0,0,0,0,0
		c-0.1-0.7,0.3-1.4,1-1.6c0.7-0.2,1.5,0.1,1.8,0.7c0,0,0,0,0,0c-0.1-0.7,0.2-1.4,0.8-1.7c0.7-0.3,1.5-0.1,1.9,0.5c0,0,0,0,0,0
		c-0.2-0.7,0.1-1.4,0.7-1.7c0.6-0.4,1.4-0.2,1.9,0.3c0,0,0,0,0,0c-0.3-0.7-0.1-1.4,0.5-1.8c0.6-0.4,1.4-0.3,1.9,0.2c0,0,0,0,0,0
		c-0.3-0.6-0.2-1.4,0.3-1.8c0.6-0.5,1.4-0.5,1.9,0c0,0,0,0,0,0c-0.4-0.6-0.3-1.3,0.2-1.8c0.5-0.5,1.3-0.6,1.9-0.2c0,0,0,0,0,0
		c-0.4-0.6-0.4-1.3,0-1.9c0.5-0.6,1.3-0.7,1.9-0.3c0,0,0,0,0,0c-0.5-0.5-0.5-1.3-0.1-1.9c0.4-0.6,1.2-0.8,1.9-0.5c0,0,0,0,0,0
		c-0.5-0.5-0.7-1.2-0.3-1.8c0.4-0.7,1.1-0.9,1.8-0.7c0,0,0,0,0,0c-0.6-0.4-0.8-1.2-0.5-1.8c0.3-0.7,1-1,1.8-0.8c0,0,0,0,0,0
		c-0.6-0.4-0.9-1.1-0.6-1.8c0.2-0.7,1-1.1,1.7-1c0,0,0,0,0,0c-0.6-0.3-1-1-0.8-1.7c0.2-0.7,0.8-1.2,1.6-1.2c0,0,0,0,0,0
		c-0.7-0.3-1.1-0.9-0.9-1.6c0.1-0.7,0.7-1.3,1.5-1.3c0,0,0,0,0,0c-0.7-0.2-1.1-0.8-1.1-1.5c0-0.8,0.6-1.3,1.4-1.4c0,0,0,0,0,0
		c-0.7-0.1-1.2-0.7-1.2-1.4c0-0.7,0.5-1.4,1.2-1.5c0,0,0,0,0,0C121.7,58.3,121.1,57.8,121.1,57.1"/>
	<path class="st5" d="M60.1,69.3c0,0,6.4,19.4,28.5,19.4c22.1,0,29.3-19.8,29.3-19.8s0-4.9-3.7-8.4c-2.2-2.1-6.7-3.5-6.7-3.5
		l-6.1,8.6l-6.7-8.6c0,0-3,1.2-4.7,2.4c-1.6,1.2-1.8,1.4-1.8,1.4L85,60.1c0,0-3.2,3.6-6.6,3.6c-3.4,0-6.4-3.6-6.4-3.6
		S65.7,60.5,60.1,69.3"/>
	<path class="st5" d="M93.3,46c0,0-1-3.3,1.2-6.1c2.2-2.8,4.3-3.1,6.6-3.1c2.2,0,5.2,0.9,6.5,3.1c1.8,3,1.4,6.2,1.4,6.2s1,0.2,1,2.1
		c0,2.3-1.7,2.5-1.7,2.5s-0.7,7.3-7.2,7.3c-6.5,0-7-7.3-7-7.3s-1.5,0.1-1.6-2C92.2,46.5,93.3,46,93.3,46"/>
	<path class="st6" d="M94.9,46.6c0,0,0,9.6,6.1,9.6s6-8.9,6-8.9s-2-0.2-2.9-0.7c-0.9-0.6-1.8-2.6-1.8-2.6s-1.1,2.1-3.1,2.4
		C97.1,46.8,94.9,46.6,94.9,46.6"/>
	<path class="st5" d="M85.4,53.2c0,0-2.1,7.3-7.2,7.3c-4.8,0-7-7.3-7-7.3s-3.6,0.3-4.4-2.3c-0.5-1.8,1.5-3.6,1.5-3.6s-1-2.4,0.2-3.7
		c1.2-1.4,2.9-1.2,2.9-1.2s-0.8-2.7,1.6-3.8c2.4-1.1,3.7,0.5,3.7,0.5s1.3-2,3.3-1.5c2.4,0.5,2.4,2.1,2.4,2.1s2.8-1,3.6,1
		c0.8,2,0.4,2.8,0.4,2.8s2.6-0.1,3.1,1.4c0.8,2.4-0.8,2.9-0.8,2.9s1.6,0.3,1.6,2C90.1,52.9,85.4,53.2,85.4,53.2"/>
	<path class="st6" d="M72,49.2c0,0,1.3,9.6,6.1,9.6c5,0,6-8.9,6-8.9s-2-0.2-2.9-0.7c-0.9-0.6-1.8-1.9-1.8-1.9s-1.1,1.3-3.1,1.7
		C74.3,49.4,72,49.2,72,49.2"/>
	<path class="st5" d="M76,56c0,0,1.4-0.8,1.8-0.6c0.4,0.1,0.5,0.5,0.5,0.5s0.1-0.4,0.4-0.5c0.3-0.1,1.6,0.6,1.6,0.6s-0.8,1.3-2,1.2
		C77.4,57.1,76.8,56.9,76,56"/>
	<path class="st7" d="M78.6,66c0,0.3-0.2,0.5-0.5,0.5c-0.3,0-0.5-0.2-0.5-0.5c0-0.3,0.2-0.5,0.5-0.5C78.4,65.5,78.6,65.7,78.6,66"/>
	<path class="st7" d="M78.6,68.3c0,0.3-0.2,0.5-0.5,0.5c-0.3,0-0.5-0.2-0.5-0.5c0-0.3,0.2-0.5,0.5-0.5C78.4,67.8,78.6,68,78.6,68.3"
		/>
	<path class="st7" d="M78.6,70.7c0,0.3-0.2,0.5-0.5,0.5c-0.3,0-0.5-0.2-0.5-0.5c0-0.3,0.2-0.5,0.5-0.5
		C78.4,70.1,78.6,70.4,78.6,70.7"/>
</g>
</svg>
