{
    "_links": {
        "self": {
            "href": "http:\/\/agaric-com.test\/taxonomy\/term\/23?_format=hal_json"
        },
        "type": {
            "href": "http:\/\/drupal.org\/rest\/type\/taxonomy_term\/license"
        },
        "http:\/\/drupal.org\/rest\/relation\/taxonomy_term\/license\/parent": [
            null
        ]
    },
    "tid": [
        {
            "value": 23
        }
    ],
    "uuid": [
        {
            "value": "5e26d946-6bec-4225-bcb9-0ac6f7671109"
        }
    ],
    "langcode": [
        {
            "value": "en",
            "lang": "en"
        }
    ],
    "vid": [
        {
            "target_id": "license"
        }
    ],
    "status": [
        {
            "value": true,
            "lang": "en"
        }
    ],
    "name": [
        {
            "value": "Copyright",
            "lang": "en"
        }
    ],
    "description": [
        {
            "value": "<p>\u00a9 This work is copyrighted. Contact the author if you would like to share or repurpose it.<\/p>\r\n",
            "format": "basic_html",
            "processed": "<p>\u00a9 This work is copyrighted. Contact the author if you would like to share or repurpose it.<\/p>",
            "lang": "en"
        }
    ],
    "weight": [
        {
            "value": 0
        }
    ],
    "_embedded": {
        "http:\/\/drupal.org\/rest\/relation\/taxonomy_term\/license\/parent": [
            null
        ]
    },
    "changed": [
        {
            "value": "2018-10-02T18:07:50+00:00",
            "lang": "en",
            "format": "Y-m-d\\TH:i:sP"
        }
    ],
    "default_langcode": [
        {
            "value": true,
            "lang": "en"
        }
    ],
    "metatag": [
        {
            "value": {
                "title": "Copyright | Drutopia",
                "canonical_url": "http:\/\/agaric-com.test\/taxonomy\/term\/23",
                "description": "\u00a9 This work is copyrighted. Contact the author if you would like to share or repurpose it."
            }
        }
    ]
}