{
    "_links": {
        "self": {
            "href": "http:\/\/agaric-com.test\/taxonomy\/term\/20?_format=hal_json"
        },
        "type": {
            "href": "http:\/\/drupal.org\/rest\/type\/taxonomy_term\/license"
        },
        "http:\/\/drupal.org\/rest\/relation\/taxonomy_term\/license\/parent": [
            null
        ]
    },
    "tid": [
        {
            "value": 20
        }
    ],
    "uuid": [
        {
            "value": "f1dee100-31b9-4993-a2a9-0ba10c9f6f2e"
        }
    ],
    "langcode": [
        {
            "value": "en",
            "lang": "en"
        }
    ],
    "vid": [
        {
            "target_id": "license"
        }
    ],
    "status": [
        {
            "value": true,
            "lang": "en"
        }
    ],
    "name": [
        {
            "value": "Attribution - NonCommercial",
            "lang": "en"
        }
    ],
    "description": [
        {
            "value": "<p>This work is licensed under a <a href=\"http:\/\/creativecommons.org\/licenses\/by-nc\/4.0\/\">Creative Commons Attribution-NonCommercial 4.0 International License<\/a>.<\/p>\r\n",
            "format": "basic_html",
            "processed": "<p>This work is licensed under a <a href=\"http:\/\/creativecommons.org\/licenses\/by-nc\/4.0\/\">Creative Commons Attribution-NonCommercial 4.0 International License<\/a>.<\/p>",
            "lang": "en"
        }
    ],
    "weight": [
        {
            "value": 0
        }
    ],
    "_embedded": {
        "http:\/\/drupal.org\/rest\/relation\/taxonomy_term\/license\/parent": [
            null
        ]
    },
    "changed": [
        {
            "value": "2018-11-05T20:39:10+00:00",
            "lang": "en",
            "format": "Y-m-d\\TH:i:sP"
        }
    ],
    "default_langcode": [
        {
            "value": true,
            "lang": "en"
        }
    ],
    "metatag": [
        {
            "value": {
                "title": "Attribution - NonCommercial | Drutopia",
                "canonical_url": "http:\/\/agaric-com.test\/taxonomy\/term\/20",
                "description": "This work is licensed under a Creative Commons Attribution-NonCommercial 4.0 International License."
            }
        }
    ]
}