digraph 7 {
"1" [label="((A1->A2)->((A1->(A2->A3))->((A2->(A3->A4))->((A3->(A4->A5))->((A4->(A5->A6))->((A5->(A6->A7))->((A6->(A7->A8))->((A7->(A8->A9))->(A1->A9)))))))))"];
"2" [label="((A1->(A2->A3))->((A2->(A3->A4))->((A3->(A4->A5))->((A4->(A5->A6))->((A5->(A6->A7))->((A6->(A7->A8))->((A7->(A8->A9))->(A1->A9))))))))"];
"2" -> "1";
"3" [label="((A2->(A3->A4))->((A3->(A4->A5))->((A4->(A5->A6))->((A5->(A6->A7))->((A6->(A7->A8))->((A7->(A8->A9))->(A1->A9)))))))"];
"3" -> "2";
"4" [label="((A3->(A4->A5))->((A4->(A5->A6))->((A5->(A6->A7))->((A6->(A7->A8))->((A7->(A8->A9))->(A1->A9))))))"];
"4" -> "3";
"5" [label="((A4->(A5->A6))->((A5->(A6->A7))->((A6->(A7->A8))->((A7->(A8->A9))->(A1->A9)))))"];
"5" -> "4";
"6" [label="((A5->(A6->A7))->((A6->(A7->A8))->((A7->(A8->A9))->(A1->A9))))"];
"6" -> "5";
"7" [label="((A6->(A7->A8))->((A7->(A8->A9))->(A1->A9)))"];
"7" -> "6";
"8" [label="((A7->(A8->A9))->(A1->A9))"];
"8" -> "7";
"9" [label="(A1->A9)"];
"9" -> "8";
"10" [label="A9"];
"10" -> "9";
"11" [label="A8"];
"11" -> "10";
"12" [label="A7"];
"12" -> "11";
"13" [label="A6"];
"13" -> "12";
"14" [label="A5"];
"14" -> "13";
"15" [label="A4"];
"15" -> "14";
"16" [label="A3"];
"16" -> "15";
"17" [label="A2"];
"17" -> "16";
"18" [label="A1"];
"18" -> "17";
"18" -> "9" [comment=discharge];
"19" [label="(A1->A2)"];
"19" -> "17";
"19" -> "1" [comment=discharge];
"20" [label="(A2->A3)"];
"20" -> "16";
"21" [label="A1"];
"21" -> "20";
"21" -> "9" [comment=discharge];
"22" [label="(A1->(A2->A3))"];
"22" -> "20";
"22" -> "2" [comment=discharge];
"23" [label="(A3->A4)"];
"23" -> "15";
"24" [label="A2"];
"24" -> "23";
"25" [label="A1"];
"25" -> "24";
"25" -> "9" [comment=discharge];
"26" [label="(A1->A2)"];
"26" -> "24";
"26" -> "1" [comment=discharge];
"27" [label="(A2->(A3->A4))"];
"27" -> "23";
"27" -> "3" [comment=discharge];
"28" [label="(A4->A5)"];
"28" -> "14";
"29" [label="A3"];
"29" -> "28";
"30" [label="A2"];
"30" -> "29";
"31" [label="A1"];
"31" -> "30";
"31" -> "9" [comment=discharge];
"32" [label="(A1->A2)"];
"32" -> "30";
"32" -> "1" [comment=discharge];
"33" [label="(A2->A3)"];
"33" -> "29";
"34" [label="A1"];
"34" -> "33";
"34" -> "9" [comment=discharge];
"35" [label="(A1->(A2->A3))"];
"35" -> "33";
"35" -> "2" [comment=discharge];
"36" [label="(A3->(A4->A5))"];
"36" -> "28";
"36" -> "4" [comment=discharge];
"37" [label="(A5->A6)"];
"37" -> "13";
"38" [label="A4"];
"38" -> "37";
"39" [label="A3"];
"39" -> "38";
"40" [label="A2"];
"40" -> "39";
"41" [label="A1"];
"41" -> "40";
"41" -> "9" [comment=discharge];
"42" [label="(A1->A2)"];
"42" -> "40";
"42" -> "1" [comment=discharge];
"43" [label="(A2->A3)"];
"43" -> "39";
"44" [label="A1"];
"44" -> "43";
"44" -> "9" [comment=discharge];
"45" [label="(A1->(A2->A3))"];
"45" -> "43";
"45" -> "2" [comment=discharge];
"46" [label="(A3->A4)"];
"46" -> "38";
"47" [label="A2"];
"47" -> "46";
"48" [label="A1"];
"48" -> "47";
"48" -> "9" [comment=discharge];
"49" [label="(A1->A2)"];
"49" -> "47";
"49" -> "1" [comment=discharge];
"50" [label="(A2->(A3->A4))"];
"50" -> "46";
"50" -> "3" [comment=discharge];
"51" [label="(A4->(A5->A6))"];
"51" -> "37";
"51" -> "5" [comment=discharge];
"52" [label="(A6->A7)"];
"52" -> "12";
"53" [label="A5"];
"53" -> "52";
"54" [label="A4"];
"54" -> "53";
"55" [label="A3"];
"55" -> "54";
"56" [label="A2"];
"56" -> "55";
"57" [label="A1"];
"57" -> "56";
"57" -> "9" [comment=discharge];
"58" [label="(A1->A2)"];
"58" -> "56";
"58" -> "1" [comment=discharge];
"59" [label="(A2->A3)"];
"59" -> "55";
"60" [label="A1"];
"60" -> "59";
"60" -> "9" [comment=discharge];
"61" [label="(A1->(A2->A3))"];
"61" -> "59";
"61" -> "2" [comment=discharge];
"62" [label="(A3->A4)"];
"62" -> "54";
"63" [label="A2"];
"63" -> "62";
"64" [label="A1"];
"64" -> "63";
"64" -> "9" [comment=discharge];
"65" [label="(A1->A2)"];
"65" -> "63";
"65" -> "1" [comment=discharge];
"66" [label="(A2->(A3->A4))"];
"66" -> "62";
"66" -> "3" [comment=discharge];
"67" [label="(A4->A5)"];
"67" -> "53";
"68" [label="A3"];
"68" -> "67";
"69" [label="A2"];
"69" -> "68";
"70" [label="A1"];
"70" -> "69";
"70" -> "9" [comment=discharge];
"71" [label="(A1->A2)"];
"71" -> "69";
"71" -> "1" [comment=discharge];
"72" [label="(A2->A3)"];
"72" -> "68";
"73" [label="A1"];
"73" -> "72";
"73" -> "9" [comment=discharge];
"74" [label="(A1->(A2->A3))"];
"74" -> "72";
"74" -> "2" [comment=discharge];
"75" [label="(A3->(A4->A5))"];
"75" -> "67";
"75" -> "4" [comment=discharge];
"76" [label="(A5->(A6->A7))"];
"76" -> "52";
"76" -> "6" [comment=discharge];
"77" [label="(A7->A8)"];
"77" -> "11";
"78" [label="A6"];
"78" -> "77";
"79" [label="A5"];
"79" -> "78";
"80" [label="A4"];
"80" -> "79";
"81" [label="A3"];
"81" -> "80";
"82" [label="A2"];
"82" -> "81";
"83" [label="A1"];
"83" -> "82";
"83" -> "9" [comment=discharge];
"84" [label="(A1->A2)"];
"84" -> "82";
"84" -> "1" [comment=discharge];
"85" [label="(A2->A3)"];
"85" -> "81";
"86" [label="A1"];
"86" -> "85";
"86" -> "9" [comment=discharge];
"87" [label="(A1->(A2->A3))"];
"87" -> "85";
"87" -> "2" [comment=discharge];
"88" [label="(A3->A4)"];
"88" -> "80";
"89" [label="A2"];
"89" -> "88";
"90" [label="A1"];
"90" -> "89";
"90" -> "9" [comment=discharge];
"91" [label="(A1->A2)"];
"91" -> "89";
"91" -> "1" [comment=discharge];
"92" [label="(A2->(A3->A4))"];
"92" -> "88";
"92" -> "3" [comment=discharge];
"93" [label="(A4->A5)"];
"93" -> "79";
"94" [label="A3"];
"94" -> "93";
"95" [label="A2"];
"95" -> "94";
"96" [label="A1"];
"96" -> "95";
"96" -> "9" [comment=discharge];
"97" [label="(A1->A2)"];
"97" -> "95";
"97" -> "1" [comment=discharge];
"98" [label="(A2->A3)"];
"98" -> "94";
"99" [label="A1"];
"99" -> "98";
"99" -> "9" [comment=discharge];
"100" [label="(A1->(A2->A3))"];
"100" -> "98";
"100" -> "2" [comment=discharge];
"101" [label="(A3->(A4->A5))"];
"101" -> "93";
"101" -> "4" [comment=discharge];
"102" [label="(A5->A6)"];
"102" -> "78";
"103" [label="A4"];
"103" -> "102";
"104" [label="A3"];
"104" -> "103";
"105" [label="A2"];
"105" -> "104";
"106" [label="A1"];
"106" -> "105";
"106" -> "9" [comment=discharge];
"107" [label="(A1->A2)"];
"107" -> "105";
"107" -> "1" [comment=discharge];
"108" [label="(A2->A3)"];
"108" -> "104";
"109" [label="A1"];
"109" -> "108";
"109" -> "9" [comment=discharge];
"110" [label="(A1->(A2->A3))"];
"110" -> "108";
"110" -> "2" [comment=discharge];
"111" [label="(A3->A4)"];
"111" -> "103";
"112" [label="A2"];
"112" -> "111";
"113" [label="A1"];
"113" -> "112";
"113" -> "9" [comment=discharge];
"114" [label="(A1->A2)"];
"114" -> "112";
"114" -> "1" [comment=discharge];
"115" [label="(A2->(A3->A4))"];
"115" -> "111";
"115" -> "3" [comment=discharge];
"116" [label="(A4->(A5->A6))"];
"116" -> "102";
"116" -> "5" [comment=discharge];
"117" [label="(A6->(A7->A8))"];
"117" -> "77";
"117" -> "7" [comment=discharge];
"118" [label="(A8->A9)"];
"118" -> "10";
"119" [label="A7"];
"119" -> "118";
"120" [label="A6"];
"120" -> "119";
"121" [label="A5"];
"121" -> "120";
"122" [label="A4"];
"122" -> "121";
"123" [label="A3"];
"123" -> "122";
"124" [label="A2"];
"124" -> "123";
"125" [label="A1"];
"125" -> "124";
"125" -> "9" [comment=discharge];
"126" [label="(A1->A2)"];
"126" -> "124";
"126" -> "1" [comment=discharge];
"127" [label="(A2->A3)"];
"127" -> "123";
"128" [label="A1"];
"128" -> "127";
"128" -> "9" [comment=discharge];
"129" [label="(A1->(A2->A3))"];
"129" -> "127";
"129" -> "2" [comment=discharge];
"130" [label="(A3->A4)"];
"130" -> "122";
"131" [label="A2"];
"131" -> "130";
"132" [label="A1"];
"132" -> "131";
"132" -> "9" [comment=discharge];
"133" [label="(A1->A2)"];
"133" -> "131";
"133" -> "1" [comment=discharge];
"134" [label="(A2->(A3->A4))"];
"134" -> "130";
"134" -> "3" [comment=discharge];
"135" [label="(A4->A5)"];
"135" -> "121";
"136" [label="A3"];
"136" -> "135";
"137" [label="A2"];
"137" -> "136";
"138" [label="A1"];
"138" -> "137";
"138" -> "9" [comment=discharge];
"139" [label="(A1->A2)"];
"139" -> "137";
"139" -> "1" [comment=discharge];
"140" [label="(A2->A3)"];
"140" -> "136";
"141" [label="A1"];
"141" -> "140";
"141" -> "9" [comment=discharge];
"142" [label="(A1->(A2->A3))"];
"142" -> "140";
"142" -> "2" [comment=discharge];
"143" [label="(A3->(A4->A5))"];
"143" -> "135";
"143" -> "4" [comment=discharge];
"144" [label="(A5->A6)"];
"144" -> "120";
"145" [label="A4"];
"145" -> "144";
"146" [label="A3"];
"146" -> "145";
"147" [label="A2"];
"147" -> "146";
"148" [label="A1"];
"148" -> "147";
"148" -> "9" [comment=discharge];
"149" [label="(A1->A2)"];
"149" -> "147";
"149" -> "1" [comment=discharge];
"150" [label="(A2->A3)"];
"150" -> "146";
"151" [label="A1"];
"151" -> "150";
"151" -> "9" [comment=discharge];
"152" [label="(A1->(A2->A3))"];
"152" -> "150";
"152" -> "2" [comment=discharge];
"153" [label="(A3->A4)"];
"153" -> "145";
"154" [label="A2"];
"154" -> "153";
"155" [label="A1"];
"155" -> "154";
"155" -> "9" [comment=discharge];
"156" [label="(A1->A2)"];
"156" -> "154";
"156" -> "1" [comment=discharge];
"157" [label="(A2->(A3->A4))"];
"157" -> "153";
"157" -> "3" [comment=discharge];
"158" [label="(A4->(A5->A6))"];
"158" -> "144";
"158" -> "5" [comment=discharge];
"159" [label="(A6->A7)"];
"159" -> "119";
"160" [label="A5"];
"160" -> "159";
"161" [label="A4"];
"161" -> "160";
"162" [label="A3"];
"162" -> "161";
"163" [label="A2"];
"163" -> "162";
"164" [label="A1"];
"164" -> "163";
"164" -> "9" [comment=discharge];
"165" [label="(A1->A2)"];
"165" -> "163";
"165" -> "1" [comment=discharge];
"166" [label="(A2->A3)"];
"166" -> "162";
"167" [label="A1"];
"167" -> "166";
"167" -> "9" [comment=discharge];
"168" [label="(A1->(A2->A3))"];
"168" -> "166";
"168" -> "2" [comment=discharge];
"169" [label="(A3->A4)"];
"169" -> "161";
"170" [label="A2"];
"170" -> "169";
"171" [label="A1"];
"171" -> "170";
"171" -> "9" [comment=discharge];
"172" [label="(A1->A2)"];
"172" -> "170";
"172" -> "1" [comment=discharge];
"173" [label="(A2->(A3->A4))"];
"173" -> "169";
"173" -> "3" [comment=discharge];
"174" [label="(A4->A5)"];
"174" -> "160";
"175" [label="A3"];
"175" -> "174";
"176" [label="A2"];
"176" -> "175";
"177" [label="A1"];
"177" -> "176";
"177" -> "9" [comment=discharge];
"178" [label="(A1->A2)"];
"178" -> "176";
"178" -> "1" [comment=discharge];
"179" [label="(A2->A3)"];
"179" -> "175";
"180" [label="A1"];
"180" -> "179";
"180" -> "9" [comment=discharge];
"181" [label="(A1->(A2->A3))"];
"181" -> "179";
"181" -> "2" [comment=discharge];
"182" [label="(A3->(A4->A5))"];
"182" -> "174";
"182" -> "4" [comment=discharge];
"183" [label="(A5->(A6->A7))"];
"183" -> "159";
"183" -> "6" [comment=discharge];
"184" [label="(A7->(A8->A9))"];
"184" -> "118";
"184" -> "8" [comment=discharge];
}
