strict digraph "" {
	node [label="\N"];
	4	 [label="((A3->(A4->A5))->((A4->(A5->A6))->((A5->(A6->A7))->((A6->(A7->A8))->((A7->(A8->A9))->(A1->A9))))))"];
	3	 [label="((A2->(A3->A4))->((A3->(A4->A5))->((A4->(A5->A6))->((A5->(A6->A7))->((A6->(A7->A8))->((A7->(A8->A9))->(A1->A9)))))))"];
	4 -> 3	 [collapsed=False,
		color=0,
		dependencies=000000000000000000000000000000000];
	8	 [label="((A7->(A8->A9))->(A1->A9))"];
	7	 [label="((A6->(A7->A8))->((A7->(A8->A9))->(A1->A9)))"];
	8 -> 7	 [collapsed=False,
		color=0,
		dependencies=000000000000000000000000000000000];
	120	 [label=A6];
	119	 [label=A7];
	120 -> 119	 [collapsed=True,
		lambda_colors="[0, 1]"];
	77	 [label="(A7->A8)"];
	120 -> 77	 [collapsed=False,
		color=2,
		dependencies=000000000000000000000000000000000];
	118	 [label="(A8->A9)"];
	119 -> 118	 [collapsed=False,
		color=1,
		dependencies=000000000000000000000000000000000];
	11	 [label=A8];
	119 -> 11	 [collapsed=False,
		color=2,
		dependencies=000000000000000000000000000000000];
	118 -> 120	 [path="[1, 1]"];
	118 -> 119	 [path="[1]"];
	161	 [label=A4];
	118 -> 161	 [path="[1, 1, 0, 1]"];
	162	 [label=A3];
	118 -> 162	 [path="[2, 1, 1, 0, 1]"];
	10	 [label=A9];
	118 -> 10	 [collapsed=False,
		color=0,
		dependencies=000000000000000000000000000000000];
	2	 [label="((A1->(A2->A3))->((A2->(A3->A4))->((A3->(A4->A5))->((A4->(A5->A6))->((A5->(A6->A7))->((A6->(A7->A8))->((A7->(A8->A9))->(A1->A9))))))))"];
	3 -> 2	 [collapsed=False,
		color=0,
		dependencies=000000000000000000000000000000000];
	6	 [label="((A5->(A6->A7))->((A6->(A7->A8))->((A7->(A8->A9))->(A1->A9))))"];
	7 -> 6	 [collapsed=False,
		color=0,
		dependencies=000000000000000000000000000000000];
	109	 [label=A1];
	166	 [label="(A2->A3)"];
	109 -> 166	 [collapsed=True,
		lambda_colors="[0]"];
	163	 [label=A2];
	109 -> 163	 [collapsed=True,
		lambda_colors="[0]"];
	174	 [label="(A4->A5)"];
	160	 [label=A5];
	174 -> 160	 [collapsed=True,
		lambda_colors="[0]"];
	173	 [label="(A2->(A3->A4))"];
	169	 [label="(A3->A4)"];
	173 -> 169	 [collapsed=True,
		lambda_colors="[0]"];
	182	 [label="(A3->(A4->A5))"];
	182 -> 174	 [collapsed=True,
		lambda_colors="[0]"];
	183	 [label="(A5->(A6->A7))"];
	159	 [label="(A6->A7)"];
	183 -> 159	 [collapsed=True,
		lambda_colors="[0]"];
	184	 [label="(A7->(A8->A9))"];
	184 -> 118	 [collapsed=False,
		color=0,
		dependencies=000000000000000001000000000000000];
	5	 [label="((A4->(A5->A6))->((A5->(A6->A7))->((A6->(A7->A8))->((A7->(A8->A9))->(A1->A9)))))"];
	6 -> 5	 [collapsed=False,
		color=0,
		dependencies=000000000000000000000000000000000];
	168	 [label="(A1->(A2->A3))"];
	168 -> 166	 [collapsed=True,
		lambda_colors="[0]"];
	169 -> 161	 [collapsed=True,
		lambda_colors="[0]"];
	165	 [label="(A1->A2)"];
	165 -> 163	 [collapsed=True,
		lambda_colors="[0]"];
	166 -> 162	 [collapsed=True,
		lambda_colors="[0]"];
	160 -> 120	 [collapsed=True,
		lambda_colors="[2]"];
	160 -> 159	 [collapsed=True,
		lambda_colors="[0]"];
	161 -> 160	 [collapsed=True,
		lambda_colors="[0, 1]"];
	144	 [label="(A5->A6)"];
	161 -> 144	 [collapsed=True,
		lambda_colors="[0]"];
	162 -> 174	 [collapsed=True,
		lambda_colors="[1]"];
	162 -> 161	 [collapsed=True,
		lambda_colors="[0, 2]"];
	163 -> 169	 [collapsed=True,
		lambda_colors="[0]"];
	163 -> 162	 [collapsed=True,
		lambda_colors="[0]"];
	11 -> 120	 [path="[0, 2]"];
	11 -> 119	 [path="[2]"];
	11 -> 10	 [collapsed=False,
		color=0,
		dependencies=000000000000000000000000000000000];
	9	 [label="(A1->A9)"];
	10 -> 9	 [collapsed=False,
		color=0,
		dependencies=000000000000000000000000000000000];
	117	 [label="(A6->(A7->A8))"];
	117 -> 77	 [collapsed=False,
		color=0,
		dependencies=000000000000000000000000000000010];
	159 -> 119	 [collapsed=True,
		lambda_colors="[0]"];
	158	 [label="(A4->(A5->A6))"];
	158 -> 144	 [collapsed=True,
		lambda_colors="[0]"];
	1	 [label="((A1->A2)->((A1->(A2->A3))->((A2->(A3->A4))->((A3->(A4->A5))->((A4->(A5->A6))->((A5->(A6->A7))->((A6->(A7->A8))->((A7->(A8->A9))\
->(A1->A9)))))))))"];
	5 -> 4	 [collapsed=False,
		color=0,
		dependencies=000000000000000000000000000000000];
	9 -> 8	 [collapsed=False,
		color=0,
		dependencies=000000000000000000000000000000000];
	144 -> 120	 [collapsed=True,
		lambda_colors="[0]"];
	77 -> 120	 [path="[2]"];
	77 -> 160	 [path="[2, 2]"];
	77 -> 11	 [collapsed=False,
		color=0,
		dependencies=000000000000000000000000000000000];
	2 -> 1	 [collapsed=False,
		color=0,
		dependencies=000000000000000000000000000000000];
}
