strict digraph "" {
	node [label="\N"];
	22	 [label="(A4->A5)"];
	8	 [label=A5];
	22 -> 8	 [collapsed=False,
		color=0,
		dependencies=000000000000000000000];
	23	 [label=A3];
	23 -> 22	 [collapsed=False,
		color=0,
		dependencies=000000000000000000000];
	41	 [label=A2];
	23 -> 41	 [path="[-1]"];
	37	 [label="(A2->A3)"];
	23 -> 37	 [path="[-1]"];
	32	 [label=A4];
	23 -> 32	 [collapsed=True,
		lambda_colors="[0]"];
	44	 [label="(A2->(A3->A4))"];
	40	 [label="(A3->A4)"];
	44 -> 40	 [collapsed=True,
		lambda_colors="[0]"];
	45	 [label="(A4->(A5->A6))"];
	31	 [label="(A5->A6)"];
	45 -> 31	 [collapsed=False,
		color=0,
		dependencies=000000000000000000010];
	43	 [label="(A1->A2)"];
	43 -> 41	 [collapsed=True,
		lambda_colors="[0]"];
	40 -> 32	 [collapsed=True,
		lambda_colors="[0]"];
	41 -> 23	 [collapsed=True,
		lambda_colors="[-1]"];
	41 -> 40	 [collapsed=True,
		lambda_colors="[0]"];
	1	 [label="((A1->A2)->((A1->(A2->A3))->((A2->(A3->A4))->((A3->(A4->A5))->((A4->(A5->A6))->(A1->A6))))))"];
	3	 [label="((A2->(A3->A4))->((A3->(A4->A5))->((A4->(A5->A6))->(A1->A6))))"];
	2	 [label="((A1->(A2->A3))->((A2->(A3->A4))->((A3->(A4->A5))->((A4->(A5->A6))->(A1->A6)))))"];
	3 -> 2	 [collapsed=False,
		color=0,
		dependencies=000000000000000000000];
	2 -> 1	 [collapsed=False,
		color=0,
		dependencies=000000000000000000000];
	5	 [label="((A4->(A5->A6))->(A1->A6))"];
	4	 [label="((A3->(A4->A5))->((A4->(A5->A6))->(A1->A6)))"];
	5 -> 4	 [collapsed=False,
		color=0,
		dependencies=000000000000000000000];
	4 -> 3	 [collapsed=False,
		color=0,
		dependencies=000000000000000000000];
	7	 [label=A6];
	6	 [label="(A1->A6)"];
	7 -> 6	 [collapsed=False,
		color=0,
		dependencies=000000000000000000000];
	6 -> 5	 [collapsed=False,
		color=0,
		dependencies=000000000000000000000];
	8 -> 23	 [path="[0, 2]"];
	8 -> 7	 [collapsed=False,
		color=0,
		dependencies=000000000000000000000];
	8 -> 37	 [path="[0, 0, 2]"];
	8 -> 32	 [path="[2]"];
	39	 [label="(A1->(A2->A3))"];
	39 -> 37	 [collapsed=True,
		lambda_colors="[0]"];
	15	 [label=A1];
	15 -> 41	 [collapsed=True,
		lambda_colors="[0]"];
	15 -> 37	 [collapsed=True,
		lambda_colors="[0]"];
	31 -> 23	 [path="[0, 1]"];
	31 -> 7	 [collapsed=False,
		color=0,
		dependencies=000000000000000000000];
	31 -> 37	 [path="[0, 0, 1]"];
	31 -> 32	 [path="[1]"];
	30	 [label="(A3->(A4->A5))"];
	30 -> 22	 [collapsed=False,
		color=0,
		dependencies=000000100000000000000];
	37 -> 23	 [collapsed=True,
		lambda_colors="[0, -1]"];
	32 -> 23	 [path="[1]"];
	32 -> 8	 [collapsed=False,
		color=2,
		dependencies=000000000000000000000];
	32 -> 31	 [collapsed=False,
		color=1,
		dependencies=000000000000000000000];
	32 -> 37	 [path="[0, 1]"];
}
