strict digraph "" {
	node [label="\N"];
	298	 [label="(A2->(A3->A4))"];
	294	 [label="(A3->A4)"];
	298 -> 294	 [collapsed=True,
		lambda_colors="[0]"];
	299	 [label="(A4->(A5->A6))"];
	285	 [label="(A5->A6)"];
	299 -> 285	 [collapsed=True,
		lambda_colors="[0]"];
	286	 [label=A4];
	294 -> 286	 [collapsed=True,
		lambda_colors="[0]"];
	292	 [label=A1];
	291	 [label="(A2->A3)"];
	292 -> 291	 [collapsed=True,
		lambda_colors="[0]"];
	288	 [label=A2];
	292 -> 288	 [collapsed=True,
		lambda_colors="[0]"];
	293	 [label="(A1->(A2->A3))"];
	293 -> 291	 [collapsed=True,
		lambda_colors="[0]"];
	290	 [label="(A1->A2)"];
	290 -> 288	 [collapsed=True,
		lambda_colors="[0]"];
	287	 [label=A3];
	291 -> 287	 [collapsed=True,
		lambda_colors="[0]"];
	195	 [label=A7];
	194	 [label=A8];
	195 -> 194	 [collapsed=True,
		lambda_colors="[0]"];
	126	 [label="(A8->A9)"];
	195 -> 126	 [collapsed=True,
		lambda_colors="[0]"];
	193	 [label="(A9->A10)"];
	194 -> 193	 [collapsed=True,
		lambda_colors="[2]"];
	18	 [label=A9];
	194 -> 18	 [collapsed=True,
		lambda_colors="[0, 1]"];
	480	 [label=A10];
	193 -> 480	 [collapsed=True,
		lambda_colors="[0, -1]"];
	192	 [label="(A7->(A8->A9))"];
	192 -> 126	 [collapsed=True,
		lambda_colors="[0]"];
	276	 [label="(A4->A5)"];
	262	 [label=A5];
	276 -> 262	 [collapsed=True,
		lambda_colors="[0]"];
	1230	 [label="(A11->(A12->A13))"];
	766	 [label="(A12->A13)"];
	1230 -> 766	 [collapsed=False,
		color=0,
		dependencies=0000000000000000000000000000000000000000000010000];
	6	 [label="((A5->(A6->A7))->((A6->(A7->A8))->((A7->(A8->A9))->((A8->(A9->A10))->((A9->(A10->A11))->((A10->(A11->A12))->((A11->(A12->A13))->(\
A1->A13))))))))"];
	5	 [label="((A4->(A5->A6))->((A5->(A6->A7))->((A6->(A7->A8))->((A7->(A8->A9))->((A8->(A9->A10))->((A9->(A10->A11))->((A10->(A11->A12))->((A11->(\
A12->A13))->(A1->A13)))))))))"];
	6 -> 5	 [collapsed=False,
		color=0,
		dependencies=0000000000000000000000000000000000000000000000000];
	8	 [label="((A7->(A8->A9))->((A8->(A9->A10))->((A9->(A10->A11))->((A10->(A11->A12))->((A11->(A12->A13))->(A1->A13))))))"];
	7	 [label="((A6->(A7->A8))->((A7->(A8->A9))->((A8->(A9->A10))->((A9->(A10->A11))->((A10->(A11->A12))->((A11->(A12->A13))->(A1->A13)))))))"];
	8 -> 7	 [collapsed=False,
		color=0,
		dependencies=0000000000000000000000000000000000000000000000000];
	235	 [label="(A6->A7)"];
	235 -> 195	 [collapsed=True,
		lambda_colors="[0]"];
	1	 [label="((A1->A2)->((A1->(A2->A3))->((A2->(A3->A4))->((A3->(A4->A5))->((A4->(A5->A6))->((A5->(A6->A7))->((A6->(A7->A8))->((A7->(A8->A9))\
->((A8->(A9->A10))->((A9->(A10->A11))->((A10->(A11->A12))->((A11->(A12->A13))->(A1->A13)))))))))))))"];
	7 -> 6	 [collapsed=False,
		color=0,
		dependencies=0000000000000000000000000000000000000000000000000];
	11	 [label="((A10->(A11->A12))->((A11->(A12->A13))->(A1->A13)))"];
	10	 [label="((A9->(A10->A11))->((A10->(A11->A12))->((A11->(A12->A13))->(A1->A13))))"];
	11 -> 10	 [collapsed=False,
		color=0,
		dependencies=0000000000000000000000000000000000000000000000000];
	9	 [label="((A8->(A9->A10))->((A9->(A10->A11))->((A10->(A11->A12))->((A11->(A12->A13))->(A1->A13)))))"];
	10 -> 9	 [collapsed=False,
		color=0,
		dependencies=0000000000000000000000000000000000000000000000000];
	13	 [label="(A1->A13)"];
	12	 [label="((A11->(A12->A13))->(A1->A13))"];
	13 -> 12	 [collapsed=False,
		color=0,
		dependencies=0000000000000000000000000000000000000000000000000];
	12 -> 11	 [collapsed=False,
		color=0,
		dependencies=0000000000000000000000000000000000000000000000000];
	15	 [label=A12];
	15 -> 194	 [path="[2, 0, 0, 1]"];
	15 -> 193	 [path="[0, 0, 1]"];
	14	 [label=A13];
	15 -> 14	 [collapsed=False,
		color=0,
		dependencies=0000000000000000000000000000000000000000000000000];
	16	 [label=A11];
	15 -> 16	 [path="[1]"];
	15 -> 287	 [path="[2, 2, 0, 1, 0, 2, 0, 0, 1]"];
	15 -> 286	 [path="[2, 0, 1, 0, 2, 0, 0, 1]"];
	261	 [label=A6];
	15 -> 261	 [path="[1, 0, 2, 0, 0, 1]"];
	15 -> 480	 [path="[0, 1]"];
	14 -> 13	 [collapsed=False,
		color=0,
		dependencies=0000000000000000000000000000000000000000000000000];
	16 -> 194	 [path="[2, 0, 1]"];
	16 -> 193	 [path="[0, 1]"];
	16 -> 15	 [collapsed=False,
		color=1,
		dependencies=0000000000000000000000000000000000000000000000000];
	16 -> 18	 [path="[2, 1]"];
	16 -> 766	 [collapsed=False,
		color=2,
		dependencies=0000000000000000000000000000000000000000000000000];
	16 -> 287	 [path="[2, 2, 0, 1, 0, 2, 0, 1]"];
	16 -> 286	 [path="[2, 0, 2, 2, 2, 0, 1]"];
	16 -> 262	 [path="[2, 2, 2, 2, 0, 1]"];
	16 -> 261	 [path="[1, 0, 2, 0, 1]"];
	302	 [label="(A10->A11)"];
	18 -> 302	 [collapsed=True,
		lambda_colors="[1]"];
	18 -> 480	 [collapsed=True,
		lambda_colors="[2, -1]"];
	126 -> 18	 [collapsed=True,
		lambda_colors="[0]"];
	2	 [label="((A1->(A2->A3))->((A2->(A3->A4))->((A3->(A4->A5))->((A4->(A5->A6))->((A5->(A6->A7))->((A6->(A7->A8))->((A7->(A8->A9))->((A8->(A9->\
A10))->((A9->(A10->A11))->((A10->(A11->A12))->((A11->(A12->A13))->(A1->A13))))))))))))"];
	2 -> 1	 [collapsed=False,
		color=0,
		dependencies=0000000000000000000000000000000000000000000000000];
	3	 [label="((A2->(A3->A4))->((A3->(A4->A5))->((A4->(A5->A6))->((A5->(A6->A7))->((A6->(A7->A8))->((A7->(A8->A9))->((A8->(A9->A10))->((A9->(A10->\
A11))->((A10->(A11->A12))->((A11->(A12->A13))->(A1->A13)))))))))))"];
	3 -> 2	 [collapsed=False,
		color=0,
		dependencies=0000000000000000000000000000000000000000000000000];
	259	 [label="(A5->(A6->A7))"];
	259 -> 235	 [collapsed=True,
		lambda_colors="[0]"];
	9 -> 8	 [collapsed=False,
		color=0,
		dependencies=0000000000000000000000000000000000000000000000000];
	766 -> 194	 [path="[2, 0, 0, 2]"];
	766 -> 193	 [path="[0, 0, 2]"];
	766 -> 14	 [collapsed=False,
		color=0,
		dependencies=0000000000000000000000000000000000000000000000000];
	766 -> 16	 [path="[2]"];
	766 -> 286	 [path="[2, 0, 2, 2, 2, 0, 0, 2]"];
	766 -> 262	 [path="[2, 2, 2, 2, 0, 0, 2]"];
	766 -> 261	 [path="[2, 2, 2, 0, 0, 2]"];
	766 -> 480	 [path="[0, 2]"];
	765	 [label="(A10->(A11->A12))"];
	479	 [label="(A11->A12)"];
	765 -> 479	 [collapsed=False,
		color=0,
		dependencies=0000000000000000000000000000000000000000000000001];
	288 -> 294	 [collapsed=True,
		lambda_colors="[0]"];
	288 -> 287	 [collapsed=True,
		lambda_colors="[0]"];
	4	 [label="((A3->(A4->A5))->((A4->(A5->A6))->((A5->(A6->A7))->((A6->(A7->A8))->((A7->(A8->A9))->((A8->(A9->A10))->((A9->(A10->A11))->((A10->(\
A11->A12))->((A11->(A12->A13))->(A1->A13))))))))))"];
	4 -> 3	 [collapsed=False,
		color=0,
		dependencies=0000000000000000000000000000000000000000000000000];
	285 -> 261	 [collapsed=True,
		lambda_colors="[0]"];
	284	 [label="(A3->(A4->A5))"];
	284 -> 276	 [collapsed=True,
		lambda_colors="[0]"];
	287 -> 276	 [collapsed=True,
		lambda_colors="[1]"];
	287 -> 286	 [collapsed=True,
		lambda_colors="[0, 2]"];
	286 -> 285	 [collapsed=True,
		lambda_colors="[2]"];
	286 -> 262	 [collapsed=True,
		lambda_colors="[0, 1]"];
	262 -> 235	 [collapsed=True,
		lambda_colors="[1]"];
	262 -> 261	 [collapsed=True,
		lambda_colors="[0, 2]"];
	261 -> 195	 [collapsed=True,
		lambda_colors="[2]"];
	260	 [label="(A7->A8)"];
	261 -> 260	 [collapsed=True,
		lambda_colors="[0, 1]"];
	260 -> 194	 [collapsed=True,
		lambda_colors="[0]"];
	478	 [label="(A9->(A10->A11))"];
	478 -> 302	 [collapsed=True,
		lambda_colors="[0]"];
	5 -> 4	 [collapsed=False,
		color=0,
		dependencies=0000000000000000000000000000000000000000000000000];
	300	 [label="(A6->(A7->A8))"];
	300 -> 260	 [collapsed=True,
		lambda_colors="[0]"];
	301	 [label="(A8->(A9->A10))"];
	301 -> 193	 [collapsed=True,
		lambda_colors="[0]"];
	302 -> 16	 [collapsed=True,
		lambda_colors="[0]"];
	480 -> 193	 [path="[-1]"];
	480 -> 16	 [collapsed=True,
		lambda_colors="[0]"];
	480 -> 18	 [path="[-1]"];
	480 -> 479	 [collapsed=False,
		color=0,
		dependencies=0000000000000000000000000000000000000000000000000];
	479 -> 15	 [collapsed=False,
		color=0,
		dependencies=0000000000000000000000000000000000000000000000000];
}
