{
  "database": {
    "connectionStringBot": "postgres://wagon:wagonWheel@localhost:5432/vagonmetro"
  },
  "bot": {
    "token": "1023827352:AAGKqClQ_ehOkFQ1WG_czmpjjzLRaSCNHIg",
    "port": 5555
  }
}