<?xml version="1.0" encoding="UTF-8"?>
<!DOCTYPE svg PUBLIC "-//W3C//DTD SVG 1.1//EN" "http://www.w3.org/Graphics/SVG/1.1/DTD/svg11.dtd">
<!-- Creator: CorelDRAW 2018 (64-Bit) -->
<svg xmlns="http://www.w3.org/2000/svg" xml:space="preserve" width="30cm" height="30cm" version="1.1" style="shape-rendering:geometricPrecision; text-rendering:geometricPrecision; image-rendering:optimizeQuality; fill-rule:evenodd; clip-rule:evenodd"
viewBox="0 0 30000 30000"
 xmlns:xlink="http://www.w3.org/1999/xlink">
 <defs>
  <font id="FontID1" horiz-adv-x="652" font-variant="normal" style="fill-rule:nonzero" font-weight="400">
	<font-face 
		font-family="IRANSans(FaNum)">
		<font-face-src>
			<font-face-name name="IRANSans(FaNum)"/>
		</font-face-src>
	</font-face>
   <missing-glyph><path d="M0 0z"/></missing-glyph>
   <glyph unicode="A" horiz-adv-x="652" d="M475.167 185.666l-297.831 0 -66.8335 -185.666 -97.0017 0 271.663 710.835 82.1672 0 271.834 -710.835 -96.1673 0 -67.8321 185.666zm-269.502 77.0036l241.666 0 -121.165 332.499 -120.501 -332.499z"/>
   <glyph unicode="B" horiz-adv-x="622" d="M82.6665 0l0 710.835 232.167 0c77.3319,0 135.5,-15.833 174.334,-47.834 38.8335,-31.8369 58.1682,-79.1648 58.1682,-141.669 0,-32.9996 -9.33563,-62.3333 -28.171,-87.8302 -18.8286,-25.5037 -44.6606,-45.3377 -77.496,-59.666 38.6625,-10.6693 69.0016,-31.0025 91.3319,-61.1706 22.3371,-30.1681 33.4988,-65.9992 33.4988,-107.5 0,-63.667 -20.6683,-113.833 -62.1623,-150.334 -41.5008,-36.4945 -99.8331,-54.8306 -175.168,-54.8306l-246.502 0zm93.4999 332.67l0 -256.172 154.664 0c43.8399,0 78.3372,11.3327 103.506,34.005 25.1617,22.4944 37.8281,53.6611 37.8281,93.329 0,85.8331 -46.5003,128.839 -139.494,128.839l-156.503 0zm0 75.1638l141.669 0c41.1657,0 74.0011,10.1632 98.4995,30.6674 24.4983,20.3332 36.6654,48.3333 36.6654,83.665 0,38.8335 -11.3327,67.1687 -34.1691,84.9987 -22.6654,17.8369 -57.3338,26.6664 -103.998,26.6664l-138.667 0 0 -225.998z"/>
   <glyph unicode="C" horiz-adv-x="650" d="M605.667 225.669c-9.00051,-75.3348 -36.8364,-133.503 -83.5009,-174.169 -46.6645,-40.6664 -108.669,-60.9996 -186.001,-60.9996 -84.1643,0 -151.497,29.9971 -201.998,90.1692 -50.6655,60.1652 -75.8341,140.664 -75.8341,241.495l0 68.3382c0,65.9992 11.6678,124.16 35.1676,174.334 23.4998,50.1662 56.8345,88.6646 100.168,115.666 43.3337,26.8305 93.6641,40.3313 150.663,40.3313 75.3348,0 135.835,-21.0035 181.501,-63.1677 45.6659,-42.1642 72.3323,-100.497 79.835,-174.997l-94.3343 0c-8.16611,56.4994 -25.832,97.3299 -52.9977,122.834 -27.3366,25.3327 -65.3357,37.9991 -114.004,37.9991 -59.9943,0 -107.001,-22.1661 -140.999,-66.3343 -34.1623,-44.1681 -51.1647,-107.165 -51.1647,-188.833l0 -69.1657c0,-77.1677 16.1681,-138.502 48.4974,-184.004 32.3362,-45.495 77.5028,-68.1672 135.5,-68.1672 51.835,0 91.667,11.8388 119.503,35.3386 27.8291,23.6639 46.3294,64.8296 55.665,123.333l94.3343 0z"/>
   <glyph unicode="D" horiz-adv-x="655" d="M82.6665 0l0 710.835 200.336 0c61.9982,0 116.829,-13.6649 164.328,-41.0015 47.6699,-27.5008 84.3353,-66.3343 110.003,-116.836 25.832,-50.3303 38.8335,-108.163 39.1686,-173.499l0 -45.6659c0,-66.8335 -12.8373,-125.501 -38.6693,-176.002 -25.832,-50.4945 -62.6684,-89.1638 -110.667,-116.329 -47.9981,-27.0015 -103.998,-40.8374 -168,-41.5008l-196.5 0zm93.4999 633.831l0 -557.334 98.6636 0c72.5033,0 128.668,22.5013 168.835,67.3328 40.1672,45.0025 60.1652,109.005 60.1652,192.335l0 41.1657c0,81.0046 -18.8286,143.666 -56.8277,188.334 -37.9991,44.6674 -91.838,67.3328 -161.339,68.1672l-109.497 0z"/>
   <glyph unicode="E" horiz-adv-x="568" d="M484.331 328.669l-308.165 0 0 -252.171 358.167 0 0 -76.4975 -451.667 0 0 710.835 446.503 0 0 -77.0036 -353.003 0 0 -228.665 308.165 0 0 -76.4975z"/>
   <glyph unicode="F" horiz-adv-x="552" d="M474.831 313.835l-298.665 0 0 -313.835 -93.4999 0 0 710.835 440.334 0 0 -77.0036 -346.834 0 0 -243.328 298.665 0 0 -76.6684z"/>
   <glyph unicode="I" horiz-adv-x="272" d="M182.999 0l-93.4999 0 0 710.835 93.4999 0 0 -710.835z"/>
   <glyph unicode="P" horiz-adv-x="630" d="M176.166 278.332l0 -278.332 -93.4999 0 0 710.835 262.164 0c77.667,0 138.502,-19.8339 182.835,-59.5018 44.1681,-39.6679 66.1701,-92.3304 66.1701,-157.83 0,-69.0016 -21.5027,-122.17 -64.6655,-159.335 -43.1696,-37.3357 -105.004,-55.836 -185.338,-55.836l-167.665 0zm0 76.5043l168.664 0c50.173,0 88.5004,11.832 115.167,35.3318 26.6664,23.6639 40.003,57.833 40.003,102.5 0,42.3284 -13.3366,76.1623 -40.003,101.495 -26.6664,25.3396 -63.3318,38.6693 -109.996,39.6679l-173.834 0 0 -278.995z"/>
   <glyph unicode="V" horiz-adv-x="636" d="M317.836 124.331l202.997 586.503 102.665 0 -263.497 -710.835 -83.0016 0 -263.497 710.835 102.165 0 202.169 -586.503z"/>
   <glyph unicode="س" horiz-adv-x="1170" d="M1055.66 401.665c1.50464,-2.83147 4.16513,-7.99513 8.00197,-15.4978 4.00098,-7.66684 8.33026,-16.8315 13.3298,-27.8359 4.83538,-11.1617 10.17,-23.4998 15.6688,-37.4998 5.49879,-13.829 10.4983,-28.4993 14.9986,-43.833 4.50025,-15.3337 8.16611,-31.3308 11.0044,-47.663 2.99561,-16.3322 4.32927,-32.6713 4.32927,-48.8325 -0.164143,-25.0044 -3.16659,-48.3333 -8.82952,-70.0001 -5.66977,-21.8379 -14.3352,-40.8374 -26.1671,-57.0055 -11.6678,-16.3322 -26.8374,-28.9986 -45.3377,-38.3274 -18.6644,-9.17149 -40.9947,-13.8359 -67.497,-13.8359 -8.00197,0 -16.8315,1.16952 -26.003,3.66586 -9.32879,2.50318 -18.6644,6.16904 -27.8291,10.8334 -9.33563,4.83538 -18.1652,10.8334 -26.5023,18.001 -8.50124,7.33172 -15.6688,15.6688 -21.831,24.8335 -17.3376,-20.4974 -36.8364,-35.0035 -58.6674,-43.4979 -21.6669,-8.33709 -44.8315,-13.1725 -69.1657,-14.3352 -3.50172,-0.170982 -6.66831,-0.335125 -9.49977,-0.335125 -6.33318,0 -12.8373,0.499268 -19.4988,1.4978 -6.66831,1.00538 -13.5008,2.66732 -20.3332,4.99952 -6.83929,2.33904 -13.1725,5.1705 -19.3347,8.67222 -6.0049,3.49488 -12.3381,7.33172 -18.6713,11.6678 0.335125,-4.83538 0.506107,-10.0059 0.506107,-15.1695 0,-19.9981 -1.66879,-41.0015 -5.00636,-62.8326 -3.33073,-21.8379 -9.49977,-43.833 -18.4934,-65.835 -9.00051,-22.002 -21.0035,-42.4994 -36.002,-61.4989 -14.8344,-18.9995 -33.3347,-35.831 -55.3367,-50.3372 -26.9947,-18.1652 -57.1628,-31.9942 -90.6616,-41.1657 -33.5057,-9.32879 -71.3338,-14.9986 -113.669,-16.9956l-17.0025 0c-76.8326,0 -139.665,21.6669 -188.662,65.1648 -22.002,19.4988 -40.1672,42.6635 -54.6664,69.836 -14.3352,26.9947 -23.8349,56.8277 -28.3352,89.328 -2.66732,18.3361 -4.00098,36.3371 -4.00098,54.3382 0,10.9976 0.834393,26.4954 2.66732,46.3294 1.66879,19.8339 6.33318,43.1696 13.6649,70.1711 7.33172,26.9947 16.5032,52.4984 27.1657,76.8326 10.6693,24.1632 22.1661,46.1652 34.3332,65.8282l69.1657 -50.8296c-3.83,-4.99952 -8.16611,-12.3312 -13.3298,-22.002 -4.99952,-9.66392 -10.17,-21.1676 -15.1695,-34.1623 -4.99952,-13.0015 -9.82806,-27.3366 -14.3283,-43.0055 -4.50025,-15.662 -8.33709,-31.8301 -11.3395,-48.6616 -2.99561,-16.8383 -4.99952,-34.005 -5.82708,-51.3357 -0.335125,-4.99952 -0.506107,-9.66392 -0.506107,-14.3352 0,-12.8305 1.00538,-25.1686 2.66732,-37.0006 1.16952,-7.49586 3.16659,-16.4964 5.83391,-26.6664 2.83831,-10.3342 7.00343,-21.1676 12.6664,-32.1652 5.66977,-11.1686 12.8373,-22.3303 21.6669,-33.1637 8.83636,-10.8334 20.0049,-20.5042 33.3347,-29.1696 13.3366,-8.50124 29.1696,-15.4978 47.3347,-20.8325 18.3293,-5.33465 39.6679,-8.00197 64.3304,-8.00197l14.3352 0c123.497,5.1705 198.504,48.3333 224.835,129.502 7.49586,23.8349 11.6678,47.663 12.6664,71.8331l0 9.49977c0,20.8325 -1.83293,42.0001 -5.33465,63.3318 -3.50172,21.3317 -8.50124,42.1711 -15.1695,62.8326 -6.66147,20.5042 -13.6649,39.3328 -20.8325,56.4994 -6.99659,15.6688 -12.9947,27.6718 -17.9942,36.002 -5.1705,8.50124 -7.66684,13.0015 -7.66684,13.5008l72.6606 46.9996 27.3366 -62.9967c7.83099,-18.3361 15.9971,-35.8379 24.4983,-52.8335 8.66538,-17.0025 18.1652,-32.001 28.6703,-45.0025 10.6625,-13.0015 22.6654,-23.3357 35.9952,-30.8315 12.5022,-7.00343 26.6664,-10.5051 42.4994,-10.5051l4.00098 0c15.0054,0.335125 27.3366,3.33757 37.0006,9.17149 9.49977,5.83391 17.0025,13.5008 22.5013,23.0005 5.49879,9.49977 9.33563,20.6615 11.5037,33.4988 2.16122,12.6664 3.66586,26.3313 4.16513,40.8306 0.328286,9.67076 0.499268,19.3347 0.499268,29.1696l0 59.5018 88.1653 8.66538 1.83293 -37.3357c0.164143,-7.16758 0.834393,-16.4964 1.4978,-27.6649 0.67025,-11.1686 2.00391,-23.0005 3.6727,-35.5028 1.66195,-12.6664 4.16513,-25.3327 7.33172,-38.1632 3.33073,-12.6664 7.33172,-24.1701 12.4954,-34.5042 5.00636,-10.3342 11.3395,-18.6644 18.8354,-24.9976 7.5027,-6.33318 16.6674,-9.66392 27.5008,-9.66392 9.8349,0 18.5003,2.83147 26.1671,8.4944 7.83099,5.66977 14.1642,13.3366 19.1637,22.8364 5.1705,9.66392 9.00051,20.6683 11.5037,33.1637 1.83293,9.8349 2.66732,20.0049 2.66732,30.3391l0 7.83099c-0.834393,18.3361 -3.50172,36.002 -8.00197,52.9977 -4.50025,17.1666 -9.66392,33.3347 -15.4978,48.3333 -5.83391,14.9986 -11.832,28.8344 -18.1652,41.3367 -6.50417,12.4954 -12.003,23.3288 -16.6674,32.5003l76.1623 39.9962z"/>
   <glyph unicode="ن" horiz-adv-x="708" d="M50.5013 -74.8355c-2.66732,18.3361 -4.00098,36.5013 -4.00098,54.3382 0,11.1617 0.834393,26.4954 2.66732,46.3294 1.66879,19.8339 6.33318,43.3337 13.6649,70.3353 7.33172,26.8305 16.5032,52.4984 27.3366,76.6684 10.8334,24.1632 22.3303,46.1652 34.1623,65.8282l69.1657 -50.8296c-3.83,-5.1705 -8.16611,-12.6664 -12.9947,-22.3371 -4.99952,-9.82806 -10.0059,-21.1608 -15.0054,-34.1623 -5.16366,-13.0015 -9.99904,-27.3366 -14.6634,-42.8345 -4.6644,-15.4978 -8.50124,-31.6659 -11.5037,-48.4974 -2.99561,-16.8383 -4.99952,-33.834 -5.82708,-51.3357 -0.335125,-4.83538 -0.506107,-9.66392 -0.506107,-14.3352 0,-12.6664 1.00538,-24.9976 2.66732,-37.0006 1.16952,-7.83099 3.33757,-16.8315 6.66831,-27.1657 3.33757,-10.1632 8.33709,-20.9966 14.9986,-32.1652 6.66831,-11.1686 15.1695,-22.002 25.3327,-32.8354 10.17,-10.6625 22.3371,-20.3332 36.6723,-28.8344 14.3283,-8.4944 31.1666,-15.4978 50.4945,-20.8325 19.1705,-5.49879 41.1725,-8.16611 65.835,-8.16611 30.6674,0 58.5033,3.00245 83.5009,8.83636 24.8335,5.66293 46.8355,14.1642 65.664,25.3327 18.8354,11.1686 34.6684,24.8335 47.3347,40.8306 12.8373,16.1681 22.3371,34.3332 28.6703,54.6664 7.83099,24.8335 11.9961,50.0021 12.6664,75.1706l0 5.16366c0,23.4998 -1.83293,46.5003 -5.66977,68.8306 -3.83,22.173 -9.00051,43.5047 -15.833,63.667 -6.83245,20.1691 -13.6649,37.6708 -20.3332,52.5052 -6.66831,14.9986 -12.5022,26.6664 -17.5017,35.3318 -5.16366,8.50124 -7.83099,12.8305 -7.99513,12.8305l72.1614 46.0011c0.834393,-1.4978 4.50025,-7.66684 10.8334,-18.5003 6.33318,-10.8334 13.6717,-25.3327 22.002,-43.4979 8.16611,-18.001 16.5032,-39.1686 24.6693,-63.3318 8.33026,-24.3342 14.8344,-50.5013 19.3347,-78.5014 3.49488,-22.3371 5.32781,-45.5018 5.32781,-69.1657 0,-6.33318 -0.499268,-18.9995 -1.33366,-37.6708 -0.827554,-18.6644 -6.49733,-43.662 -16.9956,-74.9997 -11.0044,-32.6645 -26.5023,-60.9996 -46.3362,-84.6636 -19.8339,-23.8349 -42.9986,-43.4979 -69.3299,-59.0026 -26.3381,-15.4978 -55.5008,-27.0015 -87.666,-34.4974 -32.001,-7.66684 -65.835,-11.3327 -101.502,-11.3327 -37.0006,0 -71.8331,4.50025 -103.998,13.6649 -32.3362,9.16465 -61.1706,22.8364 -86.3392,41.3367 -25.3327,18.3293 -46.1652,41.665 -62.8326,69.8292 -16.6674,28.0001 -28.0001,61.1706 -33.663,98.9987zm377.33 355.335l-70.8345 -70.8345 -71.3338 71.3338 70.8345 70.8345 71.3338 -71.3338z"/>
  </font>
  <font id="FontID0" horiz-adv-x="672" font-variant="normal" style="fill-rule:nonzero" font-weight="700">
	<font-face 
		font-family="IRANSans(FaNum)">
		<font-face-src>
			<font-face-name name="IRANSans(FaNum) Bold"/>
		</font-face-src>
	</font-face>
   <missing-glyph><path d="M0 0z"/></missing-glyph>
   <glyph unicode=" " horiz-adv-x="302" d=""/>
   <glyph unicode="ب" horiz-adv-x="875" d="M432.168 -26.1671c-26.003,0 -54.1672,1.16952 -84.3353,3.16659 -30.1681,2.00391 -60.3294,5.99806 -90.4975,12.1671 -30.1681,5.99806 -59.3377,14.6634 -87.5019,25.6679 -28.3352,10.9976 -53.4969,25.3327 -75.6699,42.9986 -22.1661,17.6659 -40.3313,39.1686 -54.3313,64.5013 -14.1642,25.4969 -22.002,55.665 -23.6639,90.6685 0,17.1666 1.83293,33.663 5.49879,49.8311 3.83,15.9971 8.83636,31.8301 14.9986,47.1637 6.33318,15.3337 13.3366,30.5032 21.3317,45.5018 8.00197,14.8344 16.1681,29.833 24.6693,45.0025l102.165 -85.669c-4.32927,-6.16904 -9.49977,-14 -15.3337,-23.6639 -5.66293,-9.8349 -11.3327,-20.0049 -16.6674,-30.6674 -5.32781,-10.8334 -9.82806,-21.6669 -13.5008,-32.5003 -3.66586,-10.8334 -5.49879,-20.3332 -5.49879,-28.4993 0,-10.6693 4.00098,-20.1691 12.003,-28.6703 8.00197,-8.33026 18.8354,-15.833 32.6645,-22.3303 13.6649,-6.50417 30.1681,-12.003 49.1677,-16.5032 18.9995,-4.50025 39.5037,-8.33026 61.6699,-11.3327 22.1661,-2.99561 45.3308,-5.16366 69.494,-6.49733 24.3342,-1.33366 48.6684,-2.00391 73.3377,-2.00391 20.6683,0 43.9972,1.00538 70.1643,3.00245 26.3313,2.16806 53.3328,5.33465 81.1687,9.8349 27.8291,4.50025 55.5008,10.3342 83.0016,17.3308 27.5008,7.16758 52.8335,15.833 75.6631,26.003 -3.50172,13.5008 -7.66684,26.6664 -12.3312,38.9976 -4.83538,12.5022 -10.6693,25.4969 -17.6659,38.9976 -7.00343,13.5008 -15.1695,27.8359 -24.8335,43.1696 -9.49977,15.4978 -20.8325,32.9996 -33.834,52.6694l107.001 69.494c5.16366,-8.33026 11.1617,-18.6644 18.1652,-30.8315 6.99659,-12.1671 14,-25.3327 21.1676,-39.3328 6.99659,-14 14,-28.8344 20.8325,-44.4964 6.83245,-15.6688 12.8305,-31.3376 18.1652,-46.9996 5.49879,-15.6688 9.49977,-31.0025 12.5022,-45.8369 2.83147,-14.9986 4.00098,-28.9986 3.50172,-42.0001 -1.50464,-24.3342 -9.8349,-45.8301 -25.3327,-64.5013 -15.3337,-18.8286 -35.0035,-34.9966 -58.8384,-48.9967 -23.9991,-13.8359 -50.8296,-25.6679 -80.8336,-35.1676 -29.9971,-9.67076 -60.5004,-17.3308 -91.3319,-23.0005 -30.8315,-5.83391 -60.8355,-9.99904 -89.8341,-12.6664 -28.9986,-2.66732 -54.4955,-4.00098 -76.4975,-4.00098zm-2.16806 -238.165l-96.5024 96.4955 96.5024 96.5024 96.5024 -96.5024 -96.5024 -96.4955z"/>
   <glyph unicode="ط" horiz-adv-x="789" d="M376.503 -26.1671c-32.6713,0 -64.3372,1.16952 -95.0046,3.33073 -30.4964,2.16806 -60.6645,6.0049 -90.3333,11.5037 -29.833,5.49879 -59.495,13.1656 -89.1638,22.8296 -29.833,9.67076 -60.3362,22.173 -91.5029,37.1715l50.0021 128.332c48.6684,-18.6644 87.1668,-32.001 115.666,-40.5023 5.49879,7.5027 11.6678,15.833 18.3361,25.0044 6.83245,9.16465 15.1627,20.1622 24.9976,33.3279 1.83293,13.0015 3.33073,25.0044 4.6644,35.8379 1.33366,10.8334 2.3322,21.1676 3.00245,30.9957 0.663411,9.99904 1.33366,19.5057 1.66879,28.8344 0.499268,9.16465 0.663411,18.8354 0.663411,28.6703 0,13.3298 -0.499268,30.3323 -1.66879,50.8296 -1.16268,20.6683 -2.49634,42.4994 -4.16513,65.835 -1.4978,23.3357 -3.50172,46.9996 -5.66293,70.8345 -2.16806,23.9991 -4.17197,46.1652 -6.0049,66.3343 -1.99707,20.3332 -3.66586,37.664 -5.49879,51.8281 -1.66195,14.171 -2.99561,23.3357 -3.83,27.3366l137.832 36.5013 4.6644 -46.0011c2.3322,-21.0035 4.83538,-43.3337 7.16758,-67.1687 2.50318,-23.9991 4.83538,-48.4974 6.83245,-73.8301 2.00391,-25.1686 3.83684,-50.8364 5.33465,-76.8326 1.66879,-26.1671 2.66732,-51.835 3.33073,-77.0036 13.8359,12.1671 27.6718,23.3357 41.0015,33.4988 13.5008,10.17 27.8359,18.8354 42.6703,26.3381 14.9986,7.33172 31.1666,13.1656 48.6616,17.4949 17.5017,4.33611 37.3357,6.83245 59.3377,7.5027 23.0005,0.499268 45.6659,-2.66732 68.1672,-9.8349 22.3303,-7.16758 42.8276,-17.6659 60.9996,-31.5018 18.3293,-14 33.663,-31.3308 46.1652,-51.9991 12.5022,-20.6615 20.1691,-44.3323 23.0005,-70.6635 0.335125,-37.3357 -5.1705,-70.6704 -16.5032,-99.8331 -11.3327,-28.9986 -26.6664,-54.5023 -45.8301,-76.1692 -19.3347,-21.831 -41.8359,-40.3313 -67.5038,-55.5008 -25.661,-15.1627 -52.6625,-27.5008 -80.9977,-36.6654 -28.4993,-9.33563 -57.3338,-16.1681 -86.4965,-20.3332 -29.3337,-4.16513 -57.3338,-6.33318 -84.0002,-6.33318zm182.999 319.169c-17.3376,0 -37.0006,-4.50025 -58.8384,-13.5008 -21.831,-8.83636 -44.3323,-21.5027 -67.1618,-37.835 -23.0005,-16.1681 -45.5018,-35.5028 -67.6679,-58.1682 -22.1661,-22.6654 -42.3352,-47.4989 -60.6645,-74.8287 10.1632,-0.834393 20.8325,-1.50464 31.8301,-2.00391 10.9976,-0.335125 21.1676,-0.499268 30.3323,-0.499268 43.5047,0 82.6665,4.33611 117.67,13.1656 34.9966,8.83636 64.6655,20.1691 89.1638,33.6698 24.4983,13.6649 43.1696,28.6635 56.0001,44.8315 13.0015,16.1681 18.9995,31.6659 18.1652,46.5003 -1.4978,8.66538 -5.66293,16.1681 -12.4954,22.3303 -6.83245,6.33318 -14.6703,11.3327 -23.8349,15.3337 -9.16465,3.83684 -18.5003,6.66831 -28.1642,8.50124 -9.49977,1.66879 -17.6727,2.50318 -24.3342,2.50318z"/>
   <glyph unicode="ف" horiz-adv-x="863" d="M459.169 111.33c10.9976,0 23.9991,0 39.1618,0.170982 15.0054,0.164143 31.1666,0.663411 48.3333,1.33366 17.3376,0.663411 35.0035,1.83293 52.8335,3.33073 18.001,1.33366 35.1676,3.50172 51.6708,6.50417 16.3322,2.83147 31.3308,6.49733 44.9957,10.8334 13.5008,4.32927 24.6693,9.66392 33.3347,15.9971 -37.835,-3.66586 -72.8316,-4.6644 -104.498,-3.00245 -31.6659,1.83293 -59.1667,7.83783 -82.1672,18.3361 -23.0005,10.3342 -41.0015,26.003 -54.003,46.6645 -12.8305,20.6683 -19.3347,48.5042 -19.663,83.3368 0,15.833 1.4978,32.3293 4.6644,49.3318 3.33073,17.0025 8.16611,33.6698 14.6703,50.0021 6.49733,16.3322 14.4993,31.8301 24.1632,46.5003 9.49977,14.6634 20.6683,27.5008 33.1637,38.4984 12.6732,10.9976 26.6732,19.8339 42.1711,26.3313 15.4978,6.50417 32.5003,9.67076 50.6655,9.67076 23.0005,0 43.833,-4.33611 62.8326,-13.0015 18.9995,-8.66538 36.1662,-20.5042 51.3357,-35.5028 15.1627,-14.8344 28.4993,-32.1652 39.9962,-51.835 11.5037,-19.8271 21.0035,-40.4954 28.4993,-62.1623 7.5027,-21.8379 13.1725,-44.004 17.0025,-66.4984 3.66586,-22.6722 5.49879,-44.5033 5.49879,-65.3357 0,-34.6684 -4.82854,-65.0006 -14.4993,-90.8326 -9.66392,-25.832 -23.1647,-47.834 -40.6664,-66.1701 -17.3308,-18.1652 -37.9991,-33.1637 -61.9982,-44.9957 -23.8349,-11.6678 -50.0021,-20.8325 -78.6655,-27.5008 -28.4993,-6.66831 -58.6674,-11.3327 -90.6685,-13.6649 -31.8369,-2.50318 -64.5013,-3.83684 -97.836,-3.83684 -34.9966,0 -70.3284,1.16952 -105.995,3.50172 -35.6669,2.3322 -70.0001,6.66831 -103,12.8305 -33.1706,6.33318 -64.0021,14.8344 -92.6724,26.003 -28.6635,10.9976 -53.6611,25.3327 -74.9997,42.9986 -21.3317,17.6659 -37.9991,39.1686 -50.1662,64.3304 -12.1671,25.1686 -18.3293,55.0016 -18.3293,89.5058 0,17.1666 1.83293,33.663 5.66293,49.8311 3.83684,15.9971 8.83636,31.8301 14.9986,47.1637 6.16904,15.3337 13.3366,30.5032 21.3386,45.5018 7.99513,14.8344 16.1681,29.833 24.4983,45.0025l102.165 -85.669c-4.32927,-6.16904 -9.33563,-14 -15.1627,-23.6639 -5.83391,-9.8349 -11.3395,-20.0049 -16.6674,-30.6674 -5.49879,-10.8334 -9.99904,-21.6669 -13.5008,-32.5003 -3.66586,-10.8334 -5.49879,-20.3332 -5.49879,-28.4993 0,-13.8359 8.66538,-26.1671 25.832,-37.1715 17.3308,-10.8334 40.6664,-19.9981 70.3353,-27.8291 29.4979,-7.66684 64.1662,-13.3366 103.827,-17.3376 39.6679,-3.83 82.0031,-5.83391 127.006,-5.83391zm178.663 265.672c-6.66831,0.164143 -13.5008,-1.66879 -20.6683,-5.83391 -7.16074,-4.33611 -13.4939,-9.8349 -19.3278,-16.8383 -5.83391,-6.99659 -10.6693,-14.9986 -14.4993,-23.8281 -4.00098,-9.00051 -6.0049,-18.1652 -6.0049,-27.5008 0,-8.66538 2.66732,-15.833 8.16611,-21.3317 5.33465,-5.50563 12.1671,-9.8349 20.6683,-13.0015 8.33709,-3.16659 17.8369,-5.33465 28.3352,-6.66831 10.6625,-1.33366 20.9966,-1.99707 31.3308,-2.16806 10.3342,-0.164143 19.9981,0 28.9986,0.335125 9.00051,0.499268 16.1681,0.998536 21.6669,1.4978 -2.66732,13.1656 -5.99806,26.3381 -10.1632,39.6679 -4.16513,13.3366 -9.49977,25.5037 -15.833,36.5013 -6.50417,10.9976 -14,20.1691 -22.6654,27.3298 -8.67222,7.33856 -18.6713,11.1686 -30.004,11.8388zm8.16611 182.999l-96.4955 96.4955 96.4955 96.6734 96.5024 -96.6734 -96.5024 -96.4955z"/>
   <glyph unicode="ق" horiz-adv-x="684" d="M336.999 -165.668c25.1686,0 48.6684,3.50172 70.6704,10.4983 21.831,6.83929 41.665,16.5032 59.495,28.8344 17.8369,12.3381 33.3347,27.0015 46.6713,44.1681 13.3298,17.1666 23.9991,35.831 31.8301,56.0001 -46.1652,0.335125 -86.3324,3.50172 -120.83,9.49977 -34.5042,5.83391 -63.3387,15.6688 -86.5033,29.4979 -23.3357,13.8359 -40.8306,32.001 -52.8335,54.8374 -12.1671,22.6654 -18.6644,51.0006 -19.8339,84.9987 0,15.6688 2.00391,32.5003 5.83391,50.6655 4.00098,18.001 9.67076,36.002 17.0025,53.8321 7.33172,17.8369 16.4964,35.0035 27.3298,51.3357 10.8334,16.3322 23.1715,30.8315 36.8364,43.1696 13.5008,12.4954 28.6635,22.4944 45.1667,29.9971 16.4964,7.66684 34.1623,11.3327 52.9977,11.3327 27.8359,0 52.8335,-5.66293 74.9997,-17.3308 22.1661,-11.6678 41.8359,-27.0015 58.6674,-46.3362 17.0025,-19.3347 31.3308,-41.3298 43.1696,-66.3343 11.661,-24.8335 21.1676,-50.6655 28.1642,-77.3319 7.16758,-26.6664 11.832,-53.3328 14.1642,-79.835 2.33904,-26.4954 2.66732,-50.8296 0.834393,-73.1667 0,-28.4993 -4.00098,-56.4994 -11.9961,-84.1643 -7.83783,-27.6649 -19.1705,-54.003 -33.6698,-79.0006 -14.4993,-24.8335 -31.8301,-47.834 -52.3342,-69.0016 -20.4974,-21.1676 -42.9986,-39.4969 -67.8321,-54.9947 -24.8335,-15.5047 -51.4999,-27.6718 -80.1633,-36.3371 -28.6703,-8.66538 -58.6674,-13.0015 -89.6699,-13.0015 -43.9972,0 -85.669,7.00343 -125.002,21.0035 -39.1618,14 -73.495,34.1623 -103,60.5004 -29.3337,26.1671 -52.6625,57.833 -70.0001,95.1619 -17.1666,37.1715 -25.832,79.1716 -25.832,125.836 0,21.831 0.998536,42.4994 3.16659,62.4974 2.16806,19.8339 5.66977,39.5037 10.4983,59.0026 4.83538,19.6698 11.1686,39.5037 18.8354,59.666 7.83099,20.1691 17.5017,41.3367 28.8344,63.667l109.497 -46.1652c-11.3327,-20.8325 -20.4974,-40.3313 -27.6649,-58.5033 -6.99659,-17.9942 -12.5022,-35.1608 -16.4964,-51.1647 -3.83684,-16.1681 -6.50417,-31.5018 -8.00197,-46.1652 -1.50464,-14.6703 -2.16806,-28.6703 -2.16806,-42.3352 0,-25.832 5.83391,-48.9967 17.3308,-69.665 11.6678,-20.4974 27.0015,-37.835 46.3362,-52.1701 19.3347,-14.1642 41.5008,-24.9976 66.8335,-32.3293 25.1686,-7.33172 51.3357,-11.0044 78.6655,-10.6693zm113.833 420.001c-8.33026,0.834393 -17.1666,-1.4978 -26.5023,-7.33172 -9.32879,-5.83391 -17.6659,-13.6649 -24.9976,-23.4998 -7.33172,-9.8349 -13.0015,-20.8325 -17.0025,-32.9996 -3.83,-12.1671 -4.32927,-24.1701 -1.4978,-35.6669 2.66732,-11.0044 8.16611,-19.4988 16.8315,-25.3327 8.50124,-5.66977 20.1691,-9.99904 34.6684,-12.8373 14.6703,-2.66732 32.1652,-4.32927 52.6694,-4.6644 20.4974,-0.499268 43.833,-0.67025 70.1643,-0.67025 -0.834393,12.1671 -3.83,26.1671 -9.00051,42.0001 -5.33465,15.6688 -12.4954,30.8384 -21.6669,45.1667 -9.00051,14.3352 -19.8339,26.8374 -32.3293,37.3357 -12.5022,10.6693 -26.1671,16.8315 -41.3367,18.5003zm-9.8349 282.504l-81.6611 -81.668 -84.5063 84.0002 83.5009 83.8292 82.6665 -82.6665 81.668 81.8321 84.4994 -83.9933 -83.5009 -83.836 -82.6665 82.5024z"/>
   <glyph unicode="م" horiz-adv-x="537" d="M32.9996 -346.164l-16.8315 430.499c0,1.99707 0.164143,6.99659 0.834393,14.9986 0.499268,8.00197 2.16122,17.1666 4.99952,27.6649 2.66732,10.3342 7.16758,21.3317 13.5008,32.5003 6.1622,11.3327 14.9986,21.3317 26.1671,30.004 5.32781,4.6644 11.3327,8.4944 18.1652,11.661 6.83245,3.00245 13.829,5.33465 21.3317,7.16758 7.33172,1.66879 14.8344,2.66732 22.3303,3.00245 7.5027,0.335125 14.8344,0.164143 21.6669,-0.499268 8.50124,21.1676 18.6713,42.6635 31.0025,64.3304 12.1671,21.8379 26.3313,41.5008 42.4994,59.0026 16.3322,17.5017 34.5042,31.8301 54.6664,42.8345 19.9981,10.9976 42.3352,16.4964 66.6694,16.4964 19.1637,-0.663411 36.6654,-3.83 52.6625,-9.8349 15.833,-5.82708 30.3391,-13.829 43.1696,-23.8281 13.0015,-9.99904 24.3342,-21.8379 34.1691,-35.3386 9.82806,-13.3298 18.1652,-28.0001 24.8335,-43.662 6.66147,-15.6688 11.661,-32.001 14.9986,-49.1677 3.33073,-17.0025 4.99952,-34.3332 4.99952,-51.664 0,-13.0015 -1.33366,-27.0015 -4.00098,-41.6718 -2.50318,-14.8344 -6.33318,-29.3337 -11.3327,-43.833 -4.83538,-14.3352 -10.9976,-28.0001 -18.1652,-41.1657 -7.33856,-13.3298 -15.3337,-24.8335 -24.3342,-34.8325 -9.00051,-9.99904 -18.8354,-18.001 -29.6688,-23.9991 -10.6625,-5.83391 -22.1661,-8.83636 -34.3332,-8.83636 -21.6669,0 -44.8315,2.83831 -69.3299,8.66538 -24.5052,5.83391 -48.3333,13.0015 -71.5048,21.5027 -23.1647,8.66538 -44.4964,17.8369 -63.8311,27.8359 -19.4988,9.99904 -34.8325,19.3278 -46.1652,28.0001 1.66195,-31.8369 3.83,-64.5013 6.33318,-98.0002 2.49634,-33.4988 4.99952,-67.0045 7.66684,-100.668 2.49634,-33.4988 4.99952,-67.0045 7.33172,-100.332 2.3322,-33.3347 4.33611,-65.835 5.99806,-97.5009l-136.499 -21.3317zm304.335 604.498c-10.6693,0.164143 -20.1691,-2.50318 -28.4993,-8.16611 -8.16611,-5.66977 -15.5047,-12.6664 -22.1661,-21.0035 -6.50417,-8.4944 -12.003,-17.4949 -16.6674,-27.1657 -4.67124,-9.8349 -8.66538,-18.5003 -12.1671,-26.3313 8.66538,-4.99952 19.1637,-9.99904 31.3308,-15.1695 12.1671,-5.32781 24.8335,-10.3342 37.9991,-14.9986 13.1656,-4.83538 26.1671,-9.00051 39.1686,-12.6664 12.8305,-3.66586 24.3342,-6.33318 34.1691,-8.00197 5.16366,13.0015 7.33172,27.1725 6.1622,42.4994 -0.998536,15.5047 -4.32927,29.8398 -10.1632,43.1696 -5.83391,13.3366 -13.6649,24.4983 -23.8349,33.6698 -10.1632,9.16465 -22.002,13.829 -35.3318,14.1642z"/>
   <glyph unicode="ه" horiz-adv-x="430" d="M210.835 -26.1671c-23.4998,0 -47.1706,4.16513 -70.9987,12.3312 -24.0059,8.00197 -45.6728,19.6698 -65.3357,35.0035 -19.4988,15.1627 -35.5028,33.663 -47.834,55.5008 -12.1671,21.9952 -18.3361,46.6645 -18.3361,74.1653 0,57.9972 25.6679,118.169 76.8394,180.503 4.16513,4.82854 7.49586,8.99367 10.3273,12.1671 2.66732,3.16659 5.1705,5.99806 7.5027,8.66538 2.3322,2.66732 4.50025,4.99952 6.49733,6.99659l7.83783 7.83783 -26.5023 22.4944 86.5033 105.667c14.8276,-10.9976 32.5003,-25.832 52.8335,-44.4964 20.4974,-18.6713 44.3323,-42.4994 71.4979,-71.5048 75.1638,-85.498 112.664,-161.66 112.664,-228.33 0,-28.9986 -5.99806,-54.5023 -17.83,-76.4975 -11.832,-22.002 -27.3366,-40.5023 -46.5003,-55.5008 -19.1705,-14.8344 -40.8374,-26.1671 -65.1648,-33.6698 -24.3342,-7.49586 -49.0035,-11.3327 -74.0011,-11.3327zm84.3285 177.001c0,9.00051 -2.83147,19.1637 -8.66538,30.4964 -5.83391,11.3395 -13.3298,23.1715 -22.8296,35.3386 -9.33563,12.3312 -19.8339,24.8335 -31.5018,37.4998 -11.6678,12.4954 -23.1647,24.6625 -34.8325,36.3303 -7.83099,-8.82952 -16.0039,-18.5003 -24.6693,-29.3337 -8.82952,-10.9976 -16.6674,-22.5013 -23.9991,-34.6684 -7.16758,-12.1603 -13.1656,-24.6625 -17.83,-37.664 -4.67124,-12.8305 -6.66831,-25.4969 -6.0049,-37.9991 0.170982,-6.83245 3.50172,-13.0015 10.0059,-18.1652 6.33318,-5.33465 14,-9.49977 22.8296,-12.6664 8.83636,-3.16659 18.1652,-5.49879 28.0001,-7.16758 9.8349,-1.66879 18.3361,-2.3322 25.1686,-2.3322 8.66538,0 18.001,0.663411 28.0001,1.83293 9.99904,1.33366 19.1637,3.66586 27.5008,6.83245 8.16611,3.16659 15.1627,7.33172 20.6615,12.5022 5.50563,5.32781 8.16611,11.661 8.16611,19.1637z"/>
   <glyph unicode="ک" horiz-adv-x="929" d="M422.169 113.498c15.662,-0.328286 33.9981,-0.499268 55.1657,-0.663411 21.1676,-0.170982 42.9986,0.499268 65.4999,1.99707 22.5013,1.33366 44.4964,3.83684 66.3343,7.16758 21.6669,3.33073 41.1657,8.33709 58.4965,14.9986 17.1666,6.66831 31.1666,15.1695 41.665,25.6679 10.6693,10.3342 15.8398,23.4998 15.8398,38.9976 0,12.5022 -5.1705,26.3381 -15.8398,41.3367 -10.4983,15.1695 -26.1603,32.5003 -46.6645,51.9991 -20.6683,19.4988 -46.1652,41.8359 -76.4975,66.6694 -30.5032,24.9976 -65.4999,53.4969 -105.332,85.6621l14.3283 128.839 392.172 170.832 53.9962 -127.833 -306.496 -130.836c16.1612,-13.6649 32.6645,-27.8291 49.4959,-42.1642 16.8315,-14.4993 32.9996,-29.4979 48.6684,-44.6674 15.6688,-15.1695 30.3323,-30.6674 43.9972,-46.5003 13.5008,-15.833 25.5037,-31.8369 35.6669,-48.3333 10.17,-16.3322 17.8369,-32.8354 23.1715,-49.6669 5.32781,-16.8315 7.83099,-33.9981 7.16074,-51.3357 -1.33366,-38.3342 -9.00051,-70.4994 -22.8296,-96.8307 -13.6649,-26.1671 -31.5018,-47.834 -53.5038,-65.0006 -21.831,-17.0025 -46.8286,-30.1681 -75.1638,-39.4969 -28.1642,-9.33563 -57.833,-16.0039 -88.6646,-20.5042 -30.8384,-4.32927 -61.834,-6.83245 -93.0007,-7.49586 -31.1666,-0.834393 -60.6713,-1.16952 -88.5004,-1.16952 -30.1681,0 -61.3348,1.16952 -93.6709,3.50172 -32.3293,2.3322 -63.8311,6.66831 -94.6626,12.8305 -30.6674,6.33318 -59.837,14.9986 -87.3309,26.1671 -27.5008,11.1686 -51.6708,25.5037 -72.1682,43.1696 -20.6683,17.6659 -37.0006,39.1618 -49.1677,64.1662 -12.1671,24.9976 -18.1652,54.8306 -18.1652,89.3348 0,28.1642 4.82854,55.665 14.4993,82.6665 9.66392,26.8305 22.6654,52.9977 38.8335,78.1662l103.164 -75.1706c-4.16513,-7.16758 -8.50124,-14.6634 -13.3298,-22.1661 -4.83538,-7.49586 -9.17149,-15.1627 -13.0015,-23.0005 -4.00098,-7.83099 -7.16758,-15.833 -9.8349,-23.9991 -2.66732,-8.00197 -3.83,-16.1681 -3.83,-24.3342 0,-11.3327 3.99415,-21.3317 11.832,-30.1681 7.99513,-8.82952 18.9995,-16.4964 33.1637,-23.0005 14,-6.66147 30.5032,-12.1603 49.5028,-16.8315 18.9995,-4.6644 39.4969,-8.50124 61.663,-11.6678 22.3371,-3.16659 45.5018,-5.66293 69.836,-7.49586 24.3342,-1.66879 48.8325,-3.00245 73.5019,-3.83684z"/>
  </font>
  <style type="text/css">
   <![CDATA[
    @font-face { font-family:"IRANSans(FaNum)";font-variant:normal;font-weight:normal;src:url("#FontID1") format(svg)}
    @font-face { font-family:"IRANSans(FaNum)";font-variant:normal;font-weight:bold;src:url("#FontID0") format(svg)}
    .fil2 {fill:black}
    .fil1 {fill:black}
    .fil0 {fill:#05FFDE}
    .fil3 {fill:white}
    .fnt1 {font-weight:normal;font-size:1462.14px;font-family:'IRANSans(FaNum)'}
    .fnt0 {font-weight:bold;font-size:1462.14px;font-family:'IRANSans(FaNum)'}
   ]]>
  </style>
 </defs>
 <g id="Layer_x0020_1" block_area="1">
  <metadata id="CorelCorpID_0Corel-Layer"/>
  <path block="sen" class="fil1" d="M22998.12 4384.6l-15705.07 -8.72c-263.25,1533.37 1683.02,2550.88 2773.99,2978.95 1383.66,542.93 3353.75,838.84 5076.98,839.71 1682.29,0.84 3701.62,-315.3 5054.33,-815.49 1038.56,-384.02 2914.64,-1513.29 2799.77,-2994.45z"/>
  <path block="VIP" class="fil0" d="M11022.87 10080.26c-350.53,1673.8 -309.64,1574.67 -307.57,1576.58 2717.06,545.07 6864.64,516.03 9372.31,-12.01 -323.99,-1647.83 0,0 -323.99,-1647.83 -4931.44,664.78 -8710.8,-59.78 -8740.75,83.26z"/>
  <path block="A" class="fil0" d="M15334.12 12598.57c-1899.92,-43.98 -2874.97,-171.76 -4754.71,-412.45 -75.69,316.29 -380.95,2863.82 -399.77,3372.28 -46.6,1259.37 -33.59,2543.48 61.29,3766.85 667.31,199.32 4250.91,317.71 5113.28,317.71 1011.78,0 4130.9,-108.58 4983.8,-300.43 167.3,-1115.3 237.86,-2403.86 197.66,-4084.02 -23.08,-465.7 -133.34,-2032.47 -344.9,-3122.42 -2626.33,459.18 -3353.9,462.01 -4856.65,462.48z"/>
  <path block="B" class="fil0" d="M9753.48 19257.3c-255.45,-1494.29 37.05,-5975.27 299.6,-7191.96 -2205.46,-383.04 0,0 -2205.46,-383.04 -1538.35,-261.61 -1409.75,-452.18 -1870.83,177.57 -1343.47,1772.66 -1897.31,3998.29 -1936.35,6191.51 5713.04,1205.92 0,0 5713.04,1205.92z"/>
  <path block="C" class="fil0" d="M20881.41 19242.23c255.45,-1494.29 26.08,-6020.52 -236.47,-7237.21 2205.47,-383.04 0,0 2205.47,-383.04 1538.34,-261.6 1409.74,-452.18 1870.82,177.58 1343.47,1772.65 1807.62,4017.21 1846.66,6210.43 -5713.04,1205.92 26.55,26.33 -5686.48,1232.24z"/>
  <path block="D" class="fil0" d="M10253.74 19839.71c196.1,2408.98 354.14,3550.32 1373.4,6700.12 7333.23,-6.17 -13.71,0 7319.52,-6.17 868.08,-2506.26 1133.25,-3813.22 1436.02,-6705.38 -3580.63,425.67 -6383.46,472.83 -10128.94,11.43z"/>
  <path block="E" class="fil0" d="M4137.97 18625.35c-28.57,407.57 158.62,1214.96 250.66,1618.47 385.38,1689.56 1410.33,3728.3 2589.86,4961.52 1054.95,930.45 1011.98,1014.47 2443.61,1157.33 1647.75,154.07 0,0 1647.75,154.07 -1095.9,-4067.03 -1005.23,-3691.94 -1278.66,-6753.73 -5653.22,-1137.66 0,0 -5653.22,-1137.66z"/>
  <path block="F" class="fil0" d="M19505.62 26524.71c2575.74,-180.1 93.19,-6.5 2495.91,-170.07 523.43,-63.86 436.92,-88.61 698.01,-306.17 617.64,-514.64 1304.57,-1385.23 1830.77,-2106.6 581.06,-796.57 951.07,-1484.89 1348.06,-2372.1 304.81,-681.22 699.07,-2119.85 680.51,-2987.84 -5683.66,1129.67 43.86,0 -5719.77,1153.2 -187.84,2729.47 -473.89,4025.48 -1333.49,6789.58z"/>
  <path block="-1" class="fil0" d="M6691.59 10982.71c431.52,157.88 3245.27,618.05 3485.93,605.58 358.51,-1624.23 0,0 358.51,-1624.23 -2282.3,-455.5 0,0 -2282.3,-455.5 -518.64,297.88 -1259.68,985.67 -1562.14,1474.15z"/>
  <path block="-1" class="fil0" d="M24063.38 10916.35c-431.53,157.88 -3245.28,618.05 -3485.94,605.58 -358.51,-1624.23 0,0 -358.51,-1624.23 2282.3,-455.5 0,0 2282.3,-455.5 518.64,297.88 1259.68,985.67 1562.15,1474.15z"/>
  <text block_name="text" x="10000" y="3358.06"  class="fil2 fnt0">طبقه همکف</text>
  <text block_name="sen" x="13700" y="6300"  class="fil3 fnt1">سن</text>
  <text block_name="A" x="14904.08" y="16585.05"  class="fil2 fnt1">A</text>
  <text block_name="B" x="6569.62" y="15866.72"  class="fil1 fnt1">B</text>
  <text block_name="C" x="23085.4" y="15872.9"  class="fil2 fnt1">C</text>
  <text block_name="D" x="14775.29" y="23703.72"  class="fil2 fnt1">D</text>
  <text block_name="E" x="7151.36" y="23090.72"  class="fil2 fnt1">E</text>
  <text block_name="F" x="22536.05" y="23073"  class="fil2 fnt1">F</text>
  <text block_name="VIP" x="14262.88" y="11727.65"  class="fil2 fnt1">VIP</text>
 </g>
</svg>
