[ {
  "idema" : "3194U",
  "lon" : -3.724167,
  "fint" : "2019-04-08T12:00:00",
  "prec" : 0.0,
  "alt" : 664.0,
  "vmax" : 11.2,
  "vv" : 4.7,
  "dv" : 256.0,
  "lat" : 40.45167,
  "dmax" : 252.0,
  "ubi" : "MADRID  C. UNIVERSITARIA",
  "hr" : 58.0,
  "tamin" : 11.1,
  "ta" : 13.5,
  "tamax" : 14.0,
  "tpr" : 5.5,
  "rviento" : 143.0
}, {
  "idema" : "3194U",
  "lon" : -3.724167,
  "fint" : "2019-04-08T13:00:00",
  "prec" : 0.1,
  "alt" : 664.0,
  "vmax" : 11.2,
  "vv" : 5.6,
  "dv" : 253.0,
  "lat" : 40.45167,
  "dmax" : 251.0,
  "ubi" : "MADRID  C. UNIVERSITARIA",
  "hr" : 39.0,
  "tamin" : 13.2,
  "ta" : 15.9,
  "tamax" : 16.4,
  "tpr" : 1.9,
  "rviento" : 188.0
}, {
  "idema" : "3194U",
  "lon" : -3.724167,
  "fint" : "2019-04-08T14:00:00",
  "prec" : 0.0,
  "alt" : 664.0,
  "vmax" : 10.5,
  "vv" : 4.8,
  "dv" : 270.0,
  "lat" : 40.45167,
  "dmax" : 245.0,
  "ubi" : "MADRID  C. UNIVERSITARIA",
  "hr" : 32.0,
  "tamin" : 15.1,
  "ta" : 17.3,
  "tamax" : 17.9,
  "tpr" : 0.4,
  "rviento" : 181.0
}, {
  "idema" : "3194U",
  "lon" : -3.724167,
  "fint" : "2019-04-08T15:00:00",
  "prec" : 0.1,
  "alt" : 664.0,
  "vmax" : 11.6,
  "vv" : 3.0,
  "dv" : 231.0,
  "lat" : 40.45167,
  "dmax" : 275.0,
  "ubi" : "MADRID  C. UNIVERSITARIA",
  "hr" : 29.0,
  "tamin" : 16.4,
  "ta" : 17.2,
  "tamax" : 18.0,
  "tpr" : -1.0,
  "rviento" : 166.0
}, {
  "idema" : "3194U",
  "lon" : -3.724167,
  "fint" : "2019-04-08T16:00:00",
  "prec" : 0.0,
  "alt" : 664.0,
  "vmax" : 9.0,
  "vv" : 4.1,
  "dv" : 248.0,
  "lat" : 40.45167,
  "dmax" : 234.0,
  "ubi" : "MADRID  C. UNIVERSITARIA",
  "hr" : 31.0,
  "tamin" : 15.5,
  "ta" : 15.8,
  "tamax" : 17.6,
  "tpr" : -1.2,
  "rviento" : 139.0
}, {
  "idema" : "3194U",
  "lon" : -3.724167,
  "fint" : "2019-04-08T17:00:00",
  "prec" : 0.1,
  "alt" : 664.0,
  "vmax" : 9.5,
  "vv" : 3.9,
  "dv" : 235.0,
  "lat" : 40.45167,
  "dmax" : 264.0,
  "ubi" : "MADRID  C. UNIVERSITARIA",
  "hr" : 30.0,
  "tamin" : 15.8,
  "ta" : 16.3,
  "tamax" : 17.8,
  "tpr" : -1.4,
  "rviento" : 159.0
}, {
  "idema" : "3194U",
  "lon" : -3.724167,
  "fint" : "2019-04-08T18:00:00",
  "prec" : 0.0,
  "alt" : 664.0,
  "vmax" : 10.5,
  "vv" : 3.1,
  "dv" : 298.0,
  "lat" : 40.45167,
  "dmax" : 245.0,
  "ubi" : "MADRID  C. UNIVERSITARIA",
  "hr" : 39.0,
  "tamin" : 12.9,
  "ta" : 13.0,
  "tamax" : 16.2,
  "tpr" : -0.7,
  "rviento" : 163.0
}, {
  "idema" : "3194U",
  "lon" : -3.724167,
  "fint" : "2019-04-08T19:00:00",
  "prec" : 0.0,
  "alt" : 664.0,
  "vmax" : 5.8,
  "vv" : 2.5,
  "dv" : 295.0,
  "lat" : 40.45167,
  "dmax" : 278.0,
  "ubi" : "MADRID  C. UNIVERSITARIA",
  "hr" : 49.0,
  "tamin" : 11.0,
  "ta" : 11.0,
  "tamax" : 12.9,
  "tpr" : 0.6,
  "rviento" : 91.0
}, {
  "idema" : "3194U",
  "lon" : -3.724167,
  "fint" : "2019-04-08T20:00:00",
  "prec" : 0.0,
  "alt" : 664.0,
  "vmax" : 6.8,
  "vv" : 2.2,
  "dv" : 318.0,
  "lat" : 40.45167,
  "dmax" : 279.0,
  "ubi" : "MADRID  C. UNIVERSITARIA",
  "hr" : 49.0,
  "tamin" : 10.3,
  "ta" : 10.3,
  "tamax" : 11.0,
  "tpr" : 0.0,
  "rviento" : 80.0
}, {
  "idema" : "3194U",
  "lon" : -3.724167,
  "fint" : "2019-04-08T21:00:00",
  "prec" : 0.1,
  "alt" : 664.0,
  "vmax" : 9.6,
  "vv" : 3.4,
  "dv" : 310.0,
  "lat" : 40.45167,
  "dmax" : 291.0,
  "ubi" : "MADRID  C. UNIVERSITARIA",
  "hr" : 68.0,
  "tamin" : 7.5,
  "ta" : 7.5,
  "tamax" : 10.4,
  "tpr" : 1.9,
  "rviento" : 144.0
}, {
  "idema" : "3194U",
  "lon" : -3.724167,
  "fint" : "2019-04-08T22:00:00",
  "prec" : 0.0,
  "alt" : 664.0,
  "vmax" : 5.4,
  "vv" : 0.5,
  "dv" : 262.0,
  "lat" : 40.45167,
  "dmax" : 321.0,
  "ubi" : "MADRID  C. UNIVERSITARIA",
  "hr" : 78.0,
  "tamin" : 6.9,
  "ta" : 7.0,
  "tamax" : 7.6,
  "tpr" : 3.4,
  "rviento" : 49.0
}, {
  "idema" : "3194U",
  "lon" : -3.724167,
  "fint" : "2019-04-08T23:00:00",
  "prec" : 0.0,
  "alt" : 664.0,
  "vmax" : 1.3,
  "vv" : 0.2,
  "dv" : 242.0,
  "lat" : 40.45167,
  "dmax" : 260.0,
  "ubi" : "MADRID  C. UNIVERSITARIA",
  "hr" : 79.0,
  "tamin" : 6.9,
  "ta" : 6.9,
  "tamax" : 7.2,
  "tpr" : 3.6,
  "rviento" : 19.0
}, {
  "idema" : "3194U",
  "lon" : -3.724167,
  "fint" : "2019-04-09T00:00:00",
  "prec" : 0.0,
  "alt" : 664.0,
  "vmax" : 2.5,
  "vv" : 1.1,
  "dv" : 249.0,
  "lat" : 40.45167,
  "dmax" : 263.0,
  "ubi" : "MADRID  C. UNIVERSITARIA",
  "hr" : 81.0,
  "tamin" : 5.4,
  "ta" : 5.4,
  "tamax" : 6.9,
  "tpr" : 2.5,
  "rviento" : 26.0
}, {
  "idema" : "3194U",
  "lon" : -3.724167,
  "fint" : "2019-04-09T01:00:00",
  "prec" : 0.0,
  "alt" : 664.0,
  "vmax" : 4.9,
  "vv" : 1.3,
  "dv" : 263.0,
  "lat" : 40.45167,
  "dmax" : 260.0,
  "ubi" : "MADRID  C. UNIVERSITARIA",
  "hr" : 82.0,
  "tamin" : 4.8,
  "ta" : 5.0,
  "tamax" : 5.4,
  "tpr" : 2.1,
  "rviento" : 28.0
}, {
  "idema" : "3194U",
  "lon" : -3.724167,
  "fint" : "2019-04-09T02:00:00",
  "prec" : 0.0,
  "alt" : 664.0,
  "vmax" : 3.1,
  "vv" : 1.0,
  "dv" : 244.0,
  "lat" : 40.45167,
  "dmax" : 290.0,
  "ubi" : "MADRID  C. UNIVERSITARIA",
  "hr" : 82.0,
  "tamin" : 4.6,
  "ta" : 5.1,
  "tamax" : 5.3,
  "tpr" : 2.3,
  "rviento" : 46.0
}, {
  "idema" : "3194U",
  "lon" : -3.724167,
  "fint" : "2019-04-09T03:00:00",
  "prec" : 0.0,
  "alt" : 664.0,
  "vmax" : 3.1,
  "vv" : 0.8,
  "dv" : 220.0,
  "lat" : 40.45167,
  "dmax" : 243.0,
  "ubi" : "MADRID  C. UNIVERSITARIA",
  "hr" : 83.0,
  "tamin" : 4.9,
  "ta" : 5.0,
  "tamax" : 5.3,
  "tpr" : 2.3,
  "rviento" : 29.0
}, {
  "idema" : "3194U",
  "lon" : -3.724167,
  "fint" : "2019-04-09T04:00:00",
  "prec" : 0.1,
  "alt" : 664.0,
  "vmax" : 3.8,
  "vv" : 1.7,
  "dv" : 250.0,
  "lat" : 40.45167,
  "dmax" : 260.0,
  "ubi" : "MADRID  C. UNIVERSITARIA",
  "hr" : 84.0,
  "tamin" : 4.7,
  "ta" : 4.7,
  "tamax" : 5.1,
  "tpr" : 2.3,
  "rviento" : 40.0
}, {
  "idema" : "3194U",
  "lon" : -3.724167,
  "fint" : "2019-04-09T05:00:00",
  "prec" : 0.0,
  "alt" : 664.0,
  "vmax" : 3.7,
  "vv" : 0.6,
  "dv" : 197.0,
  "lat" : 40.45167,
  "dmax" : 235.0,
  "ubi" : "MADRID  C. UNIVERSITARIA",
  "hr" : 85.0,
  "tamin" : 4.3,
  "ta" : 4.4,
  "tamax" : 4.7,
  "tpr" : 2.1,
  "rviento" : 33.0
}, {
  "idema" : "3194U",
  "lon" : -3.724167,
  "fint" : "2019-04-09T06:00:00",
  "prec" : 0.0,
  "alt" : 664.0,
  "vmax" : 4.8,
  "vv" : 1.0,
  "dv" : 257.0,
  "lat" : 40.45167,
  "dmax" : 285.0,
  "ubi" : "MADRID  C. UNIVERSITARIA",
  "hr" : 85.0,
  "tamin" : 4.0,
  "ta" : 4.4,
  "tamax" : 4.4,
  "tpr" : 2.1,
  "rviento" : 41.0
}, {
  "idema" : "3194U",
  "lon" : -3.724167,
  "fint" : "2019-04-09T07:00:00",
  "prec" : 0.0,
  "alt" : 664.0,
  "vmax" : 4.1,
  "vv" : 1.6,
  "dv" : 233.0,
  "lat" : 40.45167,
  "dmax" : 234.0,
  "ubi" : "MADRID  C. UNIVERSITARIA",
  "hr" : 84.0,
  "tamin" : 4.3,
  "ta" : 6.3,
  "tamax" : 6.3,
  "tpr" : 3.8,
  "rviento" : 53.0
}, {
  "idema" : "3194U",
  "lon" : -3.724167,
  "fint" : "2019-04-09T08:00:00",
  "prec" : 0.0,
  "alt" : 664.0,
  "vmax" : 6.0,
  "vv" : 2.6,
  "dv" : 247.0,
  "lat" : 40.45167,
  "dmax" : 275.0,
  "ubi" : "MADRID  C. UNIVERSITARIA",
  "hr" : 74.0,
  "tamin" : 6.3,
  "ta" : 8.1,
  "tamax" : 8.2,
  "tpr" : 3.8,
  "rviento" : 94.0
}, {
  "idema" : "3194U",
  "lon" : -3.724167,
  "fint" : "2019-04-09T09:00:00",
  "alt" : 664.0,
  "vmax" : 9.4,
  "vv" : 3.1,
  "dv" : 231.0,
  "lat" : 40.45167,
  "dmax" : 241.0,
  "ubi" : "MADRID  C. UNIVERSITARIA",
  "hr" : 68.0,
  "tamin" : 7.6,
  "ta" : 7.9,
  "tamax" : 8.7,
  "tpr" : 2.3,
  "rviento" : 126.0
}, {
  "idema" : "3194U",
  "lon" : -3.724167,
  "fint" : "2019-04-09T10:00:00",
  "prec" : 0.1,
  "alt" : 664.0,
  "vmax" : 9.0,
  "vv" : 2.8,
  "dv" : 244.0,
  "lat" : 40.45167,
  "dmax" : 266.0,
  "ubi" : "MADRID  C. UNIVERSITARIA",
  "hr" : 77.0,
  "tamin" : 7.5,
  "ta" : 7.7,
  "tamax" : 8.1,
  "tpr" : 3.9,
  "rviento" : 125.0
}, {
  "idema" : "3194U",
  "lon" : -3.724167,
  "fint" : "2019-04-09T11:00:00",
  "prec" : 0.0,
  "alt" : 664.0,
  "vmax" : 12.0,
  "vv" : 6.4,
  "dv" : 254.0,
  "lat" : 40.45167,
  "dmax" : 271.0,
  "ubi" : "MADRID  C. UNIVERSITARIA",
  "hr" : 55.0,
  "tamin" : 7.6,
  "ta" : 10.3,
  "tamax" : 10.9,
  "tpr" : 1.7,
  "rviento" : 177.0
} ]