<?xml version="1.0" encoding="utf-8"?>
<svg width="16.745636px" height="16.746124px" viewBox="0 0 16.745636 16.746124" version="1.1" xmlns:xlink="http://www.w3.org/1999/xlink" xmlns="http://www.w3.org/2000/svg">
  <g id="Search" transform="translate(0.625 0.625)">
    <path d="M14.2683 7.13413C14.2683 11.0746 11.0738 14.2683 7.13413 14.2683C3.19365 14.2683 0 11.0746 0 7.13413C0 3.19365 3.19365 0 7.13413 0C11.0738 0 14.2683 3.19365 14.2683 7.13413Z" id="Stroke-1" fill="none" fill-rule="evenodd" stroke="#BEC4D0" stroke-width="1.25" stroke-linecap="round" stroke-linejoin="round" />
    <path d="M15.4956 14.3199C15.4956 14.9699 14.9694 15.4961 14.3202 15.4961C13.671 15.4961 13.144 14.9699 13.144 14.3199C13.144 13.6715 13.671 13.1445 14.3202 13.1445C14.9694 13.1445 15.4956 13.6715 15.4956 14.3199Z" id="Stroke-3" fill="none" fill-rule="evenodd" stroke="#BEC4D0" stroke-width="1.25" stroke-linecap="round" stroke-linejoin="round" />
  </g>
</svg>