{
    "colors": {
        "main_background": "SystemButtonFace",
        "main_text": "black",
        "widget_background": "white",
        "widget_text": "black",
        "widget_outline": "SystemButtonFace",
        "active_background": "SystemButtonFace",
        "active_text": "black",
        "section_background": "lightgrey",
        "section_text": "black",
        "highlighted_background": "dodgerblue",
        "highlighted_text": "white",
        "duplicates_background": "lightcoral",
        "duplicates_text": "darkred",
        "input_background":  {
            "rename_folder": "aliceblue",
            "edit_conditions": "mistyrose"
        },
        "input_text":  {
            "rename_folder": "navy",
            "edit_conditions": "darkred"
        },
        "entry_text": {
            "rename_folder": "black",
            "edit_conditions": "black"
        },
        "button_background":  {
            "rename_folder": "lightsteelblue",
            "edit_conditions": "lightcoral"
        },
        "button_text":  {
            "rename_folder": "navy",
            "edit_conditions": "darkred"
        }
    }
}