EESchema Schematic File Version 4
EELAYER 30 0
EELAYER END
$Descr USLetter 11000 8500
encoding utf-8
Sheet 1 1
Title "Squareduino PB Edition"
Date ""
Rev "0.1"
Comp "NUAV"
Comment1 ""
Comment2 ""
Comment3 ""
Comment4 ""
$EndDescr
$Comp
L Mechanical:MountingHole H2
U 1 1 5E644588
P 750 7650
F 0 "H2" H 850 7696 50  0000 L CNN
F 1 "M3" H 850 7605 50  0000 L CNN
F 2 "MountingHole:MountingHole_3.2mm_M3" H 750 7650 50  0001 C CNN
F 3 "~" H 750 7650 50  0001 C CNN
	1    750  7650
	1    0    0    -1  
$EndComp
$Comp
L Mechanical:MountingHole H1
U 1 1 5E64538F
P 750 7450
F 0 "H1" H 850 7496 50  0000 L CNN
F 1 "M3" H 850 7405 50  0000 L CNN
F 2 "MountingHole:MountingHole_3.2mm_M3" H 750 7450 50  0001 C CNN
F 3 "~" H 750 7450 50  0001 C CNN
	1    750  7450
	1    0    0    -1  
$EndComp
$Comp
L Mechanical:MountingHole H3
U 1 1 5E6456F3
P 1050 7450
F 0 "H3" H 1150 7496 50  0000 L CNN
F 1 "M3" H 1150 7405 50  0000 L CNN
F 2 "MountingHole:MountingHole_3.2mm_M3" H 1050 7450 50  0001 C CNN
F 3 "~" H 1050 7450 50  0001 C CNN
	1    1050 7450
	1    0    0    -1  
$EndComp
$Comp
L Mechanical:MountingHole H4
U 1 1 5E645A34
P 1050 7650
F 0 "H4" H 1150 7696 50  0000 L CNN
F 1 "M3" H 1150 7605 50  0000 L CNN
F 2 "MountingHole:MountingHole_3.2mm_M3" H 1050 7650 50  0001 C CNN
F 3 "~" H 1050 7650 50  0001 C CNN
	1    1050 7650
	1    0    0    -1  
$EndComp
$Comp
L Connector_Generic:Conn_01x08 J1
U 1 1 5E6490A5
P 5550 4050
F 0 "J1" H 5630 4042 50  0000 L CNN
F 1 "GPIO1" H 5630 3951 50  0000 L CNN
F 2 "Connector_PinHeader_2.54mm:PinHeader_1x08_P2.54mm_Vertical" H 5550 4050 50  0001 C CNN
F 3 "~" H 5550 4050 50  0001 C CNN
	1    5550 4050
	1    0    0    -1  
$EndComp
Wire Wire Line
	4450 3750 5350 3750
Wire Wire Line
	4450 3850 5350 3850
Wire Wire Line
	4450 3950 5350 3950
Wire Wire Line
	4450 4050 5350 4050
Wire Wire Line
	4450 4150 5350 4150
Wire Wire Line
	4450 4250 5350 4250
Wire Wire Line
	4450 4350 5350 4350
Wire Wire Line
	4450 4450 5350 4450
Text Label 4550 3750 0    50   ~ 0
RXD
Text Label 4550 3850 0    50   ~ 0
TXD
Text Label 4550 3950 0    50   ~ 0
D2
Text Label 4550 4050 0    50   ~ 0
D3
Text Label 4550 4150 0    50   ~ 0
D4
Text Label 4550 4250 0    50   ~ 0
D5
Text Label 4550 4350 0    50   ~ 0
D6
Text Label 4550 4450 0    50   ~ 0
D7
Wire Wire Line
	5950 4450 6050 4450
Wire Wire Line
	6050 3750 5950 3750
Connection ~ 5950 3750
Wire Wire Line
	5950 3750 5950 3850
Wire Wire Line
	6050 3850 5950 3850
Connection ~ 5950 3850
Wire Wire Line
	5950 3850 5950 3950
Wire Wire Line
	6050 3950 5950 3950
Connection ~ 5950 3950
Wire Wire Line
	5950 3950 5950 4050
Wire Wire Line
	6050 4050 5950 4050
Connection ~ 5950 4050
Wire Wire Line
	5950 4050 5950 4150
Wire Wire Line
	6050 4150 5950 4150
Connection ~ 5950 4150
Wire Wire Line
	5950 4150 5950 4250
Wire Wire Line
	6050 4250 5950 4250
Connection ~ 5950 4250
Wire Wire Line
	5950 4250 5950 4350
Wire Wire Line
	6050 4350 5950 4350
Connection ~ 5950 4350
Wire Wire Line
	5950 4350 5950 4450
$Comp
L power:GND #PWR0102
U 1 1 5E652F51
P 6650 4500
F 0 "#PWR0102" H 6650 4250 50  0001 C CNN
F 1 "GND" H 6655 4327 50  0000 C CNN
F 2 "" H 6650 4500 50  0001 C CNN
F 3 "" H 6650 4500 50  0001 C CNN
	1    6650 4500
	1    0    0    -1  
$EndComp
Wire Wire Line
	6650 4500 6650 4450
Wire Wire Line
	6650 3750 6550 3750
Wire Wire Line
	6550 3850 6650 3850
Connection ~ 6650 3850
Wire Wire Line
	6650 3850 6650 3750
Connection ~ 6650 3950
Wire Wire Line
	6650 3950 6650 3850
Wire Wire Line
	6550 3950 6650 3950
Connection ~ 6650 4050
Wire Wire Line
	6650 4050 6650 3950
Wire Wire Line
	6550 4050 6650 4050
Wire Wire Line
	6550 4150 6650 4150
Connection ~ 6650 4150
Wire Wire Line
	6650 4150 6650 4050
Connection ~ 6650 4250
Wire Wire Line
	6650 4250 6650 4150
Wire Wire Line
	6550 4250 6650 4250
Wire Wire Line
	6550 4350 6650 4350
Connection ~ 6650 4350
Wire Wire Line
	6650 4350 6650 4250
Wire Wire Line
	6550 4450 6650 4450
Connection ~ 6650 4450
Wire Wire Line
	6650 4450 6650 4350
Wire Wire Line
	4450 2950 5350 2950
Wire Wire Line
	4450 3050 5350 3050
Wire Wire Line
	4450 3150 5350 3150
Wire Wire Line
	4450 3250 5350 3250
Wire Wire Line
	4450 3350 5350 3350
Wire Wire Line
	4450 3450 5350 3450
Text Label 4550 3550 0    50   ~ 0
~RESET
$Comp
L power:+5V #PWR0101
U 1 1 5E6513DB
P 5950 1700
F 0 "#PWR0101" H 5950 1550 50  0001 C CNN
F 1 "+5V" H 5965 1873 50  0000 C CNN
F 2 "" H 5950 1700 50  0001 C CNN
F 3 "" H 5950 1700 50  0001 C CNN
	1    5950 1700
	1    0    0    -1  
$EndComp
$Comp
L Connector_Generic:Conn_02x08_Odd_Even J2
U 1 1 5E64E376
P 6350 4050
F 0 "J2" H 6500 4450 50  0000 C CNN
F 1 "Power1" H 6250 4450 50  0000 C CNN
F 2 "Connector_PinHeader_2.54mm:PinHeader_2x08_P2.54mm_Vertical" H 6350 4050 50  0001 C CNN
F 3 "~" H 6350 4050 50  0001 C CNN
	1    6350 4050
	-1   0    0    -1  
$EndComp
Wire Wire Line
	6050 3450 5950 3450
Connection ~ 5950 3450
Wire Wire Line
	6050 3350 5950 3350
Connection ~ 5950 3350
Wire Wire Line
	5950 3350 5950 3450
Wire Wire Line
	6050 3250 5950 3250
Connection ~ 5950 3250
Wire Wire Line
	5950 3250 5950 3350
Wire Wire Line
	6050 3150 5950 3150
Connection ~ 5950 3150
Wire Wire Line
	5950 3150 5950 3250
Wire Wire Line
	6050 3050 5950 3050
Connection ~ 5950 3050
Wire Wire Line
	5950 3050 5950 3150
Wire Wire Line
	6050 2950 5950 2950
Connection ~ 5950 2950
Wire Wire Line
	5950 2950 5950 3050
Wire Wire Line
	6650 2950 6550 2950
Connection ~ 6650 3750
Wire Wire Line
	6550 3050 6650 3050
Connection ~ 6650 3050
Wire Wire Line
	6650 3050 6650 2950
Wire Wire Line
	6550 3150 6650 3150
Connection ~ 6650 3150
Wire Wire Line
	6650 3150 6650 3050
Wire Wire Line
	6550 3250 6650 3250
Connection ~ 6650 3250
Wire Wire Line
	6650 3250 6650 3150
Wire Wire Line
	6550 3350 6650 3350
Connection ~ 6650 3350
Wire Wire Line
	6650 3350 6650 3250
Wire Wire Line
	6550 3450 6650 3450
Connection ~ 6650 3450
Wire Wire Line
	6650 3450 6650 3350
Text Label 4550 2950 0    50   ~ 0
A0
Text Label 4550 3050 0    50   ~ 0
A1
Text Label 4550 3150 0    50   ~ 0
A2
Text Label 4550 3250 0    50   ~ 0
A3
Text Label 4550 3350 0    50   ~ 0
SDA
Text Label 4550 3450 0    50   ~ 0
SCL
$Comp
L Device:Resonator Y1
U 1 1 5E676ECB
P 7350 3200
F 0 "Y1" H 7350 3448 50  0000 C CNN
F 1 "16MHz" H 7350 3357 50  0000 C CNN
F 2 "Crystal:Resonator_SMD_muRata_CSTxExxV-3Pin_3.0x1.1mm" H 7325 3200 50  0001 C CNN
F 3 "~" H 7325 3200 50  0001 C CNN
	1    7350 3200
	1    0    0    -1  
$EndComp
Wire Wire Line
	4450 2750 7050 2750
Wire Wire Line
	7050 2750 7050 3200
Wire Wire Line
	7050 3200 7200 3200
Wire Wire Line
	4450 2650 7600 2650
Wire Wire Line
	7600 2650 7600 3200
Wire Wire Line
	7600 3200 7500 3200
$Comp
L power:GND #PWR0103
U 1 1 5E67DAE5
P 7350 3500
F 0 "#PWR0103" H 7350 3250 50  0001 C CNN
F 1 "GND" H 7355 3327 50  0000 C CNN
F 2 "" H 7350 3500 50  0001 C CNN
F 3 "" H 7350 3500 50  0001 C CNN
	1    7350 3500
	1    0    0    -1  
$EndComp
Wire Wire Line
	7350 3500 7350 3400
$Comp
L Connector_Generic:Conn_01x04 J7
U 1 1 5E688A3A
P 8750 3100
F 0 "J7" H 8830 3092 50  0000 L CNN
F 1 "I2C" H 8830 3001 50  0000 L CNN
F 2 "Connector_PinHeader_2.54mm:PinHeader_1x04_P2.54mm_Vertical" H 8750 3100 50  0001 C CNN
F 3 "~" H 8750 3100 50  0001 C CNN
	1    8750 3100
	1    0    0    -1  
$EndComp
$Comp
L power:+5V #PWR0104
U 1 1 5E689E4D
P 8450 2900
F 0 "#PWR0104" H 8450 2750 50  0001 C CNN
F 1 "+5V" H 8465 3073 50  0000 C CNN
F 2 "" H 8450 2900 50  0001 C CNN
F 3 "" H 8450 2900 50  0001 C CNN
	1    8450 2900
	1    0    0    -1  
$EndComp
Wire Wire Line
	8550 3000 8450 3000
Wire Wire Line
	8450 3000 8450 2900
Wire Wire Line
	8550 3100 8150 3100
Wire Wire Line
	8550 3200 8150 3200
$Comp
L power:GND #PWR0105
U 1 1 5E68FFBB
P 8450 3400
F 0 "#PWR0105" H 8450 3150 50  0001 C CNN
F 1 "GND" H 8455 3227 50  0000 C CNN
F 2 "" H 8450 3400 50  0001 C CNN
F 3 "" H 8450 3400 50  0001 C CNN
	1    8450 3400
	1    0    0    -1  
$EndComp
Wire Wire Line
	8450 3400 8450 3300
Wire Wire Line
	8450 3300 8550 3300
Text Label 8150 3100 0    50   ~ 0
SDA
Text Label 8150 3200 0    50   ~ 0
SCL
$Comp
L Connector_Generic:Conn_01x06 J3
U 1 1 5E696A86
P 5550 2250
F 0 "J3" H 5630 2242 50  0000 L CNN
F 1 "GPIO2" H 5630 2151 50  0000 L CNN
F 2 "Connector_PinHeader_2.54mm:PinHeader_1x06_P2.54mm_Vertical" H 5550 2250 50  0001 C CNN
F 3 "~" H 5550 2250 50  0001 C CNN
	1    5550 2250
	1    0    0    -1  
$EndComp
Wire Wire Line
	5350 2050 4450 2050
Wire Wire Line
	4450 2150 5350 2150
Wire Wire Line
	4450 2250 5350 2250
Wire Wire Line
	4450 2350 5350 2350
Wire Wire Line
	4450 2450 5350 2450
Wire Wire Line
	5350 2550 4450 2550
Text Label 4550 2050 0    50   ~ 0
D8
Text Label 4550 2150 0    50   ~ 0
D9
Text Label 4550 2250 0    50   ~ 0
D10
Text Label 4550 2350 0    50   ~ 0
MOSI
Text Label 4550 2450 0    50   ~ 0
MISO
Text Label 4550 2550 0    50   ~ 0
SCK
$Comp
L Connector_Generic:Conn_02x04_Odd_Even J8
U 1 1 5E6D10D3
P 8800 2300
F 0 "J8" H 8850 2617 50  0000 C CNN
F 1 "ICSP" H 8850 2526 50  0000 C CNN
F 2 "Connector_PinHeader_2.54mm:PinHeader_2x04_P2.54mm_Vertical" H 8800 2300 50  0001 C CNN
F 3 "~" H 8800 2300 50  0001 C CNN
	1    8800 2300
	1    0    0    -1  
$EndComp
Wire Wire Line
	8600 2400 8250 2400
Wire Wire Line
	8600 2300 8250 2300
Wire Wire Line
	8600 2200 8250 2200
Text Label 8250 2200 0    50   ~ 0
MISO
Text Label 8250 2300 0    50   ~ 0
SCK
Text Label 8250 2400 0    50   ~ 0
~RESET
Wire Wire Line
	9450 2300 9100 2300
Text Label 9250 2300 0    50   ~ 0
MOSI
$Comp
L power:+5V #PWR0106
U 1 1 5E6E2EE8
P 9250 2050
F 0 "#PWR0106" H 9250 1900 50  0001 C CNN
F 1 "+5V" H 9265 2223 50  0000 C CNN
F 2 "" H 9250 2050 50  0001 C CNN
F 3 "" H 9250 2050 50  0001 C CNN
	1    9250 2050
	1    0    0    -1  
$EndComp
Wire Wire Line
	9100 2200 9250 2200
Wire Wire Line
	9250 2200 9250 2050
$Comp
L power:GND #PWR0107
U 1 1 5E6E8095
P 9250 2500
F 0 "#PWR0107" H 9250 2250 50  0001 C CNN
F 1 "GND" H 9255 2327 50  0000 C CNN
F 2 "" H 9250 2500 50  0001 C CNN
F 3 "" H 9250 2500 50  0001 C CNN
	1    9250 2500
	1    0    0    -1  
$EndComp
Wire Wire Line
	9250 2500 9250 2400
Wire Wire Line
	9250 2400 9100 2400
$Comp
L Switch:SW_Push SW1
U 1 1 5E6ECE00
P 9800 4550
F 0 "SW1" V 9754 4698 50  0000 L CNN
F 1 "Reset" V 9845 4698 50  0000 L CNN
F 2 "Button_Switch_SMD:SW_SPST_CK_RS282G05A3" H 9800 4750 50  0001 C CNN
F 3 "~" H 9800 4750 50  0001 C CNN
	1    9800 4550
	0    1    1    0   
$EndComp
$Comp
L Device:R R3
U 1 1 5E6EE102
P 9800 4050
F 0 "R3" H 9870 4096 50  0000 L CNN
F 1 "10k" H 9870 4005 50  0000 L CNN
F 2 "Resistor_SMD:R_0402_1005Metric" V 9730 4050 50  0001 C CNN
F 3 "~" H 9800 4050 50  0001 C CNN
	1    9800 4050
	1    0    0    -1  
$EndComp
Wire Wire Line
	9800 4350 9800 4300
$Comp
L power:GND #PWR0108
U 1 1 5E6F2B0A
P 9800 4900
F 0 "#PWR0108" H 9800 4650 50  0001 C CNN
F 1 "GND" H 9805 4727 50  0000 C CNN
F 2 "" H 9800 4900 50  0001 C CNN
F 3 "" H 9800 4900 50  0001 C CNN
	1    9800 4900
	1    0    0    -1  
$EndComp
Wire Wire Line
	9800 4900 9800 4750
$Comp
L power:+5V #PWR0109
U 1 1 5E6FFF32
P 9800 3800
F 0 "#PWR0109" H 9800 3650 50  0001 C CNN
F 1 "+5V" H 9815 3973 50  0000 C CNN
F 2 "" H 9800 3800 50  0001 C CNN
F 3 "" H 9800 3800 50  0001 C CNN
	1    9800 3800
	1    0    0    -1  
$EndComp
Wire Wire Line
	9800 3900 9800 3800
Wire Wire Line
	9800 4300 9350 4300
Connection ~ 9800 4300
Wire Wire Line
	9800 4300 9800 4200
Text Label 9350 4300 0    50   ~ 0
~RESET
$Comp
L Device:R R2
U 1 1 5E717528
P 8300 4050
F 0 "R2" H 8370 4096 50  0000 L CNN
F 1 "1k" H 8370 4005 50  0000 L CNN
F 2 "Resistor_SMD:R_0402_1005Metric" V 8230 4050 50  0001 C CNN
F 3 "~" H 8300 4050 50  0001 C CNN
	1    8300 4050
	1    0    0    -1  
$EndComp
$Comp
L Device:R R1
U 1 1 5E718BC7
P 7800 4050
F 0 "R1" H 7870 4096 50  0000 L CNN
F 1 "1k" H 7870 4005 50  0000 L CNN
F 2 "Resistor_SMD:R_0402_1005Metric" V 7730 4050 50  0001 C CNN
F 3 "~" H 7800 4050 50  0001 C CNN
	1    7800 4050
	1    0    0    -1  
$EndComp
Wire Wire Line
	7800 3900 7800 3800
$Comp
L power:+5V #PWR0110
U 1 1 5E721923
P 7800 3800
F 0 "#PWR0110" H 7800 3650 50  0001 C CNN
F 1 "+5V" H 7815 3973 50  0000 C CNN
F 2 "" H 7800 3800 50  0001 C CNN
F 3 "" H 7800 3800 50  0001 C CNN
	1    7800 3800
	1    0    0    -1  
$EndComp
Wire Wire Line
	8300 3900 8300 3800
Wire Wire Line
	8300 3800 8550 3800
Text Label 8400 3800 0    50   ~ 0
SCK
$Comp
L Device:LED D1
U 1 1 5E742BFE
P 7800 4450
F 0 "D1" V 7839 4332 50  0000 R CNN
F 1 "Power" V 7748 4332 50  0000 R CNN
F 2 "LED_SMD:LED_0402_1005Metric" H 7800 4450 50  0001 C CNN
F 3 "~" H 7800 4450 50  0001 C CNN
	1    7800 4450
	0    -1   -1   0   
$EndComp
$Comp
L Device:LED D2
U 1 1 5E7436B3
P 8300 4450
F 0 "D2" V 8339 4332 50  0000 R CNN
F 1 "D13" V 8248 4332 50  0000 R CNN
F 2 "LED_SMD:LED_0402_1005Metric" H 8300 4450 50  0001 C CNN
F 3 "~" H 8300 4450 50  0001 C CNN
	1    8300 4450
	0    -1   -1   0   
$EndComp
Wire Wire Line
	7800 4300 7800 4200
Wire Wire Line
	8300 4300 8300 4200
Wire Wire Line
	7800 4600 7800 4750
Wire Wire Line
	7800 4750 8050 4750
Wire Wire Line
	8300 4750 8300 4600
$Comp
L power:GND #PWR0111
U 1 1 5E752209
P 8050 4850
F 0 "#PWR0111" H 8050 4600 50  0001 C CNN
F 1 "GND" H 8055 4677 50  0000 C CNN
F 2 "" H 8050 4850 50  0001 C CNN
F 3 "" H 8050 4850 50  0001 C CNN
	1    8050 4850
	1    0    0    -1  
$EndComp
Wire Wire Line
	8050 4850 8050 4750
Connection ~ 8050 4750
Wire Wire Line
	8050 4750 8300 4750
$Comp
L power:+5V #PWR0112
U 1 1 5E76F9A3
P 3900 1550
F 0 "#PWR0112" H 3900 1400 50  0001 C CNN
F 1 "+5V" H 3915 1723 50  0000 C CNN
F 2 "" H 3900 1550 50  0001 C CNN
F 3 "" H 3900 1550 50  0001 C CNN
	1    3900 1550
	1    0    0    -1  
$EndComp
Wire Wire Line
	3850 1750 3850 1650
Wire Wire Line
	3850 1650 3900 1650
Wire Wire Line
	3950 1650 3950 1750
Wire Wire Line
	3900 1650 3900 1550
Connection ~ 3900 1650
Wire Wire Line
	3900 1650 3950 1650
NoConn ~ 3250 2050
$Comp
L power:GND #PWR0113
U 1 1 5E78072A
P 3850 4850
F 0 "#PWR0113" H 3850 4600 50  0001 C CNN
F 1 "GND" H 3855 4677 50  0000 C CNN
F 2 "" H 3850 4850 50  0001 C CNN
F 3 "" H 3850 4850 50  0001 C CNN
	1    3850 4850
	1    0    0    -1  
$EndComp
Wire Wire Line
	3850 4850 3850 4750
$Comp
L Device:C C3
U 1 1 5E78D75F
P 7200 5800
F 0 "C3" H 7315 5846 50  0000 L CNN
F 1 "0.1u" H 7315 5755 50  0000 L CNN
F 2 "Capacitor_SMD:C_0402_1005Metric" H 7238 5650 50  0001 C CNN
F 3 "~" H 7200 5800 50  0001 C CNN
	1    7200 5800
	1    0    0    -1  
$EndComp
$Comp
L power:+5V #PWR0114
U 1 1 5E78E39C
P 6800 5450
F 0 "#PWR0114" H 6800 5300 50  0001 C CNN
F 1 "+5V" H 6815 5623 50  0000 C CNN
F 2 "" H 6800 5450 50  0001 C CNN
F 3 "" H 6800 5450 50  0001 C CNN
	1    6800 5450
	1    0    0    -1  
$EndComp
$Comp
L Device:C C1
U 1 1 5E78FA5A
P 6350 5800
F 0 "C1" H 6465 5846 50  0000 L CNN
F 1 "0.1u" H 6465 5755 50  0000 L CNN
F 2 "Capacitor_SMD:C_0402_1005Metric" H 6388 5650 50  0001 C CNN
F 3 "~" H 6350 5800 50  0001 C CNN
	1    6350 5800
	1    0    0    -1  
$EndComp
Wire Wire Line
	6350 5650 6350 5550
Wire Wire Line
	6350 5550 6800 5550
Wire Wire Line
	7200 5550 7200 5650
Connection ~ 6800 5550
Wire Wire Line
	6800 5550 7200 5550
Wire Wire Line
	6350 5950 6350 6050
Wire Wire Line
	6350 6050 6800 6050
Wire Wire Line
	7200 6050 7200 5950
Connection ~ 6800 6050
Wire Wire Line
	6800 6050 7200 6050
Wire Wire Line
	6800 6050 6800 6150
$Comp
L power:GND #PWR0115
U 1 1 5E7D1AEE
P 6800 6150
F 0 "#PWR0115" H 6800 5900 50  0001 C CNN
F 1 "GND" H 6805 5977 50  0000 C CNN
F 2 "" H 6800 6150 50  0001 C CNN
F 3 "" H 6800 6150 50  0001 C CNN
	1    6800 6150
	1    0    0    -1  
$EndComp
Wire Wire Line
	4450 3550 4700 3550
$Comp
L MCU_Microchip_ATmega:ATmega328PB-MU U1
U 1 1 5EDCDAA2
P 3850 3250
F 0 "U1" H 3400 4750 50  0000 C CNN
F 1 "ATmega328PB-MU" H 4300 1750 50  0000 C CNN
F 2 "Package_DFN_QFN:QFN-32-1EP_5x5mm_P0.5mm_EP3.1x3.1mm" H 3850 3250 50  0001 C CIN
F 3 "http://ww1.microchip.com/downloads/en/DeviceDoc/40001906C.pdf" H 3850 3250 50  0001 C CNN
	1    3850 3250
	1    0    0    -1  
$EndComp
Wire Wire Line
	5950 1700 5950 2000
Wire Wire Line
	3250 3750 2850 3750
Wire Wire Line
	3250 3850 2850 3850
Wire Wire Line
	3250 3950 2850 3950
Wire Wire Line
	3250 4050 2850 4050
Text Label 2850 3750 0    50   ~ 0
D23
Text Label 2850 3850 0    50   ~ 0
D24
Text Label 2850 3950 0    50   ~ 0
A6
Text Label 2850 4050 0    50   ~ 0
A7
$Comp
L Connector_Generic:Conn_01x06 J5
U 1 1 5EE2296D
P 5550 3150
F 0 "J5" H 5630 3142 50  0000 L CNN
F 1 "Analog" H 5630 3051 50  0000 L CNN
F 2 "Connector_PinHeader_2.54mm:PinHeader_1x06_P2.54mm_Vertical" H 5550 3150 50  0001 C CNN
F 3 "~" H 5550 3150 50  0001 C CNN
	1    5550 3150
	1    0    0    -1  
$EndComp
$Comp
L Connector_Generic:Conn_02x06_Odd_Even J6
U 1 1 5EE24789
P 6250 3150
F 0 "J6" H 6200 3450 50  0000 C CNN
F 1 "Power2" H 6450 3450 50  0000 C CNN
F 2 "Connector_PinHeader_2.54mm:PinHeader_2x06_P2.54mm_Vertical" H 6250 3150 50  0001 C CNN
F 3 "~" H 6250 3150 50  0001 C CNN
	1    6250 3150
	1    0    0    -1  
$EndComp
Wire Wire Line
	5950 3450 5950 3750
Wire Wire Line
	6650 3450 6650 3750
$Comp
L Connector_Generic:Conn_01x04 J10
U 1 1 5EE3D9E3
P 9800 3100
F 0 "J10" H 9880 3092 50  0000 L CNN
F 1 "I2C" H 9880 3001 50  0000 L CNN
F 2 "Connector_PinHeader_2.54mm:PinHeader_1x04_P2.54mm_Vertical" H 9800 3100 50  0001 C CNN
F 3 "~" H 9800 3100 50  0001 C CNN
	1    9800 3100
	1    0    0    -1  
$EndComp
$Comp
L power:+5V #PWR0116
U 1 1 5EE3D9E9
P 9500 2900
F 0 "#PWR0116" H 9500 2750 50  0001 C CNN
F 1 "+5V" H 9515 3073 50  0000 C CNN
F 2 "" H 9500 2900 50  0001 C CNN
F 3 "" H 9500 2900 50  0001 C CNN
	1    9500 2900
	1    0    0    -1  
$EndComp
Wire Wire Line
	9600 3000 9500 3000
Wire Wire Line
	9500 3000 9500 2900
Wire Wire Line
	9600 3100 9200 3100
Wire Wire Line
	9600 3200 9200 3200
$Comp
L power:GND #PWR0117
U 1 1 5EE3D9F3
P 9500 3400
F 0 "#PWR0117" H 9500 3150 50  0001 C CNN
F 1 "GND" H 9505 3227 50  0000 C CNN
F 2 "" H 9500 3400 50  0001 C CNN
F 3 "" H 9500 3400 50  0001 C CNN
	1    9500 3400
	1    0    0    -1  
$EndComp
Wire Wire Line
	9500 3400 9500 3300
Wire Wire Line
	9500 3300 9600 3300
Text Label 9200 3100 0    50   ~ 0
D23
Text Label 9200 3200 0    50   ~ 0
D24
$Comp
L Interface_USB:CH340G U2
U 1 1 5EE5C092
P 3200 6650
F 0 "U2" H 2950 7200 50  0000 C CNN
F 1 "CH340G" H 3400 6100 50  0000 C CNN
F 2 "Package_SO:SOIC-16_3.9x9.9mm_P1.27mm" H 3250 6100 50  0001 L CNN
F 3 "http://www.datasheet5.com/pdf-local-2195953" H 2850 7450 50  0001 C CNN
	1    3200 6650
	1    0    0    -1  
$EndComp
Wire Wire Line
	9100 2500 9150 2500
Wire Wire Line
	9150 2500 9150 2650
Wire Wire Line
	9150 2650 8250 2650
Wire Wire Line
	8600 2500 8250 2500
Text Label 8250 2500 0    50   ~ 0
A6
Text Label 8250 2650 0    50   ~ 0
A7
$Comp
L power:GND #PWR0118
U 1 1 5F1542E7
P 3200 7500
F 0 "#PWR0118" H 3200 7250 50  0001 C CNN
F 1 "GND" H 3205 7327 50  0000 C CNN
F 2 "" H 3200 7500 50  0001 C CNN
F 3 "" H 3200 7500 50  0001 C CNN
	1    3200 7500
	1    0    0    -1  
$EndComp
Wire Wire Line
	3200 7500 3200 7450
$Comp
L Device:Resonator Y2
U 1 1 5F15BB29
P 2450 7200
F 0 "Y2" H 2450 7450 50  0000 C CNN
F 1 "12MHZ" H 2450 7350 50  0000 C CNN
F 2 "Crystal:Resonator_SMD_muRata_CSTxExxV-3Pin_3.0x1.1mm" H 2425 7200 50  0001 C CNN
F 3 "~" H 2425 7200 50  0001 C CNN
	1    2450 7200
	1    0    0    -1  
$EndComp
Wire Wire Line
	2450 7400 2450 7450
Wire Wire Line
	2450 7450 3200 7450
Connection ~ 3200 7450
Wire Wire Line
	3200 7450 3200 7250
Wire Wire Line
	2800 7050 2650 7050
Wire Wire Line
	2650 7050 2650 7200
Wire Wire Line
	2650 7200 2600 7200
Wire Wire Line
	2300 7200 2250 7200
Wire Wire Line
	2250 7200 2250 6850
Wire Wire Line
	2250 6850 2800 6850
NoConn ~ 2800 6350
NoConn ~ 3600 6550
NoConn ~ 3600 6650
NoConn ~ 3600 6750
NoConn ~ 3600 6850
NoConn ~ 3600 7050
$Comp
L Connector:Conn_01x04_Male J9
U 1 1 5F1B057A
P 1450 6550
F 0 "J9" H 1550 6750 50  0000 C CNN
F 1 "USB" H 1550 6250 50  0000 C CNN
F 2 "Connector_PinHeader_2.54mm:PinHeader_1x04_P2.54mm_Vertical" H 1450 6550 50  0001 C CNN
F 3 "~" H 1450 6550 50  0001 C CNN
	1    1450 6550
	1    0    0    -1  
$EndComp
Wire Wire Line
	2800 6650 2350 6650
Wire Wire Line
	2350 6650 2350 6550
Wire Wire Line
	2350 6550 1650 6550
Wire Wire Line
	1650 6650 2150 6650
Wire Wire Line
	2150 6650 2150 6600
Wire Wire Line
	2150 6600 2650 6600
Wire Wire Line
	2650 6600 2650 6550
Wire Wire Line
	2650 6550 2800 6550
Text Label 1800 6550 0    50   ~ 0
D-
Text Label 1800 6650 0    50   ~ 0
D+
Wire Wire Line
	2450 7450 1850 7450
Wire Wire Line
	1850 7450 1850 6750
Wire Wire Line
	1850 6750 1650 6750
Connection ~ 2450 7450
$Comp
L Device:Polyfuse F1
U 1 1 5F1DDFF6
P 2350 5700
F 0 "F1" V 2125 5700 50  0000 C CNN
F 1 "500mA" V 2216 5700 50  0000 C CNN
F 2 "Fuse:Fuse_0805_2012Metric_Pad1.15x1.40mm_HandSolder" H 2400 5500 50  0001 L CNN
F 3 "~" H 2350 5700 50  0001 C CNN
	1    2350 5700
	0    1    1    0   
$EndComp
Wire Wire Line
	1650 6450 1850 6450
Wire Wire Line
	1850 6450 1850 5700
Wire Wire Line
	1850 5700 2050 5700
Wire Wire Line
	2500 5700 2650 5700
Wire Wire Line
	3200 5700 3200 6050
$Comp
L Device:C C2
U 1 1 5F22249E
P 2750 6000
F 0 "C2" V 2900 6000 50  0000 C CNN
F 1 "0.1u" V 2600 6000 50  0000 C CNN
F 2 "Capacitor_SMD:C_0402_1005Metric" H 2788 5850 50  0001 C CNN
F 3 "~" H 2750 6000 50  0001 C CNN
	1    2750 6000
	0    -1   -1   0   
$EndComp
Wire Wire Line
	2900 6000 3100 6000
Wire Wire Line
	3100 6000 3100 6050
$Comp
L power:GND #PWR0119
U 1 1 5F22BFBD
P 2500 6100
F 0 "#PWR0119" H 2500 5850 50  0001 C CNN
F 1 "GND" H 2505 5927 50  0000 C CNN
F 2 "" H 2500 6100 50  0001 C CNN
F 3 "" H 2500 6100 50  0001 C CNN
	1    2500 6100
	1    0    0    -1  
$EndComp
Wire Wire Line
	2500 6100 2500 6000
Wire Wire Line
	2500 6000 2600 6000
$Comp
L Device:C C4
U 1 1 5F236E30
P 3950 6950
F 0 "C4" V 3698 6950 50  0000 C CNN
F 1 "0.1u" V 3789 6950 50  0000 C CNN
F 2 "Capacitor_SMD:C_0402_1005Metric" H 3988 6800 50  0001 C CNN
F 3 "~" H 3950 6950 50  0001 C CNN
	1    3950 6950
	0    1    1    0   
$EndComp
Wire Wire Line
	3800 6950 3600 6950
Wire Wire Line
	4100 6950 4550 6950
Text Label 4300 6950 0    50   ~ 0
~RESET
Wire Wire Line
	3600 6250 4500 6250
Wire Wire Line
	3600 6350 4500 6350
Text Label 4350 6250 0    50   ~ 0
RXD
Text Label 4350 6350 0    50   ~ 0
TXD
$Comp
L Connector_Generic:Conn_02x06_Odd_Even J4
U 1 1 5F27F339
P 6250 2200
F 0 "J4" H 6200 2500 50  0000 C CNN
F 1 "Power3" H 6450 2500 50  0000 C CNN
F 2 "Connector_PinHeader_2.54mm:PinHeader_2x06_P2.54mm_Vertical" H 6250 2200 50  0001 C CNN
F 3 "~" H 6250 2200 50  0001 C CNN
	1    6250 2200
	1    0    0    -1  
$EndComp
Wire Wire Line
	6050 2000 5950 2000
Connection ~ 5950 2000
Wire Wire Line
	5950 2000 5950 2100
Wire Wire Line
	6050 2100 5950 2100
Connection ~ 5950 2100
Wire Wire Line
	5950 2100 5950 2200
Wire Wire Line
	6050 2200 5950 2200
Connection ~ 5950 2200
Wire Wire Line
	5950 2200 5950 2300
Wire Wire Line
	6050 2300 5950 2300
Connection ~ 5950 2300
Wire Wire Line
	5950 2300 5950 2400
Wire Wire Line
	6050 2400 5950 2400
Connection ~ 5950 2400
Wire Wire Line
	5950 2400 5950 2500
Wire Wire Line
	6050 2500 5950 2500
Connection ~ 5950 2500
Wire Wire Line
	5950 2500 5950 2950
Wire Wire Line
	6550 2000 6650 2000
Wire Wire Line
	6650 2000 6650 2100
Connection ~ 6650 2950
Wire Wire Line
	6550 2100 6650 2100
Connection ~ 6650 2100
Wire Wire Line
	6650 2100 6650 2200
Wire Wire Line
	6550 2200 6650 2200
Connection ~ 6650 2200
Wire Wire Line
	6650 2200 6650 2300
Wire Wire Line
	6550 2300 6650 2300
Connection ~ 6650 2300
Wire Wire Line
	6650 2300 6650 2400
Wire Wire Line
	6550 2400 6650 2400
Connection ~ 6650 2400
Wire Wire Line
	6650 2400 6650 2500
Wire Wire Line
	6550 2500 6650 2500
Connection ~ 6650 2500
Wire Wire Line
	6650 2500 6650 2950
$Comp
L Device:C C5
U 1 1 5F32B783
P 6800 5800
F 0 "C5" H 6915 5846 50  0000 L CNN
F 1 "0.1u" H 6915 5755 50  0000 L CNN
F 2 "Capacitor_SMD:C_0402_1005Metric" H 6838 5650 50  0001 C CNN
F 3 "~" H 6800 5800 50  0001 C CNN
	1    6800 5800
	1    0    0    -1  
$EndComp
Wire Wire Line
	6800 6050 6800 5950
Wire Wire Line
	6800 5450 6800 5550
Wire Wire Line
	6800 5650 6800 5550
$Comp
L Device:Jumper_NO_Small JP1
U 1 1 5F3517CE
P 2350 5400
F 0 "JP1" H 2350 5585 50  0000 C CNN
F 1 "Fuse Bypass" H 2350 5494 50  0000 C CNN
F 2 "Jumper:SolderJumper-2_P1.3mm_Open_RoundedPad1.0x1.5mm" H 2350 5400 50  0001 C CNN
F 3 "~" H 2350 5400 50  0001 C CNN
	1    2350 5400
	1    0    0    -1  
$EndComp
Wire Wire Line
	2450 5400 2650 5400
Wire Wire Line
	2650 5400 2650 5700
Connection ~ 2650 5700
Wire Wire Line
	2650 5700 3200 5700
Wire Wire Line
	2250 5400 2050 5400
Wire Wire Line
	2050 5400 2050 5700
Connection ~ 2050 5700
Wire Wire Line
	2050 5700 2200 5700
$Comp
L power:+5V #PWR?
U 1 1 5F3878D9
P 3200 5600
F 0 "#PWR?" H 3200 5450 50  0001 C CNN
F 1 "+5V" H 3215 5773 50  0000 C CNN
F 2 "" H 3200 5600 50  0001 C CNN
F 3 "" H 3200 5600 50  0001 C CNN
	1    3200 5600
	1    0    0    -1  
$EndComp
Wire Wire Line
	3200 5700 3200 5600
Connection ~ 3200 5700
$EndSCHEMATC
