G04 #@! TF.GenerationSoftware,KiCad,Pcbnew,(5.1.5)-3*
G04 #@! TF.CreationDate,2020-02-15T22:10:51-05:00*
G04 #@! TF.ProjectId,RocketLocatorBoard,526f636b-6574-44c6-9f63-61746f72426f,1.0*
G04 #@! TF.SameCoordinates,Original*
G04 #@! TF.FileFunction,Soldermask,Bot*
G04 #@! TF.FilePolarity,Negative*
%FSLAX46Y46*%
G04 Gerber Fmt 4.6, Leading zero omitted, Abs format (unit mm)*
G04 Created by KiCad (PCBNEW (5.1.5)-3) date 2020-02-15 22:10:51*
%MOMM*%
%LPD*%
G04 APERTURE LIST*
%ADD10C,0.100000*%
G04 APERTURE END LIST*
D10*
G36*
X150314095Y-117420935D02*
G01*
X150469620Y-117451871D01*
X150762621Y-117573237D01*
X151026315Y-117749431D01*
X151250569Y-117973685D01*
X151426763Y-118237379D01*
X151548129Y-118530380D01*
X151610000Y-118841429D01*
X151610000Y-119158571D01*
X151548129Y-119469620D01*
X151426763Y-119762621D01*
X151250569Y-120026315D01*
X151026315Y-120250569D01*
X150762621Y-120426763D01*
X150469620Y-120548129D01*
X150314096Y-120579064D01*
X150158572Y-120610000D01*
X149841428Y-120610000D01*
X149685904Y-120579064D01*
X149530380Y-120548129D01*
X149237379Y-120426763D01*
X148973685Y-120250569D01*
X148749431Y-120026315D01*
X148573237Y-119762621D01*
X148451871Y-119469620D01*
X148390000Y-119158571D01*
X148390000Y-118841429D01*
X148451871Y-118530380D01*
X148573237Y-118237379D01*
X148749431Y-117973685D01*
X148973685Y-117749431D01*
X149237379Y-117573237D01*
X149530380Y-117451871D01*
X149685905Y-117420935D01*
X149841428Y-117390000D01*
X150158572Y-117390000D01*
X150314095Y-117420935D01*
G37*
G36*
X178167778Y-109236524D02*
G01*
X178250853Y-109253049D01*
X178407363Y-109317878D01*
X178548218Y-109411995D01*
X178668005Y-109531782D01*
X178762122Y-109672637D01*
X178826951Y-109829147D01*
X178860000Y-109995297D01*
X178860000Y-110164703D01*
X178826951Y-110330853D01*
X178762122Y-110487363D01*
X178668005Y-110628218D01*
X178548218Y-110748005D01*
X178407363Y-110842122D01*
X178250853Y-110906951D01*
X178167778Y-110923476D01*
X178084704Y-110940000D01*
X177915296Y-110940000D01*
X177832222Y-110923476D01*
X177749147Y-110906951D01*
X177592637Y-110842122D01*
X177451782Y-110748005D01*
X177331995Y-110628218D01*
X177237878Y-110487363D01*
X177173049Y-110330853D01*
X177140000Y-110164703D01*
X177140000Y-109995297D01*
X177173049Y-109829147D01*
X177237878Y-109672637D01*
X177331995Y-109531782D01*
X177451782Y-109411995D01*
X177592637Y-109317878D01*
X177749147Y-109253049D01*
X177832222Y-109236524D01*
X177915296Y-109220000D01*
X178084704Y-109220000D01*
X178167778Y-109236524D01*
G37*
G36*
X127667778Y-109236524D02*
G01*
X127750853Y-109253049D01*
X127907363Y-109317878D01*
X128048218Y-109411995D01*
X128168005Y-109531782D01*
X128262122Y-109672637D01*
X128326951Y-109829147D01*
X128360000Y-109995297D01*
X128360000Y-110164703D01*
X128326951Y-110330853D01*
X128262122Y-110487363D01*
X128168005Y-110628218D01*
X128048218Y-110748005D01*
X127907363Y-110842122D01*
X127750853Y-110906951D01*
X127667778Y-110923476D01*
X127584704Y-110940000D01*
X127415296Y-110940000D01*
X127332222Y-110923476D01*
X127249147Y-110906951D01*
X127092637Y-110842122D01*
X126951782Y-110748005D01*
X126831995Y-110628218D01*
X126737878Y-110487363D01*
X126673049Y-110330853D01*
X126640000Y-110164703D01*
X126640000Y-109995297D01*
X126673049Y-109829147D01*
X126737878Y-109672637D01*
X126831995Y-109531782D01*
X126951782Y-109411995D01*
X127092637Y-109317878D01*
X127249147Y-109253049D01*
X127332222Y-109236524D01*
X127415296Y-109220000D01*
X127584704Y-109220000D01*
X127667778Y-109236524D01*
G37*
G36*
X132667778Y-109236524D02*
G01*
X132750853Y-109253049D01*
X132907363Y-109317878D01*
X133048218Y-109411995D01*
X133168005Y-109531782D01*
X133262122Y-109672637D01*
X133326951Y-109829147D01*
X133360000Y-109995297D01*
X133360000Y-110164703D01*
X133326951Y-110330853D01*
X133262122Y-110487363D01*
X133168005Y-110628218D01*
X133048218Y-110748005D01*
X132907363Y-110842122D01*
X132750853Y-110906951D01*
X132667778Y-110923476D01*
X132584704Y-110940000D01*
X132415296Y-110940000D01*
X132332222Y-110923476D01*
X132249147Y-110906951D01*
X132092637Y-110842122D01*
X131951782Y-110748005D01*
X131831995Y-110628218D01*
X131737878Y-110487363D01*
X131673049Y-110330853D01*
X131640000Y-110164703D01*
X131640000Y-109995297D01*
X131673049Y-109829147D01*
X131737878Y-109672637D01*
X131831995Y-109531782D01*
X131951782Y-109411995D01*
X132092637Y-109317878D01*
X132249147Y-109253049D01*
X132332222Y-109236524D01*
X132415296Y-109220000D01*
X132584704Y-109220000D01*
X132667778Y-109236524D01*
G37*
G36*
X137667778Y-109236524D02*
G01*
X137750853Y-109253049D01*
X137907363Y-109317878D01*
X138048218Y-109411995D01*
X138168005Y-109531782D01*
X138262122Y-109672637D01*
X138326951Y-109829147D01*
X138360000Y-109995297D01*
X138360000Y-110164703D01*
X138326951Y-110330853D01*
X138262122Y-110487363D01*
X138168005Y-110628218D01*
X138048218Y-110748005D01*
X137907363Y-110842122D01*
X137750853Y-110906951D01*
X137667778Y-110923476D01*
X137584704Y-110940000D01*
X137415296Y-110940000D01*
X137332222Y-110923476D01*
X137249147Y-110906951D01*
X137092637Y-110842122D01*
X136951782Y-110748005D01*
X136831995Y-110628218D01*
X136737878Y-110487363D01*
X136673049Y-110330853D01*
X136640000Y-110164703D01*
X136640000Y-109995297D01*
X136673049Y-109829147D01*
X136737878Y-109672637D01*
X136831995Y-109531782D01*
X136951782Y-109411995D01*
X137092637Y-109317878D01*
X137249147Y-109253049D01*
X137332222Y-109236524D01*
X137415296Y-109220000D01*
X137584704Y-109220000D01*
X137667778Y-109236524D01*
G37*
G36*
X167667778Y-109236524D02*
G01*
X167750853Y-109253049D01*
X167907363Y-109317878D01*
X168048218Y-109411995D01*
X168168005Y-109531782D01*
X168262122Y-109672637D01*
X168326951Y-109829147D01*
X168360000Y-109995297D01*
X168360000Y-110164703D01*
X168326951Y-110330853D01*
X168262122Y-110487363D01*
X168168005Y-110628218D01*
X168048218Y-110748005D01*
X167907363Y-110842122D01*
X167750853Y-110906951D01*
X167667778Y-110923476D01*
X167584704Y-110940000D01*
X167415296Y-110940000D01*
X167332222Y-110923476D01*
X167249147Y-110906951D01*
X167092637Y-110842122D01*
X166951782Y-110748005D01*
X166831995Y-110628218D01*
X166737878Y-110487363D01*
X166673049Y-110330853D01*
X166640000Y-110164703D01*
X166640000Y-109995297D01*
X166673049Y-109829147D01*
X166737878Y-109672637D01*
X166831995Y-109531782D01*
X166951782Y-109411995D01*
X167092637Y-109317878D01*
X167249147Y-109253049D01*
X167332222Y-109236524D01*
X167415296Y-109220000D01*
X167584704Y-109220000D01*
X167667778Y-109236524D01*
G37*
G36*
X172667778Y-109236524D02*
G01*
X172750853Y-109253049D01*
X172907363Y-109317878D01*
X173048218Y-109411995D01*
X173168005Y-109531782D01*
X173262122Y-109672637D01*
X173326951Y-109829147D01*
X173360000Y-109995297D01*
X173360000Y-110164703D01*
X173326951Y-110330853D01*
X173262122Y-110487363D01*
X173168005Y-110628218D01*
X173048218Y-110748005D01*
X172907363Y-110842122D01*
X172750853Y-110906951D01*
X172667778Y-110923476D01*
X172584704Y-110940000D01*
X172415296Y-110940000D01*
X172332222Y-110923476D01*
X172249147Y-110906951D01*
X172092637Y-110842122D01*
X171951782Y-110748005D01*
X171831995Y-110628218D01*
X171737878Y-110487363D01*
X171673049Y-110330853D01*
X171640000Y-110164703D01*
X171640000Y-109995297D01*
X171673049Y-109829147D01*
X171737878Y-109672637D01*
X171831995Y-109531782D01*
X171951782Y-109411995D01*
X172092637Y-109317878D01*
X172249147Y-109253049D01*
X172332222Y-109236524D01*
X172415296Y-109220000D01*
X172584704Y-109220000D01*
X172667778Y-109236524D01*
G37*
G36*
X162667778Y-109236524D02*
G01*
X162750853Y-109253049D01*
X162907363Y-109317878D01*
X163048218Y-109411995D01*
X163168005Y-109531782D01*
X163262122Y-109672637D01*
X163326951Y-109829147D01*
X163360000Y-109995297D01*
X163360000Y-110164703D01*
X163326951Y-110330853D01*
X163262122Y-110487363D01*
X163168005Y-110628218D01*
X163048218Y-110748005D01*
X162907363Y-110842122D01*
X162750853Y-110906951D01*
X162667778Y-110923476D01*
X162584704Y-110940000D01*
X162415296Y-110940000D01*
X162332222Y-110923476D01*
X162249147Y-110906951D01*
X162092637Y-110842122D01*
X161951782Y-110748005D01*
X161831995Y-110628218D01*
X161737878Y-110487363D01*
X161673049Y-110330853D01*
X161640000Y-110164703D01*
X161640000Y-109995297D01*
X161673049Y-109829147D01*
X161737878Y-109672637D01*
X161831995Y-109531782D01*
X161951782Y-109411995D01*
X162092637Y-109317878D01*
X162249147Y-109253049D01*
X162332222Y-109236524D01*
X162415296Y-109220000D01*
X162584704Y-109220000D01*
X162667778Y-109236524D01*
G37*
G36*
X122667778Y-109156524D02*
G01*
X122750853Y-109173049D01*
X122907363Y-109237878D01*
X123048218Y-109331995D01*
X123168005Y-109451782D01*
X123262122Y-109592637D01*
X123326951Y-109749147D01*
X123360000Y-109915297D01*
X123360000Y-110084703D01*
X123326951Y-110250853D01*
X123262122Y-110407363D01*
X123168005Y-110548218D01*
X123048218Y-110668005D01*
X122907363Y-110762122D01*
X122750853Y-110826951D01*
X122667778Y-110843476D01*
X122584704Y-110860000D01*
X122415296Y-110860000D01*
X122332222Y-110843476D01*
X122249147Y-110826951D01*
X122092637Y-110762122D01*
X121951782Y-110668005D01*
X121831995Y-110548218D01*
X121737878Y-110407363D01*
X121673049Y-110250853D01*
X121640000Y-110084703D01*
X121640000Y-109915297D01*
X121673049Y-109749147D01*
X121737878Y-109592637D01*
X121831995Y-109451782D01*
X121951782Y-109331995D01*
X122092637Y-109237878D01*
X122249147Y-109173049D01*
X122332222Y-109156524D01*
X122415296Y-109140000D01*
X122584704Y-109140000D01*
X122667778Y-109156524D01*
G37*
G36*
X146348023Y-109205564D02*
G01*
X146426268Y-109221128D01*
X146573679Y-109282188D01*
X146706345Y-109370832D01*
X146819168Y-109483655D01*
X146907812Y-109616321D01*
X146962831Y-109749147D01*
X146968872Y-109763733D01*
X147000000Y-109920221D01*
X147000000Y-110079779D01*
X146999020Y-110084704D01*
X146968872Y-110236268D01*
X146907812Y-110383679D01*
X146819168Y-110516345D01*
X146706345Y-110629168D01*
X146573679Y-110717812D01*
X146426268Y-110778872D01*
X146348023Y-110794436D01*
X146269779Y-110810000D01*
X146110221Y-110810000D01*
X146031977Y-110794436D01*
X145953732Y-110778872D01*
X145806321Y-110717812D01*
X145673655Y-110629168D01*
X145560832Y-110516345D01*
X145472188Y-110383679D01*
X145411128Y-110236268D01*
X145380980Y-110084704D01*
X145380000Y-110079779D01*
X145380000Y-109920221D01*
X145411128Y-109763733D01*
X145417170Y-109749147D01*
X145472188Y-109616321D01*
X145560832Y-109483655D01*
X145673655Y-109370832D01*
X145806321Y-109282188D01*
X145953732Y-109221128D01*
X146031977Y-109205564D01*
X146110221Y-109190000D01*
X146269779Y-109190000D01*
X146348023Y-109205564D01*
G37*
G36*
X154620000Y-110810000D02*
G01*
X153000000Y-110810000D01*
X153000000Y-109190000D01*
X154620000Y-109190000D01*
X154620000Y-110810000D01*
G37*
G36*
X178167778Y-106696524D02*
G01*
X178250853Y-106713049D01*
X178407363Y-106777878D01*
X178548218Y-106871995D01*
X178668005Y-106991782D01*
X178762122Y-107132637D01*
X178826951Y-107289147D01*
X178860000Y-107455297D01*
X178860000Y-107624703D01*
X178826951Y-107790853D01*
X178762122Y-107947363D01*
X178668005Y-108088218D01*
X178548218Y-108208005D01*
X178407363Y-108302122D01*
X178250853Y-108366951D01*
X178167778Y-108383476D01*
X178084704Y-108400000D01*
X177915296Y-108400000D01*
X177832222Y-108383476D01*
X177749147Y-108366951D01*
X177592637Y-108302122D01*
X177451782Y-108208005D01*
X177331995Y-108088218D01*
X177237878Y-107947363D01*
X177173049Y-107790853D01*
X177140000Y-107624703D01*
X177140000Y-107455297D01*
X177173049Y-107289147D01*
X177237878Y-107132637D01*
X177331995Y-106991782D01*
X177451782Y-106871995D01*
X177592637Y-106777878D01*
X177749147Y-106713049D01*
X177832222Y-106696525D01*
X177915296Y-106680000D01*
X178084704Y-106680000D01*
X178167778Y-106696524D01*
G37*
G36*
X172667778Y-106696524D02*
G01*
X172750853Y-106713049D01*
X172907363Y-106777878D01*
X173048218Y-106871995D01*
X173168005Y-106991782D01*
X173262122Y-107132637D01*
X173326951Y-107289147D01*
X173360000Y-107455297D01*
X173360000Y-107624703D01*
X173326951Y-107790853D01*
X173262122Y-107947363D01*
X173168005Y-108088218D01*
X173048218Y-108208005D01*
X172907363Y-108302122D01*
X172750853Y-108366951D01*
X172667778Y-108383476D01*
X172584704Y-108400000D01*
X172415296Y-108400000D01*
X172332222Y-108383476D01*
X172249147Y-108366951D01*
X172092637Y-108302122D01*
X171951782Y-108208005D01*
X171831995Y-108088218D01*
X171737878Y-107947363D01*
X171673049Y-107790853D01*
X171640000Y-107624703D01*
X171640000Y-107455297D01*
X171673049Y-107289147D01*
X171737878Y-107132637D01*
X171831995Y-106991782D01*
X171951782Y-106871995D01*
X172092637Y-106777878D01*
X172249147Y-106713049D01*
X172332222Y-106696525D01*
X172415296Y-106680000D01*
X172584704Y-106680000D01*
X172667778Y-106696524D01*
G37*
G36*
X127667778Y-106696524D02*
G01*
X127750853Y-106713049D01*
X127907363Y-106777878D01*
X128048218Y-106871995D01*
X128168005Y-106991782D01*
X128262122Y-107132637D01*
X128326951Y-107289147D01*
X128360000Y-107455297D01*
X128360000Y-107624703D01*
X128326951Y-107790853D01*
X128262122Y-107947363D01*
X128168005Y-108088218D01*
X128048218Y-108208005D01*
X127907363Y-108302122D01*
X127750853Y-108366951D01*
X127667778Y-108383476D01*
X127584704Y-108400000D01*
X127415296Y-108400000D01*
X127332222Y-108383476D01*
X127249147Y-108366951D01*
X127092637Y-108302122D01*
X126951782Y-108208005D01*
X126831995Y-108088218D01*
X126737878Y-107947363D01*
X126673049Y-107790853D01*
X126640000Y-107624703D01*
X126640000Y-107455297D01*
X126673049Y-107289147D01*
X126737878Y-107132637D01*
X126831995Y-106991782D01*
X126951782Y-106871995D01*
X127092637Y-106777878D01*
X127249147Y-106713049D01*
X127332222Y-106696525D01*
X127415296Y-106680000D01*
X127584704Y-106680000D01*
X127667778Y-106696524D01*
G37*
G36*
X167667778Y-106696524D02*
G01*
X167750853Y-106713049D01*
X167907363Y-106777878D01*
X168048218Y-106871995D01*
X168168005Y-106991782D01*
X168262122Y-107132637D01*
X168326951Y-107289147D01*
X168360000Y-107455297D01*
X168360000Y-107624703D01*
X168326951Y-107790853D01*
X168262122Y-107947363D01*
X168168005Y-108088218D01*
X168048218Y-108208005D01*
X167907363Y-108302122D01*
X167750853Y-108366951D01*
X167667778Y-108383476D01*
X167584704Y-108400000D01*
X167415296Y-108400000D01*
X167332222Y-108383476D01*
X167249147Y-108366951D01*
X167092637Y-108302122D01*
X166951782Y-108208005D01*
X166831995Y-108088218D01*
X166737878Y-107947363D01*
X166673049Y-107790853D01*
X166640000Y-107624703D01*
X166640000Y-107455297D01*
X166673049Y-107289147D01*
X166737878Y-107132637D01*
X166831995Y-106991782D01*
X166951782Y-106871995D01*
X167092637Y-106777878D01*
X167249147Y-106713049D01*
X167332222Y-106696525D01*
X167415296Y-106680000D01*
X167584704Y-106680000D01*
X167667778Y-106696524D01*
G37*
G36*
X132667778Y-106696524D02*
G01*
X132750853Y-106713049D01*
X132907363Y-106777878D01*
X133048218Y-106871995D01*
X133168005Y-106991782D01*
X133262122Y-107132637D01*
X133326951Y-107289147D01*
X133360000Y-107455297D01*
X133360000Y-107624703D01*
X133326951Y-107790853D01*
X133262122Y-107947363D01*
X133168005Y-108088218D01*
X133048218Y-108208005D01*
X132907363Y-108302122D01*
X132750853Y-108366951D01*
X132667778Y-108383476D01*
X132584704Y-108400000D01*
X132415296Y-108400000D01*
X132332222Y-108383476D01*
X132249147Y-108366951D01*
X132092637Y-108302122D01*
X131951782Y-108208005D01*
X131831995Y-108088218D01*
X131737878Y-107947363D01*
X131673049Y-107790853D01*
X131640000Y-107624703D01*
X131640000Y-107455297D01*
X131673049Y-107289147D01*
X131737878Y-107132637D01*
X131831995Y-106991782D01*
X131951782Y-106871995D01*
X132092637Y-106777878D01*
X132249147Y-106713049D01*
X132332222Y-106696525D01*
X132415296Y-106680000D01*
X132584704Y-106680000D01*
X132667778Y-106696524D01*
G37*
G36*
X162667778Y-106696524D02*
G01*
X162750853Y-106713049D01*
X162907363Y-106777878D01*
X163048218Y-106871995D01*
X163168005Y-106991782D01*
X163262122Y-107132637D01*
X163326951Y-107289147D01*
X163360000Y-107455297D01*
X163360000Y-107624703D01*
X163326951Y-107790853D01*
X163262122Y-107947363D01*
X163168005Y-108088218D01*
X163048218Y-108208005D01*
X162907363Y-108302122D01*
X162750853Y-108366951D01*
X162667778Y-108383476D01*
X162584704Y-108400000D01*
X162415296Y-108400000D01*
X162332222Y-108383476D01*
X162249147Y-108366951D01*
X162092637Y-108302122D01*
X161951782Y-108208005D01*
X161831995Y-108088218D01*
X161737878Y-107947363D01*
X161673049Y-107790853D01*
X161640000Y-107624703D01*
X161640000Y-107455297D01*
X161673049Y-107289147D01*
X161737878Y-107132637D01*
X161831995Y-106991782D01*
X161951782Y-106871995D01*
X162092637Y-106777878D01*
X162249147Y-106713049D01*
X162332222Y-106696525D01*
X162415296Y-106680000D01*
X162584704Y-106680000D01*
X162667778Y-106696524D01*
G37*
G36*
X137667778Y-106696524D02*
G01*
X137750853Y-106713049D01*
X137907363Y-106777878D01*
X138048218Y-106871995D01*
X138168005Y-106991782D01*
X138262122Y-107132637D01*
X138326951Y-107289147D01*
X138360000Y-107455297D01*
X138360000Y-107624703D01*
X138326951Y-107790853D01*
X138262122Y-107947363D01*
X138168005Y-108088218D01*
X138048218Y-108208005D01*
X137907363Y-108302122D01*
X137750853Y-108366951D01*
X137667778Y-108383476D01*
X137584704Y-108400000D01*
X137415296Y-108400000D01*
X137332222Y-108383476D01*
X137249147Y-108366951D01*
X137092637Y-108302122D01*
X136951782Y-108208005D01*
X136831995Y-108088218D01*
X136737878Y-107947363D01*
X136673049Y-107790853D01*
X136640000Y-107624703D01*
X136640000Y-107455297D01*
X136673049Y-107289147D01*
X136737878Y-107132637D01*
X136831995Y-106991782D01*
X136951782Y-106871995D01*
X137092637Y-106777878D01*
X137249147Y-106713049D01*
X137332222Y-106696525D01*
X137415296Y-106680000D01*
X137584704Y-106680000D01*
X137667778Y-106696524D01*
G37*
G36*
X122667778Y-106616525D02*
G01*
X122750853Y-106633049D01*
X122907363Y-106697878D01*
X123048218Y-106791995D01*
X123168005Y-106911782D01*
X123262122Y-107052637D01*
X123326951Y-107209147D01*
X123360000Y-107375297D01*
X123360000Y-107544703D01*
X123326951Y-107710853D01*
X123262122Y-107867363D01*
X123168005Y-108008218D01*
X123048218Y-108128005D01*
X122907363Y-108222122D01*
X122750853Y-108286951D01*
X122667778Y-108303475D01*
X122584704Y-108320000D01*
X122415296Y-108320000D01*
X122332222Y-108303475D01*
X122249147Y-108286951D01*
X122092637Y-108222122D01*
X121951782Y-108128005D01*
X121831995Y-108008218D01*
X121737878Y-107867363D01*
X121673049Y-107710853D01*
X121640000Y-107544703D01*
X121640000Y-107375297D01*
X121673049Y-107209147D01*
X121737878Y-107052637D01*
X121831995Y-106911782D01*
X121951782Y-106791995D01*
X122092637Y-106697878D01*
X122249147Y-106633049D01*
X122332222Y-106616525D01*
X122415296Y-106600000D01*
X122584704Y-106600000D01*
X122667778Y-106616525D01*
G37*
G36*
X146348023Y-106665564D02*
G01*
X146426268Y-106681128D01*
X146573679Y-106742188D01*
X146706345Y-106830832D01*
X146819168Y-106943655D01*
X146907812Y-107076321D01*
X146962831Y-107209147D01*
X146968872Y-107223733D01*
X147000000Y-107380221D01*
X147000000Y-107539779D01*
X146999020Y-107544704D01*
X146968872Y-107696268D01*
X146907812Y-107843679D01*
X146819168Y-107976345D01*
X146706345Y-108089168D01*
X146573679Y-108177812D01*
X146426268Y-108238872D01*
X146348023Y-108254436D01*
X146269779Y-108270000D01*
X146110221Y-108270000D01*
X146031977Y-108254436D01*
X145953732Y-108238872D01*
X145806321Y-108177812D01*
X145673655Y-108089168D01*
X145560832Y-107976345D01*
X145472188Y-107843679D01*
X145411128Y-107696268D01*
X145380980Y-107544704D01*
X145380000Y-107539779D01*
X145380000Y-107380221D01*
X145411128Y-107223733D01*
X145417170Y-107209147D01*
X145472188Y-107076321D01*
X145560832Y-106943655D01*
X145673655Y-106830832D01*
X145806321Y-106742188D01*
X145953732Y-106681128D01*
X146031977Y-106665564D01*
X146110221Y-106650000D01*
X146269779Y-106650000D01*
X146348023Y-106665564D01*
G37*
G36*
X153968023Y-106665564D02*
G01*
X154046268Y-106681128D01*
X154193679Y-106742188D01*
X154326345Y-106830832D01*
X154439168Y-106943655D01*
X154527812Y-107076321D01*
X154582831Y-107209147D01*
X154588872Y-107223733D01*
X154620000Y-107380221D01*
X154620000Y-107539779D01*
X154619020Y-107544704D01*
X154588872Y-107696268D01*
X154527812Y-107843679D01*
X154439168Y-107976345D01*
X154326345Y-108089168D01*
X154193679Y-108177812D01*
X154046268Y-108238872D01*
X153968023Y-108254436D01*
X153889779Y-108270000D01*
X153730221Y-108270000D01*
X153651977Y-108254436D01*
X153573732Y-108238872D01*
X153426321Y-108177812D01*
X153293655Y-108089168D01*
X153180832Y-107976345D01*
X153092188Y-107843679D01*
X153031128Y-107696268D01*
X153000980Y-107544704D01*
X153000000Y-107539779D01*
X153000000Y-107380221D01*
X153031128Y-107223733D01*
X153037170Y-107209147D01*
X153092188Y-107076321D01*
X153180832Y-106943655D01*
X153293655Y-106830832D01*
X153426321Y-106742188D01*
X153573732Y-106681128D01*
X153651977Y-106665564D01*
X153730221Y-106650000D01*
X153889779Y-106650000D01*
X153968023Y-106665564D01*
G37*
G36*
X163360000Y-105860000D02*
G01*
X161640000Y-105860000D01*
X161640000Y-104140000D01*
X163360000Y-104140000D01*
X163360000Y-105860000D01*
G37*
G36*
X133360000Y-105860000D02*
G01*
X131640000Y-105860000D01*
X131640000Y-104140000D01*
X133360000Y-104140000D01*
X133360000Y-105860000D01*
G37*
G36*
X138360000Y-105860000D02*
G01*
X136640000Y-105860000D01*
X136640000Y-104140000D01*
X138360000Y-104140000D01*
X138360000Y-105860000D01*
G37*
G36*
X128360000Y-105860000D02*
G01*
X126640000Y-105860000D01*
X126640000Y-104140000D01*
X128360000Y-104140000D01*
X128360000Y-105860000D01*
G37*
G36*
X168360000Y-105860000D02*
G01*
X166640000Y-105860000D01*
X166640000Y-104140000D01*
X168360000Y-104140000D01*
X168360000Y-105860000D01*
G37*
G36*
X173360000Y-105860000D02*
G01*
X171640000Y-105860000D01*
X171640000Y-104140000D01*
X173360000Y-104140000D01*
X173360000Y-105860000D01*
G37*
G36*
X178860000Y-105860000D02*
G01*
X177140000Y-105860000D01*
X177140000Y-104140000D01*
X178860000Y-104140000D01*
X178860000Y-105860000D01*
G37*
G36*
X123360000Y-105780000D02*
G01*
X121640000Y-105780000D01*
X121640000Y-104060000D01*
X123360000Y-104060000D01*
X123360000Y-105780000D01*
G37*
G36*
X153968023Y-104125564D02*
G01*
X154046268Y-104141128D01*
X154193679Y-104202188D01*
X154326345Y-104290832D01*
X154439168Y-104403655D01*
X154527812Y-104536321D01*
X154588872Y-104683732D01*
X154620000Y-104840222D01*
X154620000Y-104999778D01*
X154588872Y-105156268D01*
X154527812Y-105303679D01*
X154439168Y-105436345D01*
X154326345Y-105549168D01*
X154193679Y-105637812D01*
X154046268Y-105698872D01*
X153968023Y-105714436D01*
X153889779Y-105730000D01*
X153730221Y-105730000D01*
X153651977Y-105714436D01*
X153573732Y-105698872D01*
X153426321Y-105637812D01*
X153293655Y-105549168D01*
X153180832Y-105436345D01*
X153092188Y-105303679D01*
X153031128Y-105156268D01*
X153000000Y-104999778D01*
X153000000Y-104840222D01*
X153031128Y-104683732D01*
X153092188Y-104536321D01*
X153180832Y-104403655D01*
X153293655Y-104290832D01*
X153426321Y-104202188D01*
X153573732Y-104141128D01*
X153651977Y-104125564D01*
X153730221Y-104110000D01*
X153889779Y-104110000D01*
X153968023Y-104125564D01*
G37*
G36*
X146348023Y-104125564D02*
G01*
X146426268Y-104141128D01*
X146573679Y-104202188D01*
X146706345Y-104290832D01*
X146819168Y-104403655D01*
X146907812Y-104536321D01*
X146968872Y-104683732D01*
X147000000Y-104840222D01*
X147000000Y-104999778D01*
X146968872Y-105156268D01*
X146907812Y-105303679D01*
X146819168Y-105436345D01*
X146706345Y-105549168D01*
X146573679Y-105637812D01*
X146426268Y-105698872D01*
X146348023Y-105714436D01*
X146269779Y-105730000D01*
X146110221Y-105730000D01*
X146031977Y-105714436D01*
X145953732Y-105698872D01*
X145806321Y-105637812D01*
X145673655Y-105549168D01*
X145560832Y-105436345D01*
X145472188Y-105303679D01*
X145411128Y-105156268D01*
X145380000Y-104999778D01*
X145380000Y-104840222D01*
X145411128Y-104683732D01*
X145472188Y-104536321D01*
X145560832Y-104403655D01*
X145673655Y-104290832D01*
X145806321Y-104202188D01*
X145953732Y-104141128D01*
X146031977Y-104125564D01*
X146110221Y-104110000D01*
X146269779Y-104110000D01*
X146348023Y-104125564D01*
G37*
G36*
X153968023Y-101585564D02*
G01*
X154046268Y-101601128D01*
X154193679Y-101662188D01*
X154326345Y-101750832D01*
X154439168Y-101863655D01*
X154527812Y-101996321D01*
X154588872Y-102143732D01*
X154620000Y-102300222D01*
X154620000Y-102459778D01*
X154588872Y-102616268D01*
X154527812Y-102763679D01*
X154439168Y-102896345D01*
X154326345Y-103009168D01*
X154193679Y-103097812D01*
X154046268Y-103158872D01*
X153968023Y-103174436D01*
X153889779Y-103190000D01*
X153730221Y-103190000D01*
X153651977Y-103174436D01*
X153573732Y-103158872D01*
X153426321Y-103097812D01*
X153293655Y-103009168D01*
X153180832Y-102896345D01*
X153092188Y-102763679D01*
X153031128Y-102616268D01*
X153000000Y-102459778D01*
X153000000Y-102300222D01*
X153031128Y-102143732D01*
X153092188Y-101996321D01*
X153180832Y-101863655D01*
X153293655Y-101750832D01*
X153426321Y-101662188D01*
X153573732Y-101601128D01*
X153651977Y-101585564D01*
X153730221Y-101570000D01*
X153889779Y-101570000D01*
X153968023Y-101585564D01*
G37*
G36*
X146348023Y-101585564D02*
G01*
X146426268Y-101601128D01*
X146573679Y-101662188D01*
X146706345Y-101750832D01*
X146819168Y-101863655D01*
X146907812Y-101996321D01*
X146968872Y-102143732D01*
X147000000Y-102300222D01*
X147000000Y-102459778D01*
X146968872Y-102616268D01*
X146907812Y-102763679D01*
X146819168Y-102896345D01*
X146706345Y-103009168D01*
X146573679Y-103097812D01*
X146426268Y-103158872D01*
X146348023Y-103174436D01*
X146269779Y-103190000D01*
X146110221Y-103190000D01*
X146031977Y-103174436D01*
X145953732Y-103158872D01*
X145806321Y-103097812D01*
X145673655Y-103009168D01*
X145560832Y-102896345D01*
X145472188Y-102763679D01*
X145411128Y-102616268D01*
X145380000Y-102459778D01*
X145380000Y-102300222D01*
X145411128Y-102143732D01*
X145472188Y-101996321D01*
X145560832Y-101863655D01*
X145673655Y-101750832D01*
X145806321Y-101662188D01*
X145953732Y-101601128D01*
X146031977Y-101585564D01*
X146110221Y-101570000D01*
X146269779Y-101570000D01*
X146348023Y-101585564D01*
G37*
G36*
X179127778Y-99656524D02*
G01*
X179210853Y-99673049D01*
X179367363Y-99737878D01*
X179508218Y-99831995D01*
X179628005Y-99951782D01*
X179722122Y-100092637D01*
X179776402Y-100223679D01*
X179786951Y-100249148D01*
X179820000Y-100415296D01*
X179820000Y-100584704D01*
X179807012Y-100650000D01*
X179786951Y-100750853D01*
X179722122Y-100907363D01*
X179628005Y-101048218D01*
X179508218Y-101168005D01*
X179367363Y-101262122D01*
X179210853Y-101326951D01*
X179127778Y-101343476D01*
X179044704Y-101360000D01*
X178875296Y-101360000D01*
X178792222Y-101343476D01*
X178709147Y-101326951D01*
X178552637Y-101262122D01*
X178411782Y-101168005D01*
X178291995Y-101048218D01*
X178197878Y-100907363D01*
X178133049Y-100750853D01*
X178112988Y-100650000D01*
X178100000Y-100584704D01*
X178100000Y-100415296D01*
X178133049Y-100249148D01*
X178143599Y-100223679D01*
X178197878Y-100092637D01*
X178291995Y-99951782D01*
X178411782Y-99831995D01*
X178552637Y-99737878D01*
X178709147Y-99673049D01*
X178792222Y-99656524D01*
X178875296Y-99640000D01*
X179044704Y-99640000D01*
X179127778Y-99656524D01*
G37*
G36*
X182360000Y-101360000D02*
G01*
X180640000Y-101360000D01*
X180640000Y-99640000D01*
X182360000Y-99640000D01*
X182360000Y-101360000D01*
G37*
G36*
X146348023Y-99045564D02*
G01*
X146426268Y-99061128D01*
X146573679Y-99122188D01*
X146706345Y-99210832D01*
X146819168Y-99323655D01*
X146907812Y-99456321D01*
X146907813Y-99456323D01*
X146968872Y-99603733D01*
X146995556Y-99737878D01*
X147000000Y-99760222D01*
X147000000Y-99919778D01*
X146968872Y-100076268D01*
X146907812Y-100223679D01*
X146819168Y-100356345D01*
X146706345Y-100469168D01*
X146573679Y-100557812D01*
X146426268Y-100618872D01*
X146348023Y-100634436D01*
X146269779Y-100650000D01*
X146110221Y-100650000D01*
X146031977Y-100634436D01*
X145953732Y-100618872D01*
X145806321Y-100557812D01*
X145673655Y-100469168D01*
X145560832Y-100356345D01*
X145472188Y-100223679D01*
X145411128Y-100076268D01*
X145380000Y-99919778D01*
X145380000Y-99760222D01*
X145384445Y-99737878D01*
X145411128Y-99603733D01*
X145472187Y-99456323D01*
X145472188Y-99456321D01*
X145560832Y-99323655D01*
X145673655Y-99210832D01*
X145806321Y-99122188D01*
X145953732Y-99061128D01*
X146031977Y-99045564D01*
X146110221Y-99030000D01*
X146269779Y-99030000D01*
X146348023Y-99045564D01*
G37*
G36*
X153968023Y-99045564D02*
G01*
X154046268Y-99061128D01*
X154193679Y-99122188D01*
X154326345Y-99210832D01*
X154439168Y-99323655D01*
X154527812Y-99456321D01*
X154527813Y-99456323D01*
X154588872Y-99603733D01*
X154615556Y-99737878D01*
X154620000Y-99760222D01*
X154620000Y-99919778D01*
X154588872Y-100076268D01*
X154527812Y-100223679D01*
X154439168Y-100356345D01*
X154326345Y-100469168D01*
X154193679Y-100557812D01*
X154046268Y-100618872D01*
X153968023Y-100634436D01*
X153889779Y-100650000D01*
X153730221Y-100650000D01*
X153651977Y-100634436D01*
X153573732Y-100618872D01*
X153426321Y-100557812D01*
X153293655Y-100469168D01*
X153180832Y-100356345D01*
X153092188Y-100223679D01*
X153031128Y-100076268D01*
X153000000Y-99919778D01*
X153000000Y-99760222D01*
X153004445Y-99737878D01*
X153031128Y-99603733D01*
X153092187Y-99456323D01*
X153092188Y-99456321D01*
X153180832Y-99323655D01*
X153293655Y-99210832D01*
X153426321Y-99122188D01*
X153573732Y-99061128D01*
X153651977Y-99045564D01*
X153730221Y-99030000D01*
X153889779Y-99030000D01*
X153968023Y-99045564D01*
G37*
G36*
X181667778Y-97116525D02*
G01*
X181750853Y-97133049D01*
X181907363Y-97197878D01*
X182048218Y-97291995D01*
X182168005Y-97411782D01*
X182262122Y-97552637D01*
X182316402Y-97683679D01*
X182326951Y-97709148D01*
X182360000Y-97875296D01*
X182360000Y-98044704D01*
X182347012Y-98110000D01*
X182326951Y-98210853D01*
X182262122Y-98367363D01*
X182168005Y-98508218D01*
X182048218Y-98628005D01*
X181907363Y-98722122D01*
X181750853Y-98786951D01*
X181667778Y-98803476D01*
X181584704Y-98820000D01*
X181415296Y-98820000D01*
X181332222Y-98803476D01*
X181249147Y-98786951D01*
X181092637Y-98722122D01*
X180951782Y-98628005D01*
X180831995Y-98508218D01*
X180737878Y-98367363D01*
X180673049Y-98210853D01*
X180652988Y-98110000D01*
X180640000Y-98044704D01*
X180640000Y-97875296D01*
X180673049Y-97709148D01*
X180683599Y-97683679D01*
X180737878Y-97552637D01*
X180831995Y-97411782D01*
X180951782Y-97291995D01*
X181092637Y-97197878D01*
X181249147Y-97133049D01*
X181332222Y-97116524D01*
X181415296Y-97100000D01*
X181584704Y-97100000D01*
X181667778Y-97116525D01*
G37*
G36*
X179127778Y-97116525D02*
G01*
X179210853Y-97133049D01*
X179367363Y-97197878D01*
X179508218Y-97291995D01*
X179628005Y-97411782D01*
X179722122Y-97552637D01*
X179776402Y-97683679D01*
X179786951Y-97709148D01*
X179820000Y-97875296D01*
X179820000Y-98044704D01*
X179807012Y-98110000D01*
X179786951Y-98210853D01*
X179722122Y-98367363D01*
X179628005Y-98508218D01*
X179508218Y-98628005D01*
X179367363Y-98722122D01*
X179210853Y-98786951D01*
X179127778Y-98803476D01*
X179044704Y-98820000D01*
X178875296Y-98820000D01*
X178792222Y-98803476D01*
X178709147Y-98786951D01*
X178552637Y-98722122D01*
X178411782Y-98628005D01*
X178291995Y-98508218D01*
X178197878Y-98367363D01*
X178133049Y-98210853D01*
X178112988Y-98110000D01*
X178100000Y-98044704D01*
X178100000Y-97875296D01*
X178133049Y-97709148D01*
X178143599Y-97683679D01*
X178197878Y-97552637D01*
X178291995Y-97411782D01*
X178411782Y-97291995D01*
X178552637Y-97197878D01*
X178709147Y-97133049D01*
X178792222Y-97116524D01*
X178875296Y-97100000D01*
X179044704Y-97100000D01*
X179127778Y-97116525D01*
G37*
G36*
X153968023Y-96505564D02*
G01*
X154046268Y-96521128D01*
X154193679Y-96582188D01*
X154326345Y-96670832D01*
X154439168Y-96783655D01*
X154527812Y-96916321D01*
X154527813Y-96916323D01*
X154588872Y-97063733D01*
X154615556Y-97197878D01*
X154620000Y-97220222D01*
X154620000Y-97379778D01*
X154588872Y-97536268D01*
X154527812Y-97683679D01*
X154439168Y-97816345D01*
X154326345Y-97929168D01*
X154193679Y-98017812D01*
X154046268Y-98078872D01*
X153968023Y-98094436D01*
X153889779Y-98110000D01*
X153730221Y-98110000D01*
X153651977Y-98094436D01*
X153573732Y-98078872D01*
X153426321Y-98017812D01*
X153293655Y-97929168D01*
X153180832Y-97816345D01*
X153092188Y-97683679D01*
X153031128Y-97536268D01*
X153000000Y-97379778D01*
X153000000Y-97220222D01*
X153004445Y-97197878D01*
X153031128Y-97063733D01*
X153092187Y-96916323D01*
X153092188Y-96916321D01*
X153180832Y-96783655D01*
X153293655Y-96670832D01*
X153426321Y-96582188D01*
X153573732Y-96521128D01*
X153651977Y-96505564D01*
X153730221Y-96490000D01*
X153889779Y-96490000D01*
X153968023Y-96505564D01*
G37*
G36*
X146348023Y-96505564D02*
G01*
X146426268Y-96521128D01*
X146573679Y-96582188D01*
X146706345Y-96670832D01*
X146819168Y-96783655D01*
X146907812Y-96916321D01*
X146907813Y-96916323D01*
X146968872Y-97063733D01*
X146995556Y-97197878D01*
X147000000Y-97220222D01*
X147000000Y-97379778D01*
X146968872Y-97536268D01*
X146907812Y-97683679D01*
X146819168Y-97816345D01*
X146706345Y-97929168D01*
X146573679Y-98017812D01*
X146426268Y-98078872D01*
X146348023Y-98094436D01*
X146269779Y-98110000D01*
X146110221Y-98110000D01*
X146031977Y-98094436D01*
X145953732Y-98078872D01*
X145806321Y-98017812D01*
X145673655Y-97929168D01*
X145560832Y-97816345D01*
X145472188Y-97683679D01*
X145411128Y-97536268D01*
X145380000Y-97379778D01*
X145380000Y-97220222D01*
X145384445Y-97197878D01*
X145411128Y-97063733D01*
X145472187Y-96916323D01*
X145472188Y-96916321D01*
X145560832Y-96783655D01*
X145673655Y-96670832D01*
X145806321Y-96582188D01*
X145953732Y-96521128D01*
X146031977Y-96505564D01*
X146110221Y-96490000D01*
X146269779Y-96490000D01*
X146348023Y-96505564D01*
G37*
G36*
X181667778Y-94576525D02*
G01*
X181750853Y-94593049D01*
X181907363Y-94657878D01*
X182048218Y-94751995D01*
X182168005Y-94871782D01*
X182262122Y-95012637D01*
X182316402Y-95143679D01*
X182326951Y-95169148D01*
X182360000Y-95335296D01*
X182360000Y-95504704D01*
X182347012Y-95570000D01*
X182326951Y-95670853D01*
X182262122Y-95827363D01*
X182168005Y-95968218D01*
X182048218Y-96088005D01*
X181907363Y-96182122D01*
X181750853Y-96246951D01*
X181667778Y-96263475D01*
X181584704Y-96280000D01*
X181415296Y-96280000D01*
X181332222Y-96263476D01*
X181249147Y-96246951D01*
X181092637Y-96182122D01*
X180951782Y-96088005D01*
X180831995Y-95968218D01*
X180737878Y-95827363D01*
X180673049Y-95670853D01*
X180652988Y-95570000D01*
X180640000Y-95504704D01*
X180640000Y-95335296D01*
X180673049Y-95169148D01*
X180683599Y-95143679D01*
X180737878Y-95012637D01*
X180831995Y-94871782D01*
X180951782Y-94751995D01*
X181092637Y-94657878D01*
X181249147Y-94593049D01*
X181332222Y-94576525D01*
X181415296Y-94560000D01*
X181584704Y-94560000D01*
X181667778Y-94576525D01*
G37*
G36*
X179127778Y-94576525D02*
G01*
X179210853Y-94593049D01*
X179367363Y-94657878D01*
X179508218Y-94751995D01*
X179628005Y-94871782D01*
X179722122Y-95012637D01*
X179776402Y-95143679D01*
X179786951Y-95169148D01*
X179820000Y-95335296D01*
X179820000Y-95504704D01*
X179807012Y-95570000D01*
X179786951Y-95670853D01*
X179722122Y-95827363D01*
X179628005Y-95968218D01*
X179508218Y-96088005D01*
X179367363Y-96182122D01*
X179210853Y-96246951D01*
X179127778Y-96263475D01*
X179044704Y-96280000D01*
X178875296Y-96280000D01*
X178792222Y-96263476D01*
X178709147Y-96246951D01*
X178552637Y-96182122D01*
X178411782Y-96088005D01*
X178291995Y-95968218D01*
X178197878Y-95827363D01*
X178133049Y-95670853D01*
X178112988Y-95570000D01*
X178100000Y-95504704D01*
X178100000Y-95335296D01*
X178133049Y-95169148D01*
X178143599Y-95143679D01*
X178197878Y-95012637D01*
X178291995Y-94871782D01*
X178411782Y-94751995D01*
X178552637Y-94657878D01*
X178709147Y-94593049D01*
X178792222Y-94576525D01*
X178875296Y-94560000D01*
X179044704Y-94560000D01*
X179127778Y-94576525D01*
G37*
G36*
X153968023Y-93965564D02*
G01*
X154046268Y-93981128D01*
X154193679Y-94042188D01*
X154326345Y-94130832D01*
X154439168Y-94243655D01*
X154527812Y-94376321D01*
X154527813Y-94376323D01*
X154588872Y-94523733D01*
X154615556Y-94657878D01*
X154620000Y-94680222D01*
X154620000Y-94839778D01*
X154588872Y-94996268D01*
X154527812Y-95143679D01*
X154439168Y-95276345D01*
X154326345Y-95389168D01*
X154193679Y-95477812D01*
X154046268Y-95538872D01*
X153968023Y-95554436D01*
X153889779Y-95570000D01*
X153730221Y-95570000D01*
X153651977Y-95554436D01*
X153573732Y-95538872D01*
X153426321Y-95477812D01*
X153293655Y-95389168D01*
X153180832Y-95276345D01*
X153092188Y-95143679D01*
X153031128Y-94996268D01*
X153000000Y-94839778D01*
X153000000Y-94680222D01*
X153004445Y-94657878D01*
X153031128Y-94523733D01*
X153092187Y-94376323D01*
X153092188Y-94376321D01*
X153180832Y-94243655D01*
X153293655Y-94130832D01*
X153426321Y-94042188D01*
X153573732Y-93981128D01*
X153651977Y-93965564D01*
X153730221Y-93950000D01*
X153889779Y-93950000D01*
X153968023Y-93965564D01*
G37*
G36*
X146348023Y-93965564D02*
G01*
X146426268Y-93981128D01*
X146573679Y-94042188D01*
X146706345Y-94130832D01*
X146819168Y-94243655D01*
X146907812Y-94376321D01*
X146907813Y-94376323D01*
X146968872Y-94523733D01*
X146995556Y-94657878D01*
X147000000Y-94680222D01*
X147000000Y-94839778D01*
X146968872Y-94996268D01*
X146907812Y-95143679D01*
X146819168Y-95276345D01*
X146706345Y-95389168D01*
X146573679Y-95477812D01*
X146426268Y-95538872D01*
X146348023Y-95554436D01*
X146269779Y-95570000D01*
X146110221Y-95570000D01*
X146031977Y-95554436D01*
X145953732Y-95538872D01*
X145806321Y-95477812D01*
X145673655Y-95389168D01*
X145560832Y-95276345D01*
X145472188Y-95143679D01*
X145411128Y-94996268D01*
X145380000Y-94839778D01*
X145380000Y-94680222D01*
X145384445Y-94657878D01*
X145411128Y-94523733D01*
X145472187Y-94376323D01*
X145472188Y-94376321D01*
X145560832Y-94243655D01*
X145673655Y-94130832D01*
X145806321Y-94042188D01*
X145953732Y-93981128D01*
X146031977Y-93965564D01*
X146110221Y-93950000D01*
X146269779Y-93950000D01*
X146348023Y-93965564D01*
G37*
G36*
X153968023Y-91425564D02*
G01*
X154046268Y-91441128D01*
X154193679Y-91502188D01*
X154326345Y-91590832D01*
X154439168Y-91703655D01*
X154527812Y-91836321D01*
X154588872Y-91983732D01*
X154620000Y-92140222D01*
X154620000Y-92299778D01*
X154588872Y-92456268D01*
X154527812Y-92603679D01*
X154439168Y-92736345D01*
X154326345Y-92849168D01*
X154193679Y-92937812D01*
X154046268Y-92998872D01*
X153968023Y-93014436D01*
X153889779Y-93030000D01*
X153730221Y-93030000D01*
X153651977Y-93014436D01*
X153573732Y-92998872D01*
X153426321Y-92937812D01*
X153293655Y-92849168D01*
X153180832Y-92736345D01*
X153092188Y-92603679D01*
X153031128Y-92456268D01*
X153000000Y-92299778D01*
X153000000Y-92140222D01*
X153031128Y-91983732D01*
X153092188Y-91836321D01*
X153180832Y-91703655D01*
X153293655Y-91590832D01*
X153426321Y-91502188D01*
X153573732Y-91441128D01*
X153651977Y-91425564D01*
X153730221Y-91410000D01*
X153889779Y-91410000D01*
X153968023Y-91425564D01*
G37*
G36*
X146348023Y-91425564D02*
G01*
X146426268Y-91441128D01*
X146573679Y-91502188D01*
X146706345Y-91590832D01*
X146819168Y-91703655D01*
X146907812Y-91836321D01*
X146968872Y-91983732D01*
X147000000Y-92140222D01*
X147000000Y-92299778D01*
X146968872Y-92456268D01*
X146907812Y-92603679D01*
X146819168Y-92736345D01*
X146706345Y-92849168D01*
X146573679Y-92937812D01*
X146426268Y-92998872D01*
X146348023Y-93014436D01*
X146269779Y-93030000D01*
X146110221Y-93030000D01*
X146031977Y-93014436D01*
X145953732Y-92998872D01*
X145806321Y-92937812D01*
X145673655Y-92849168D01*
X145560832Y-92736345D01*
X145472188Y-92603679D01*
X145411128Y-92456268D01*
X145380000Y-92299778D01*
X145380000Y-92140222D01*
X145411128Y-91983732D01*
X145472188Y-91836321D01*
X145560832Y-91703655D01*
X145673655Y-91590832D01*
X145806321Y-91502188D01*
X145953732Y-91441128D01*
X146031977Y-91425564D01*
X146110221Y-91410000D01*
X146269779Y-91410000D01*
X146348023Y-91425564D01*
G37*
G36*
X173127778Y-86156524D02*
G01*
X173210853Y-86173049D01*
X173367363Y-86237878D01*
X173508218Y-86331995D01*
X173628005Y-86451782D01*
X173722122Y-86592637D01*
X173786951Y-86749147D01*
X173820000Y-86915297D01*
X173820000Y-87084703D01*
X173786951Y-87250853D01*
X173722122Y-87407363D01*
X173628005Y-87548218D01*
X173508218Y-87668005D01*
X173367363Y-87762122D01*
X173210853Y-87826951D01*
X173127778Y-87843475D01*
X173044704Y-87860000D01*
X172875296Y-87860000D01*
X172792222Y-87843475D01*
X172709147Y-87826951D01*
X172552637Y-87762122D01*
X172411782Y-87668005D01*
X172291995Y-87548218D01*
X172197878Y-87407363D01*
X172133049Y-87250853D01*
X172100000Y-87084703D01*
X172100000Y-86915297D01*
X172133049Y-86749147D01*
X172197878Y-86592637D01*
X172291995Y-86451782D01*
X172411782Y-86331995D01*
X172552637Y-86237878D01*
X172709147Y-86173049D01*
X172792222Y-86156524D01*
X172875296Y-86140000D01*
X173044704Y-86140000D01*
X173127778Y-86156524D01*
G37*
G36*
X176360000Y-87860000D02*
G01*
X174640000Y-87860000D01*
X174640000Y-86140000D01*
X176360000Y-86140000D01*
X176360000Y-87860000D01*
G37*
G36*
X170587778Y-86156524D02*
G01*
X170670853Y-86173049D01*
X170827363Y-86237878D01*
X170968218Y-86331995D01*
X171088005Y-86451782D01*
X171182122Y-86592637D01*
X171246951Y-86749147D01*
X171280000Y-86915297D01*
X171280000Y-87084703D01*
X171246951Y-87250853D01*
X171182122Y-87407363D01*
X171088005Y-87548218D01*
X170968218Y-87668005D01*
X170827363Y-87762122D01*
X170670853Y-87826951D01*
X170587778Y-87843475D01*
X170504704Y-87860000D01*
X170335296Y-87860000D01*
X170252222Y-87843475D01*
X170169147Y-87826951D01*
X170012637Y-87762122D01*
X169871782Y-87668005D01*
X169751995Y-87548218D01*
X169657878Y-87407363D01*
X169593049Y-87250853D01*
X169560000Y-87084703D01*
X169560000Y-86915297D01*
X169593049Y-86749147D01*
X169657878Y-86592637D01*
X169751995Y-86451782D01*
X169871782Y-86331995D01*
X170012637Y-86237878D01*
X170169147Y-86173049D01*
X170252222Y-86156524D01*
X170335296Y-86140000D01*
X170504704Y-86140000D01*
X170587778Y-86156524D01*
G37*
G36*
X166440000Y-87860000D02*
G01*
X164720000Y-87860000D01*
X164720000Y-86140000D01*
X166440000Y-86140000D01*
X166440000Y-87860000D01*
G37*
G36*
X163207778Y-86156524D02*
G01*
X163290853Y-86173049D01*
X163447363Y-86237878D01*
X163588218Y-86331995D01*
X163708005Y-86451782D01*
X163802122Y-86592637D01*
X163866951Y-86749147D01*
X163900000Y-86915297D01*
X163900000Y-87084703D01*
X163866951Y-87250853D01*
X163802122Y-87407363D01*
X163708005Y-87548218D01*
X163588218Y-87668005D01*
X163447363Y-87762122D01*
X163290853Y-87826951D01*
X163207778Y-87843475D01*
X163124704Y-87860000D01*
X162955296Y-87860000D01*
X162872222Y-87843475D01*
X162789147Y-87826951D01*
X162632637Y-87762122D01*
X162491782Y-87668005D01*
X162371995Y-87548218D01*
X162277878Y-87407363D01*
X162213049Y-87250853D01*
X162180000Y-87084703D01*
X162180000Y-86915297D01*
X162213049Y-86749147D01*
X162277878Y-86592637D01*
X162371995Y-86451782D01*
X162491782Y-86331995D01*
X162632637Y-86237878D01*
X162789147Y-86173049D01*
X162872222Y-86156524D01*
X162955296Y-86140000D01*
X163124704Y-86140000D01*
X163207778Y-86156524D01*
G37*
G36*
X160667778Y-86156524D02*
G01*
X160750853Y-86173049D01*
X160907363Y-86237878D01*
X161048218Y-86331995D01*
X161168005Y-86451782D01*
X161262122Y-86592637D01*
X161326951Y-86749147D01*
X161360000Y-86915297D01*
X161360000Y-87084703D01*
X161326951Y-87250853D01*
X161262122Y-87407363D01*
X161168005Y-87548218D01*
X161048218Y-87668005D01*
X160907363Y-87762122D01*
X160750853Y-87826951D01*
X160667778Y-87843475D01*
X160584704Y-87860000D01*
X160415296Y-87860000D01*
X160332222Y-87843475D01*
X160249147Y-87826951D01*
X160092637Y-87762122D01*
X159951782Y-87668005D01*
X159831995Y-87548218D01*
X159737878Y-87407363D01*
X159673049Y-87250853D01*
X159640000Y-87084703D01*
X159640000Y-86915297D01*
X159673049Y-86749147D01*
X159737878Y-86592637D01*
X159831995Y-86451782D01*
X159951782Y-86331995D01*
X160092637Y-86237878D01*
X160249147Y-86173049D01*
X160332222Y-86156524D01*
X160415296Y-86140000D01*
X160584704Y-86140000D01*
X160667778Y-86156524D01*
G37*
G36*
X158127778Y-86156524D02*
G01*
X158210853Y-86173049D01*
X158367363Y-86237878D01*
X158508218Y-86331995D01*
X158628005Y-86451782D01*
X158722122Y-86592637D01*
X158786951Y-86749147D01*
X158820000Y-86915297D01*
X158820000Y-87084703D01*
X158786951Y-87250853D01*
X158722122Y-87407363D01*
X158628005Y-87548218D01*
X158508218Y-87668005D01*
X158367363Y-87762122D01*
X158210853Y-87826951D01*
X158127778Y-87843475D01*
X158044704Y-87860000D01*
X157875296Y-87860000D01*
X157792222Y-87843475D01*
X157709147Y-87826951D01*
X157552637Y-87762122D01*
X157411782Y-87668005D01*
X157291995Y-87548218D01*
X157197878Y-87407363D01*
X157133049Y-87250853D01*
X157100000Y-87084703D01*
X157100000Y-86915297D01*
X157133049Y-86749147D01*
X157197878Y-86592637D01*
X157291995Y-86451782D01*
X157411782Y-86331995D01*
X157552637Y-86237878D01*
X157709147Y-86173049D01*
X157792222Y-86156524D01*
X157875296Y-86140000D01*
X158044704Y-86140000D01*
X158127778Y-86156524D01*
G37*
G36*
X172254095Y-79420935D02*
G01*
X172409620Y-79451871D01*
X172702621Y-79573237D01*
X172966315Y-79749431D01*
X173190569Y-79973685D01*
X173366763Y-80237379D01*
X173488129Y-80530380D01*
X173550000Y-80841429D01*
X173550000Y-81158571D01*
X173488129Y-81469620D01*
X173366763Y-81762621D01*
X173190569Y-82026315D01*
X172966315Y-82250569D01*
X172702621Y-82426763D01*
X172409620Y-82548129D01*
X172254096Y-82579064D01*
X172098572Y-82610000D01*
X171781428Y-82610000D01*
X171625904Y-82579064D01*
X171470380Y-82548129D01*
X171177379Y-82426763D01*
X170913685Y-82250569D01*
X170689431Y-82026315D01*
X170513237Y-81762621D01*
X170391871Y-81469620D01*
X170330000Y-81158571D01*
X170330000Y-80841429D01*
X170391871Y-80530380D01*
X170513237Y-80237379D01*
X170689431Y-79973685D01*
X170913685Y-79749431D01*
X171177379Y-79573237D01*
X171470380Y-79451871D01*
X171625905Y-79420935D01*
X171781428Y-79390000D01*
X172098572Y-79390000D01*
X172254095Y-79420935D01*
G37*
G36*
X128374095Y-79420935D02*
G01*
X128529620Y-79451871D01*
X128822621Y-79573237D01*
X129086315Y-79749431D01*
X129310569Y-79973685D01*
X129486763Y-80237379D01*
X129608129Y-80530380D01*
X129670000Y-80841429D01*
X129670000Y-81158571D01*
X129608129Y-81469620D01*
X129486763Y-81762621D01*
X129310569Y-82026315D01*
X129086315Y-82250569D01*
X128822621Y-82426763D01*
X128529620Y-82548129D01*
X128374096Y-82579064D01*
X128218572Y-82610000D01*
X127901428Y-82610000D01*
X127745904Y-82579064D01*
X127590380Y-82548129D01*
X127297379Y-82426763D01*
X127033685Y-82250569D01*
X126809431Y-82026315D01*
X126633237Y-81762621D01*
X126511871Y-81469620D01*
X126450000Y-81158571D01*
X126450000Y-80841429D01*
X126511871Y-80530380D01*
X126633237Y-80237379D01*
X126809431Y-79973685D01*
X127033685Y-79749431D01*
X127297379Y-79573237D01*
X127590380Y-79451871D01*
X127745905Y-79420935D01*
X127901428Y-79390000D01*
X128218572Y-79390000D01*
X128374095Y-79420935D01*
G37*
M02*
