(module LOGO (layer F.Cu)
  (at 0 0)
 (fp_text reference "G***" (at 0 0) (layer F.SilkS) hide
  (effects (font (thickness 0.3)))
  )
  (fp_text value "LOGO" (at 0.75 0) (layer F.SilkS) hide
  (effects (font (thickness 0.3)))
  )
  (fp_poly (pts (xy -5.345479 -1.890055) (xy -5.336989 -1.885904) (xy -5.329310 -1.874566) (xy -5.313917 -1.846529) (xy -5.292064 -1.804267) (xy -5.265003 -1.750255) (xy -5.233987 -1.686967) (xy -5.200268 -1.616879)
     (xy -5.191767 -1.599013) (xy -5.059430 -1.320310) (xy -5.065865 -1.258740) (xy -5.068045 -1.225118) (xy -5.065700 -1.195646) (xy -5.057462 -1.163038) (xy -5.041960 -1.120011) (xy -5.037757 -1.109231)
     (xy -5.015373 -1.056388) (xy -4.988625 -0.999203) (xy -4.962950 -0.949251) (xy -4.960662 -0.945119) (xy -4.918112 -0.868946) (xy -4.472535 -0.666903) (xy -4.366551 -0.618778) (xy -4.278018 -0.578305)
     (xy -4.205085 -0.544458) (xy -4.145899 -0.516209) (xy -4.098608 -0.492530) (xy -4.061357 -0.472393) (xy -4.032296 -0.454770) (xy -4.009571 -0.438634) (xy -3.991330 -0.422958) (xy -3.975720 -0.406712)
     (xy -3.960889 -0.388870) (xy -3.952875 -0.378628) (xy -3.930977 -0.360098) (xy -3.902441 -0.347664) (xy -3.874011 -0.342816) (xy -3.852430 -0.347046) (xy -3.845445 -0.354886) (xy -3.849589 -0.367220)
     (xy -3.864182 -0.395400) (xy -3.888111 -0.437541) (xy -3.920262 -0.491759) (xy -3.959522 -0.556171) (xy -4.004777 -0.628891) (xy -4.044436 -0.691604) (xy -4.102936 -0.782992) (xy -4.151497 -0.857670)
     (xy -4.191114 -0.917054) (xy -4.222777 -0.962558) (xy -4.247480 -0.995600) (xy -4.266216 -1.017594) (xy -4.279977 -1.029955) (xy -4.283039 -1.031864) (xy -4.333074 -1.068758) (xy -4.367858 -1.117793)
     (xy -4.375695 -1.134848) (xy -4.384865 -1.159263) (xy -4.385094 -1.175964) (xy -4.374493 -1.193549) (xy -4.358752 -1.211976) (xy -4.340137 -1.237012) (xy -4.333430 -1.254765) (xy -4.334947 -1.259055)
     (xy -4.347259 -1.264367) (xy -4.377160 -1.274718) (xy -4.421913 -1.289237) (xy -4.478781 -1.307054) (xy -4.545028 -1.327298) (xy -4.617917 -1.349099) (xy -4.619625 -1.349605) (xy -4.693200 -1.371529)
     (xy -4.760727 -1.391947) (xy -4.819353 -1.409973) (xy -4.866227 -1.424721) (xy -4.898494 -1.435303) (xy -4.913303 -1.440835) (xy -4.913312 -1.440840) (xy -4.928036 -1.459544) (xy -4.931833 -1.482039)
     (xy -4.931936 -1.492708) (xy -4.930782 -1.501003) (xy -4.926177 -1.506916) (xy -4.915925 -1.510438) (xy -4.897833 -1.511561) (xy -4.869705 -1.510275) (xy -4.829348 -1.506573) (xy -4.774565 -1.500446)
     (xy -4.703164 -1.491885) (xy -4.612948 -1.480881) (xy -4.612226 -1.480793) (xy -4.511762 -1.467999) (xy -4.430205 -1.456325) (xy -4.365351 -1.445394) (xy -4.314994 -1.434825) (xy -4.276927 -1.424238)
     (xy -4.270375 -1.422008) (xy -4.223769 -1.407879) (xy -4.166855 -1.393952) (xy -4.110360 -1.382797) (xy -4.098689 -1.380914) (xy -4.049822 -1.374059) (xy -4.015616 -1.371321) (xy -3.989966 -1.372709)
     (xy -3.966770 -1.378235) (xy -3.958076 -1.381157) (xy -3.944315 -1.385492) (xy -3.930033 -1.388096) (xy -3.912562 -1.388594) (xy -3.889235 -1.386612) (xy -3.857385 -1.381777) (xy -3.814346 -1.373714)
     (xy -3.757449 -1.362050) (xy -3.684028 -1.346409) (xy -3.635209 -1.335885) (xy -3.551856 -1.317818) (xy -3.486803 -1.303431) (xy -3.437650 -1.291983) (xy -3.401995 -1.282736) (xy -3.377439 -1.274951)
     (xy -3.361580 -1.267887) (xy -3.352019 -1.260805) (xy -3.346355 -1.252966) (xy -3.343127 -1.245921) (xy -3.336249 -1.223289) (xy -3.336896 -1.210410) (xy -3.348643 -1.209875) (xy -3.378480 -1.211552)
     (xy -3.423474 -1.215188) (xy -3.480692 -1.220531) (xy -3.547200 -1.227328) (xy -3.600258 -1.233099) (xy -3.683402 -1.242565) (xy -3.748675 -1.250592) (xy -3.799274 -1.257762) (xy -3.838399 -1.264658)
     (xy -3.869247 -1.271863) (xy -3.895016 -1.279960) (xy -3.918906 -1.289533) (xy -3.925235 -1.292350) (xy -3.963193 -1.307893) (xy -3.996905 -1.318898) (xy -4.018437 -1.322916) (xy -4.035172 -1.321869)
     (xy -4.038004 -1.314921) (xy -4.028339 -1.296361) (xy -4.025972 -1.292346) (xy -4.012924 -1.261355) (xy -4.017552 -1.240866) (xy -4.040629 -1.229768) (xy -4.071605 -1.226923) (xy -4.099960 -1.225607)
     (xy -4.108928 -1.222410) (xy -4.101041 -1.217083) (xy -4.074148 -1.209870) (xy -4.049785 -1.207244) (xy -4.019695 -1.206500) (xy -4.064355 -1.153159) (xy -4.086409 -1.125850) (xy -4.101027 -1.105858)
     (xy -4.105028 -1.097597) (xy -4.093775 -1.091815) (xy -4.071713 -1.080711) (xy -4.069291 -1.079500) (xy -4.055847 -1.068871) (xy -4.035996 -1.046733) (xy -4.008885 -1.011922) (xy -3.973659 -0.963273)
     (xy -3.929465 -0.899622) (xy -3.875448 -0.819803) (xy -3.840379 -0.767291) (xy -3.781055 -0.678738) (xy -3.732214 -0.607221) (xy -3.693165 -0.551798) (xy -3.663220 -0.511528) (xy -3.641688 -0.485469)
     (xy -3.627880 -0.472679) (xy -3.623420 -0.470958) (xy -3.603925 -0.466229) (xy -3.573251 -0.453940) (xy -3.544045 -0.439801) (xy -3.484466 -0.408644) (xy -3.431841 -0.452704) (xy -3.402161 -0.478297)
     (xy -3.377845 -0.500587) (xy -3.365770 -0.512966) (xy -3.341470 -0.527120) (xy -3.308753 -0.526340) (xy -3.273524 -0.511281) (xy -3.259816 -0.501210) (xy -3.226591 -0.473253) (xy -3.175493 -0.497185)
     (xy -3.144719 -0.509984) (xy -3.121090 -0.516908) (xy -3.113036 -0.517205) (xy -3.097609 -0.507803) (xy -3.070485 -0.487438) (xy -3.035322 -0.459234) (xy -2.995777 -0.426313) (xy -2.955509 -0.391797)
     (xy -2.918173 -0.358811) (xy -2.887429 -0.330476) (xy -2.866933 -0.309917) (xy -2.860550 -0.301625) (xy -2.856299 -0.278348) (xy -2.856906 -0.245280) (xy -2.858415 -0.232833) (xy -2.861533 -0.202491)
     (xy -2.857028 -0.181553) (xy -2.841674 -0.160404) (xy -2.829852 -0.147720) (xy -2.808709 -0.122015) (xy -2.795832 -0.099424) (xy -2.794000 -0.091659) (xy -2.798889 -0.074112) (xy -2.811879 -0.043944)
     (xy -2.830453 -0.006846) (xy -2.836333 0.004047) (xy -2.855793 0.040294) (xy -2.870535 0.069253) (xy -2.878137 0.086115) (xy -2.878666 0.088185) (xy -2.872126 0.099302) (xy -2.855291 0.120479)
     (xy -2.839808 0.138200) (xy -2.817542 0.166514) (xy -2.802701 0.192336) (xy -2.799283 0.203847) (xy -2.796456 0.211005) (xy -2.787761 0.219505) (xy -2.771375 0.230242) (xy -2.745478 0.244108)
     (xy -2.708246 0.261996) (xy -2.657858 0.284800) (xy -2.592493 0.313413) (xy -2.510328 0.348729) (xy -2.460214 0.370100) (xy -2.368787 0.409160) (xy -2.295047 0.441062) (xy -2.237115 0.466732)
     (xy -2.193115 0.487092) (xy -2.161169 0.503067) (xy -2.139400 0.515581) (xy -2.125931 0.525559) (xy -2.118885 0.533925) (xy -2.116801 0.539179) (xy -2.108488 0.559662) (xy -2.100500 0.567304)
     (xy -2.089499 0.560916) (xy -2.069184 0.541577) (xy -2.043313 0.512986) (xy -2.034027 0.501943) (xy -2.000904 0.464310) (xy -1.975433 0.442815) (xy -1.953834 0.435781) (xy -1.932330 0.441530)
     (xy -1.917938 0.450392) (xy -1.900976 0.460860) (xy -1.895054 0.457524) (xy -1.894416 0.446823) (xy -1.900275 0.428159) (xy -1.915561 0.399254) (xy -1.934836 0.369494) (xy -1.949418 0.346685)
     (xy -1.963611 0.319258) (xy -1.978514 0.284330) (xy -1.995226 0.239019) (xy -2.014844 0.180445) (xy -2.038469 0.105724) (xy -2.051486 0.063500) (xy -2.072646 -0.006341) (xy -2.091530 -0.070218)
     (xy -2.107283 -0.125109) (xy -2.119050 -0.167994) (xy -2.125975 -0.195852) (xy -2.127483 -0.204876) (xy -2.123599 -0.218226) (xy -2.108518 -0.219585) (xy -2.098146 -0.217357) (xy -2.074675 -0.209747)
     (xy -2.062610 -0.202980) (xy -2.056936 -0.191622) (xy -2.044321 -0.163405) (xy -2.025927 -0.121026) (xy -2.002916 -0.067182) (xy -1.976449 -0.004569) (xy -1.952359 0.052917) (xy -1.920300 0.130055)
     (xy -1.895632 0.190586) (xy -1.877426 0.237369) (xy -1.864756 0.273261) (xy -1.856693 0.301119) (xy -1.852312 0.323801) (xy -1.850683 0.344165) (xy -1.850880 0.365068) (xy -1.850897 0.365518)
     (xy -1.845725 0.429161) (xy -1.827195 0.501821) (xy -1.797113 0.577753) (xy -1.764994 0.638598) (xy -1.751490 0.665962) (xy -1.733423 0.709326) (xy -1.712409 0.764445) (xy -1.690066 0.827075)
     (xy -1.668009 0.892970) (xy -1.667583 0.894292) (xy -1.602672 1.095375) (xy -1.428399 1.098754) (xy -1.356553 1.099474) (xy -1.271772 1.099260) (xy -1.182262 1.098195) (xy -1.096230 1.096361)
     (xy -1.050396 1.094951) (xy -0.846666 1.087771) (xy -0.846666 0.084210) (xy -0.643285 0.087084) (xy -0.439904 0.089959) (xy -0.074431 0.559759) (xy 0.291042 1.029560) (xy 0.293797 0.557113)
     (xy 0.296551 0.084667) (xy 0.698500 0.084667) (xy 0.698500 1.629834) (xy 0.297638 1.629834) (xy -0.070785 1.154946) (xy -0.439208 0.680059) (xy -0.441962 1.154946) (xy -0.444716 1.629834)
     (xy -0.846666 1.629834) (xy -0.846666 1.388181) (xy -0.846874 1.318853) (xy -0.847457 1.256861) (xy -0.848352 1.205252) (xy -0.849501 1.167073) (xy -0.850840 1.145370) (xy -0.851620 1.141574)
     (xy -0.863280 1.141356) (xy -0.891989 1.144109) (xy -0.933911 1.149376) (xy -0.985208 1.156702) (xy -1.007724 1.160142) (xy -1.071094 1.169576) (xy -1.147988 1.180364) (xy -1.230895 1.191487)
     (xy -1.312306 1.201932) (xy -1.357991 1.207532) (xy -1.557107 1.231400) (xy -1.550321 1.258440) (xy -1.544488 1.282921) (xy -1.541704 1.296261) (xy -1.549632 1.304458) (xy -1.571408 1.310046)
     (xy -1.574234 1.310355) (xy -1.598245 1.309855) (xy -1.614898 1.299251) (xy -1.630946 1.275783) (xy -1.653299 1.237896) (xy -1.718295 1.244425) (xy -1.748142 1.246890) (xy -1.794994 1.250104)
     (xy -1.854713 1.253814) (xy -1.923163 1.257768) (xy -1.996204 1.261711) (xy -2.023684 1.263123) (xy -2.264077 1.275292) (xy -2.213445 1.344084) (xy -2.190833 1.373184) (xy -2.168970 1.395965)
     (xy -2.144368 1.414067) (xy -2.113541 1.429132) (xy -2.073000 1.442802) (xy -2.019261 1.456720) (xy -1.948834 1.472526) (xy -1.933742 1.475778) (xy -1.882179 1.486477) (xy -1.845430 1.492626)
     (xy -1.817705 1.494533) (xy -1.793218 1.492509) (xy -1.766179 1.486863) (xy -1.759117 1.485117) (xy -1.698625 1.469946) (xy -1.397000 1.550337) (xy -1.296144 1.577724) (xy -1.214124 1.601090)
     (xy -1.151356 1.620305) (xy -1.108258 1.635239) (xy -1.085247 1.645762) (xy -1.081840 1.648597) (xy -1.071548 1.672009) (xy -1.076066 1.689980) (xy -1.093653 1.696496) (xy -1.095636 1.696336)
     (xy -1.111490 1.694501) (xy -1.145327 1.690517) (xy -1.194112 1.684745) (xy -1.254810 1.677544) (xy -1.324385 1.669273) (xy -1.391708 1.661256) (xy -1.666875 1.628466) (xy -1.737784 1.586658)
     (xy -1.793218 1.556934) (xy -1.836123 1.540289) (xy -1.865334 1.537073) (xy -1.878295 1.544768) (xy -1.877771 1.560972) (xy -1.867741 1.577157) (xy -1.855219 1.603555) (xy -1.858503 1.630998)
     (xy -1.875644 1.651724) (xy -1.887783 1.656901) (xy -1.922563 1.656017) (xy -1.963542 1.640071) (xy -2.005114 1.611571) (xy -2.020158 1.597714) (xy -2.055301 1.562570) (xy -2.088630 1.600529)
     (xy -2.111392 1.623963) (xy -2.130641 1.639584) (xy -2.136545 1.642550) (xy -2.141008 1.651222) (xy -2.131005 1.667963) (xy -2.110007 1.689599) (xy -2.081481 1.712959) (xy -2.048898 1.734869)
     (xy -2.017578 1.751348) (xy -1.986314 1.766467) (xy -1.964715 1.779385) (xy -1.957916 1.786394) (xy -1.964933 1.803353) (xy -1.982609 1.828361) (xy -2.005890 1.855289) (xy -2.029717 1.878009)
     (xy -2.039721 1.885527) (xy -2.066006 1.899908) (xy -2.089782 1.903273) (xy -2.118886 1.895600) (xy -2.143125 1.885255) (xy -2.189979 1.854788) (xy -2.236123 1.808233) (xy -2.277185 1.750350)
     (xy -2.292364 1.722818) (xy -2.313437 1.684982) (xy -2.341194 1.640162) (xy -2.350930 1.625734) (xy -2.176529 1.625734) (xy -2.174875 1.629834) (xy -2.165365 1.639930) (xy -2.163667 1.640417)
     (xy -2.159121 1.632229) (xy -2.159000 1.629834) (xy -2.167136 1.619657) (xy -2.170208 1.619250) (xy -2.176529 1.625734) (xy -2.350930 1.625734) (xy -2.368797 1.599259) (xy -2.385334 1.576233)
     (xy -2.400009 1.557785) (xy -2.415588 1.542397) (xy -2.434840 1.528549) (xy -2.460533 1.514723) (xy -2.495433 1.499400) (xy -2.542310 1.481061) (xy -2.603930 1.458187) (xy -2.669646 1.434161)
     (xy -2.836333 1.373272) (xy -2.836333 1.337511) (xy -2.835742 1.319925) (xy -2.831669 1.308741) (xy -2.820668 1.303418) (xy -2.799291 1.303417) (xy -2.764090 1.308199) (xy -2.711619 1.317223)
     (xy -2.709333 1.317625) (xy -2.664191 1.324979) (xy -2.623693 1.330522) (xy -2.594892 1.333321) (xy -2.589732 1.333486) (xy -2.560089 1.333500) (xy -2.587315 1.297806) (xy -2.601091 1.280956)
     (xy -2.614726 1.270057) (xy -2.633403 1.263324) (xy -2.662306 1.258970) (xy -2.706618 1.255210) (xy -2.712208 1.254790) (xy -2.847546 1.241622) (xy -2.985817 1.222583) (xy -3.121862 1.198648)
     (xy -3.250524 1.170790) (xy -3.366644 1.139984) (xy -3.434291 1.118377) (xy -3.560853 1.068090) (xy -3.669740 1.011382) (xy -3.760202 0.948776) (xy -3.831489 0.880798) (xy -3.882851 0.807972)
     (xy -3.885663 0.802740) (xy -3.902519 0.755091) (xy -3.910369 0.698414) (xy -3.909038 0.640810) (xy -3.898355 0.590380) (xy -3.890590 0.572444) (xy -3.871196 0.536347) (xy -3.838736 0.596841)
     (xy -3.791535 0.664518) (xy -3.724999 0.728990) (xy -3.640869 0.789023) (xy -3.540884 0.843382) (xy -3.426786 0.890833) (xy -3.421750 0.892642) (xy -3.370745 0.909262) (xy -3.308258 0.927120)
     (xy -3.237752 0.945471) (xy -3.162692 0.963572) (xy -3.086543 0.980678) (xy -3.012767 0.996043) (xy -2.944829 1.008925) (xy -2.886193 1.018579) (xy -2.840324 1.024259) (xy -2.810685 1.025223)
     (xy -2.806910 1.024767) (xy -2.802250 1.021046) (xy -2.803776 1.011179) (xy -2.812627 0.993316) (xy -2.829942 0.965608) (xy -2.856860 0.926206) (xy -2.894522 0.873259) (xy -2.932934 0.820209)
     (xy -2.974322 0.762788) (xy -3.011192 0.710628) (xy -3.041794 0.666284) (xy -3.064380 0.632312) (xy -3.077203 0.611270) (xy -3.079484 0.605896) (xy -3.082770 0.594622) (xy -3.092931 0.596382)
     (xy -3.111473 0.612346) (xy -3.139899 0.643681) (xy -3.162125 0.670107) (xy -3.197046 0.710301) (xy -3.224747 0.736603) (xy -3.249715 0.752759) (xy -3.270951 0.760960) (xy -3.300462 0.768397)
     (xy -3.319592 0.767244) (xy -3.337785 0.756328) (xy -3.343256 0.751966) (xy -3.370063 0.733581) (xy -3.404915 0.713842) (xy -3.418416 0.707157) (xy -3.440584 0.693811) (xy -3.475054 0.669405)
     (xy -3.519479 0.635893) (xy -3.571512 0.595226) (xy -3.628806 0.549357) (xy -3.689014 0.500239) (xy -3.749788 0.449824) (xy -3.756320 0.444314) (xy -2.908413 0.444314) (xy -2.905920 0.460089)
     (xy -2.895003 0.486057) (xy -2.879245 0.514979) (xy -2.862230 0.539614) (xy -2.859875 0.542396) (xy -2.837497 0.557356) (xy -2.821173 0.560917) (xy -2.795141 0.566930) (xy -2.775626 0.577085)
     (xy -2.763529 0.589737) (xy -2.741054 0.617264) (xy -2.710041 0.657258) (xy -2.672327 0.707307) (xy -2.629752 0.765003) (xy -2.584152 0.827933) (xy -2.581873 0.831109) (xy -2.522026 0.913497)
     (xy -2.472705 0.979204) (xy -2.434124 1.027957) (xy -2.406501 1.059486) (xy -2.390051 1.073520) (xy -2.388288 1.074168) (xy -2.368438 1.076683) (xy -2.330987 1.079640) (xy -2.279492 1.082872)
     (xy -2.217510 1.086213) (xy -2.148598 1.089498) (xy -2.076312 1.092561) (xy -2.004210 1.095236) (xy -1.935848 1.097357) (xy -1.874784 1.098759) (xy -1.853895 1.099073) (xy -1.723416 1.100667)
     (xy -1.810273 0.933979) (xy -1.838913 0.879438) (xy -1.864653 0.831209) (xy -1.885729 0.792534) (xy -1.900380 0.766652) (xy -1.906490 0.757105) (xy -1.918624 0.758041) (xy -1.938733 0.775334)
     (xy -1.948237 0.786209) (xy -1.978687 0.815453) (xy -2.006650 0.825478) (xy -2.008028 0.825500) (xy -2.037374 0.818931) (xy -2.073964 0.802234) (xy -2.109761 0.779924) (xy -2.136726 0.756519)
     (xy -2.141506 0.750517) (xy -2.154117 0.742170) (xy -2.183342 0.727660) (xy -2.226618 0.708011) (xy -2.281379 0.684246) (xy -2.345060 0.657391) (xy -2.415097 0.628468) (xy -2.488925 0.598501)
     (xy -2.563980 0.568516) (xy -2.637697 0.539535) (xy -2.707510 0.512583) (xy -2.770856 0.488684) (xy -2.825169 0.468862) (xy -2.867886 0.454140) (xy -2.896441 0.445544) (xy -2.908269 0.444096)
     (xy -2.908413 0.444314) (xy -3.756320 0.444314) (xy -3.808782 0.400064) (xy -3.863649 0.352913) (xy -3.912041 0.310323) (xy -3.951611 0.274246) (xy -3.980012 0.246634) (xy -3.994897 0.229441)
     (xy -3.996469 0.226287) (xy -4.007750 0.205037) (xy -4.029586 0.178414) (xy -4.044030 0.164219) (xy -4.068176 0.140879) (xy -4.079351 0.122942) (xy -4.080973 0.102421) (xy -4.078498 0.083732)
     (xy -4.069044 0.055477) (xy -4.050283 0.018352) (xy -4.026203 -0.021299) (xy -4.000794 -0.057131) (xy -3.978043 -0.082802) (xy -3.969634 -0.089412) (xy -3.958509 -0.102904) (xy -3.963241 -0.113349)
     (xy -3.977171 -0.113915) (xy -3.990954 -0.117235) (xy -4.021856 -0.129039) (xy -4.067990 -0.148495) (xy -4.127470 -0.174767) (xy -4.198411 -0.207021) (xy -4.278925 -0.244423) (xy -4.367128 -0.286137)
     (xy -4.376692 -0.290702) (xy -4.459910 -0.330203) (xy -4.537017 -0.366326) (xy -4.605970 -0.398149) (xy -4.664726 -0.424750) (xy -4.711242 -0.445208) (xy -4.743474 -0.458602) (xy -4.759379 -0.464010)
     (xy -4.760701 -0.463875) (xy -4.758785 -0.450945) (xy -4.750878 -0.422664) (xy -4.738325 -0.383537) (xy -4.726305 -0.348750) (xy -4.710742 -0.304101) (xy -4.698279 -0.266658) (xy -4.690408 -0.241013)
     (xy -4.688417 -0.232228) (xy -4.697701 -0.225547) (xy -4.720437 -0.222307) (xy -4.724286 -0.222250) (xy -4.737143 -0.222803) (xy -4.748219 -0.226110) (xy -4.759415 -0.234636) (xy -4.772632 -0.250851)
     (xy -4.789773 -0.277222) (xy -4.812739 -0.316218) (xy -4.843432 -0.370305) (xy -4.857130 -0.394643) (xy -4.954105 -0.567035) (xy -5.083198 -0.626599) (xy -5.136385 -0.650752) (xy -5.187641 -0.673346)
     (xy -5.231364 -0.691952) (xy -5.261953 -0.704145) (xy -5.263538 -0.704725) (xy -5.283381 -0.714375) (xy -4.857750 -0.714375) (xy -4.852458 -0.709083) (xy -4.847166 -0.714375) (xy -4.852458 -0.719666)
     (xy -4.857750 -0.714375) (xy -5.283381 -0.714375) (xy -5.300687 -0.722791) (xy -5.341083 -0.749262) (xy -5.364080 -0.767917) (xy -5.391599 -0.794342) (xy -5.406420 -0.814783) (xy -5.412388 -0.836459)
     (xy -5.412808 -0.846666) (xy -5.132916 -0.846666) (xy -5.126128 -0.829288) (xy -5.116669 -0.825500) (xy -5.106133 -0.829159) (xy -5.110126 -0.843552) (xy -5.111750 -0.846666) (xy -5.122529 -0.863290)
     (xy -5.127997 -0.867833) (xy -5.132000 -0.858930) (xy -5.132916 -0.846666) (xy -5.412808 -0.846666) (xy -5.413375 -0.860445) (xy -5.407222 -0.898639) (xy -5.391175 -0.938009) (xy -5.368850 -0.972572)
     (xy -5.343862 -0.996346) (xy -5.327011 -1.003325) (xy -5.310207 -1.012416) (xy -5.284623 -1.033838) (xy -5.254905 -1.063557) (xy -5.244748 -1.074762) (xy -5.205497 -1.115208) (xy -5.174183 -1.137847)
     (xy -5.148872 -1.143595) (xy -5.127627 -1.133366) (xy -5.125372 -1.131222) (xy -5.108827 -1.124595) (xy -5.102127 -1.126531) (xy -5.097907 -1.140923) (xy -5.109234 -1.168766) (xy -5.135803 -1.209484)
     (xy -5.169478 -1.252974) (xy -5.184036 -1.271789) (xy -5.197005 -1.291442) (xy -5.209502 -1.314662) (xy -5.222645 -1.344177) (xy -5.237551 -1.382713) (xy -5.255335 -1.433000) (xy -5.277116 -1.497765)
     (xy -5.304009 -1.579736) (xy -5.306900 -1.588608) (xy -5.330618 -1.661908) (xy -5.352018 -1.728971) (xy -5.370251 -1.787065) (xy -5.384470 -1.833461) (xy -5.393829 -1.865427) (xy -5.397480 -1.880232)
     (xy -5.397500 -1.880586) (xy -5.388798 -1.890673) (xy -5.368535 -1.894086) (xy -5.345479 -1.890055) )(layer F.SilkS) (width  0.010000)
  )
  (fp_poly (pts (xy 1.354876 0.521229) (xy 1.355301 0.658649) (xy 1.356584 0.776664) (xy 1.358950 0.877026) (xy 1.362625 0.961490) (xy 1.367836 1.031807) (xy 1.374807 1.089730) (xy 1.383763 1.137011)
     (xy 1.394932 1.175404) (xy 1.408538 1.206660) (xy 1.424808 1.232533) (xy 1.443966 1.254775) (xy 1.450092 1.260794) (xy 1.501007 1.295475) (xy 1.562319 1.315854) (xy 1.629090 1.322220)
     (xy 1.696385 1.314863) (xy 1.759266 1.294073) (xy 1.812796 1.260140) (xy 1.834616 1.238212) (xy 1.851467 1.214167) (xy 1.865939 1.183992) (xy 1.878192 1.146124) (xy 1.888385 1.099000)
     (xy 1.896674 1.041058) (xy 1.903220 0.970735) (xy 1.908180 0.886468) (xy 1.911713 0.786693) (xy 1.913977 0.669849) (xy 1.915131 0.534373) (xy 1.915357 0.441854) (xy 1.915584 0.084667)
     (xy 2.307167 0.084667) (xy 2.307167 0.601864) (xy 2.307004 0.736826) (xy 2.306411 0.852548) (xy 2.305228 0.950956) (xy 2.303296 1.033973) (xy 2.300458 1.103526) (xy 2.296554 1.161538)
     (xy 2.291427 1.209936) (xy 2.284916 1.250643) (xy 2.276864 1.285586) (xy 2.267112 1.316689) (xy 2.255501 1.345877) (xy 2.243762 1.371214) (xy 2.203939 1.434623) (xy 2.149012 1.496427)
     (xy 2.084693 1.551192) (xy 2.016695 1.593484) (xy 2.003322 1.599893) (xy 1.904192 1.635442) (xy 1.792479 1.658993) (xy 1.673447 1.669928) (xy 1.552360 1.667628) (xy 1.486959 1.660522)
     (xy 1.365491 1.634948) (xy 1.259666 1.595139) (xy 1.169499 1.541106) (xy 1.095001 1.472859) (xy 1.036189 1.390408) (xy 0.993074 1.293764) (xy 0.992197 1.291167) (xy 0.987154 1.275490)
     (xy 0.982889 1.259796) (xy 0.979323 1.242208) (xy 0.976376 1.220849) (xy 0.973972 1.193842) (xy 0.972030 1.159311) (xy 0.970472 1.115379) (xy 0.969219 1.060170) (xy 0.968193 0.991806)
     (xy 0.967315 0.908410) (xy 0.966506 0.808107) (xy 0.965687 0.689019) (xy 0.965455 0.653521) (xy 0.961757 0.084667) (xy 1.354667 0.084667) (xy 1.354876 0.521229) )(layer F.SilkS) (width  0.010000)
  )
  (fp_poly (pts (xy 3.754438 0.849594) (xy 3.800150 0.970968) (xy 3.843629 1.086600) (xy 3.884306 1.194962) (xy 3.921611 1.294528) (xy 3.954972 1.383768) (xy 3.983820 1.461157) (xy 4.007586 1.525165)
     (xy 4.025697 1.574265) (xy 4.037586 1.606930) (xy 4.042680 1.621631) (xy 4.042834 1.622286) (xy 4.032780 1.624587) (xy 4.004739 1.626605) (xy 3.961888 1.628226) (xy 3.907406 1.629336)
     (xy 3.844470 1.629821) (xy 3.832495 1.629834) (xy 3.622157 1.629834) (xy 3.582046 1.521354) (xy 3.564078 1.473661) (xy 3.547249 1.430581) (xy 3.533788 1.397737) (xy 3.527439 1.383596)
     (xy 3.512942 1.354317) (xy 3.236891 1.357138) (xy 2.960841 1.359959) (xy 2.907355 1.494896) (xy 2.853870 1.629834) (xy 2.644018 1.629834) (xy 2.579977 1.629500) (xy 2.523821 1.628569)
     (xy 2.478732 1.627146) (xy 2.447893 1.625337) (xy 2.434484 1.623248) (xy 2.434167 1.622864) (xy 2.435087 1.619331) (xy 2.438096 1.610502) (xy 2.443570 1.595398) (xy 2.451885 1.573040)
     (xy 2.463415 1.542450) (xy 2.478536 1.502648) (xy 2.497623 1.452657) (xy 2.521051 1.391498) (xy 2.549195 1.318192) (xy 2.582431 1.231760) (xy 2.621135 1.131223) (xy 2.654312 1.045110)
     (xy 3.079750 1.045110) (xy 3.085139 1.050429) (xy 3.102823 1.054227) (xy 3.135080 1.056687) (xy 3.184188 1.057993) (xy 3.243792 1.058334) (xy 3.300009 1.057851) (xy 3.347924 1.056518)
     (xy 3.383939 1.054511) (xy 3.404454 1.052002) (xy 3.407834 1.050401) (xy 3.404556 1.035006) (xy 3.395486 1.004210) (xy 3.381772 0.961283) (xy 3.364559 0.909494) (xy 3.344993 0.852111)
     (xy 3.324221 0.792403) (xy 3.303390 0.733639) (xy 3.283646 0.679089) (xy 3.266134 0.632020) (xy 3.252002 0.595701) (xy 3.242396 0.573403) (xy 3.238632 0.567927) (xy 3.233035 0.580258)
     (xy 3.222176 0.609251) (xy 3.207224 0.651400) (xy 3.189345 0.703199) (xy 3.169707 0.761145) (xy 3.149477 0.821730) (xy 3.129822 0.881450) (xy 3.111909 0.936800) (xy 3.096905 0.984273)
     (xy 3.085978 1.020365) (xy 3.080294 1.041570) (xy 3.079750 1.045110) (xy 2.654312 1.045110) (xy 2.665680 1.015604) (xy 2.716443 0.883922) (xy 2.773799 0.735201) (xy 2.838122 0.568460)
     (xy 2.892077 0.428625) (xy 3.022756 0.089959) (xy 3.466042 0.084451) (xy 3.754438 0.849594) )(layer F.SilkS) (width  0.010000)
  )
  (fp_poly (pts (xy 4.228042 0.084790) (xy 4.412897 0.549602) (xy 4.450191 0.643013) (xy 4.485202 0.730008) (xy 4.517145 0.808687) (xy 4.545238 0.877151) (xy 4.568694 0.933502) (xy 4.586731 0.975840)
     (xy 4.598564 1.002267) (xy 4.603397 1.010890) (xy 4.608362 1.000655) (xy 4.620384 0.972703) (xy 4.638665 0.928977) (xy 4.662409 0.871416) (xy 4.690819 0.801961) (xy 4.723098 0.722551)
     (xy 4.758449 0.635129) (xy 4.794250 0.546179) (xy 4.979459 0.084992) (xy 5.193771 0.084830) (xy 5.258504 0.085153) (xy 5.315364 0.086149) (xy 5.361209 0.087704) (xy 5.392895 0.089704)
     (xy 5.407280 0.092035) (xy 5.407811 0.092604) (xy 5.403704 0.103359) (xy 5.391893 0.132077) (xy 5.373009 0.177267) (xy 5.347684 0.237436) (xy 5.316550 0.311094) (xy 5.280239 0.396747)
     (xy 5.239384 0.492903) (xy 5.194615 0.598071) (xy 5.146565 0.710759) (xy 5.095866 0.829474) (xy 5.081730 0.862542) (xy 4.755922 1.624542) (xy 4.601257 1.627466) (xy 4.546277 1.627967)
     (xy 4.499210 1.627374) (xy 4.463919 1.625815) (xy 4.444270 1.623420) (xy 4.441599 1.622174) (xy 4.436642 1.611098) (xy 4.424279 1.582366) (xy 4.405295 1.537838) (xy 4.380481 1.479374)
     (xy 4.350622 1.408834) (xy 4.316508 1.328079) (xy 4.278927 1.238967) (xy 4.238665 1.143359) (xy 4.225156 1.111250) (xy 4.155070 0.944600) (xy 4.092782 0.796440) (xy 4.037868 0.665756)
     (xy 3.989906 0.551534) (xy 3.948472 0.452757) (xy 3.913142 0.368414) (xy 3.883494 0.297487) (xy 3.859105 0.238964) (xy 3.839549 0.191830) (xy 3.824405 0.155070) (xy 3.813249 0.127670)
     (xy 3.805658 0.108614) (xy 3.801208 0.096890) (xy 3.799475 0.091482) (xy 3.799417 0.091026) (xy 3.809475 0.089107) (xy 3.837551 0.087427) (xy 3.880496 0.086077) (xy 3.935161 0.085151)
     (xy 3.998399 0.084740) (xy 4.013729 0.084728) (xy 4.228042 0.084790) )(layer F.SilkS) (width  0.010000)
  )
)
