EESchema Schematic File Version 4
EELAYER 30 0
EELAYER END
$Descr USLetter 11000 8500
encoding utf-8
Sheet 1 1
Title "Rocket Locator Board"
Date "2020-01-18"
Rev "1.0"
Comp "NuAv"
Comment1 ""
Comment2 ""
Comment3 ""
Comment4 ""
$EndDescr
$Comp
L RCRecivers:FrSkyXM+ RC1
U 1 1 5E23C48F
P 1450 1300
F 0 "RC1" H 1367 1765 50  0000 C CNN
F 1 "FrSkyXM+" H 1367 1674 50  0000 C CNN
F 2 "Connector_PinSocket_2.54mm:PinSocket_1x03_P2.54mm_Vertical" H 1450 1300 50  0001 C CNN
F 3 "" H 1450 1300 50  0001 C CNN
	1    1450 1300
	-1   0    0    -1  
$EndComp
$Comp
L RCRecivers:FrSkyXM+ RC2
U 1 1 5E23F5DB
P 1450 2150
F 0 "RC2" H 1367 2615 50  0000 C CNN
F 1 "FrSkyXM+" H 1367 2524 50  0000 C CNN
F 2 "Connector_PinSocket_2.54mm:PinSocket_1x03_P2.54mm_Vertical" H 1450 2150 50  0001 C CNN
F 3 "" H 1450 2150 50  0001 C CNN
	1    1450 2150
	-1   0    0    -1  
$EndComp
$Comp
L RCRecivers:FrSkyXM+ RC3
U 1 1 5E2413EF
P 1450 3000
F 0 "RC3" H 1367 3465 50  0000 C CNN
F 1 "FrSkyXM+" H 1367 3374 50  0000 C CNN
F 2 "Connector_PinSocket_2.54mm:PinSocket_1x03_P2.54mm_Vertical" H 1450 3000 50  0001 C CNN
F 3 "" H 1450 3000 50  0001 C CNN
	1    1450 3000
	-1   0    0    -1  
$EndComp
$Comp
L RCRecivers:FrSkyXM+ RC4
U 1 1 5E2413F5
P 1450 3850
F 0 "RC4" H 1367 4315 50  0000 C CNN
F 1 "FrSkyXM+" H 1367 4224 50  0000 C CNN
F 2 "Connector_PinSocket_2.54mm:PinSocket_1x03_P2.54mm_Vertical" H 1450 3850 50  0001 C CNN
F 3 "" H 1450 3850 50  0001 C CNN
	1    1450 3850
	-1   0    0    -1  
$EndComp
$Comp
L RCRecivers:FrSkyXM+ RC5
U 1 1 5E243B6F
P 1450 4750
F 0 "RC5" H 1367 5215 50  0000 C CNN
F 1 "FrSkyXM+" H 1367 5124 50  0000 C CNN
F 2 "Connector_PinSocket_2.54mm:PinSocket_1x03_P2.54mm_Vertical" H 1450 4750 50  0001 C CNN
F 3 "" H 1450 4750 50  0001 C CNN
	1    1450 4750
	-1   0    0    -1  
$EndComp
$Comp
L RCRecivers:FrSkyXM+ RC6
U 1 1 5E243B75
P 1450 5600
F 0 "RC6" H 1367 6065 50  0000 C CNN
F 1 "FrSkyXM+" H 1367 5974 50  0000 C CNN
F 2 "Connector_PinSocket_2.54mm:PinSocket_1x03_P2.54mm_Vertical" H 1450 5600 50  0001 C CNN
F 3 "" H 1450 5600 50  0001 C CNN
	1    1450 5600
	-1   0    0    -1  
$EndComp
$Comp
L RCRecivers:FrSkyXM+ RC7
U 1 1 5E243B7B
P 1450 6450
F 0 "RC7" H 1367 6915 50  0000 C CNN
F 1 "FrSkyXM+" H 1367 6824 50  0000 C CNN
F 2 "Connector_PinSocket_2.54mm:PinSocket_1x03_P2.54mm_Vertical" H 1450 6450 50  0001 C CNN
F 3 "" H 1450 6450 50  0001 C CNN
	1    1450 6450
	-1   0    0    -1  
$EndComp
$Comp
L RCRecivers:FrSkyXM+ RC8
U 1 1 5E243B81
P 1450 7300
F 0 "RC8" H 1367 7765 50  0000 C CNN
F 1 "FrSkyXM+" H 1367 7674 50  0000 C CNN
F 2 "Connector_PinSocket_2.54mm:PinSocket_1x03_P2.54mm_Vertical" H 1450 7300 50  0001 C CNN
F 3 "" H 1450 7300 50  0001 C CNN
	1    1450 7300
	-1   0    0    -1  
$EndComp
Wire Wire Line
	2050 3850 2500 3850
Wire Wire Line
	2500 3850 2500 4300
Wire Wire Line
	2050 4750 2500 4750
Wire Wire Line
	2500 4750 2500 4400
Wire Wire Line
	2050 5600 2600 5600
Wire Wire Line
	2600 5600 2600 4500
Wire Wire Line
	2050 3000 2600 3000
Wire Wire Line
	2600 3000 2600 4200
Wire Wire Line
	2050 2150 2700 2150
Wire Wire Line
	2700 2150 2700 4100
Wire Wire Line
	2050 1300 2800 1300
Wire Wire Line
	2800 1300 2800 4000
Wire Wire Line
	2050 6450 2700 6450
Wire Wire Line
	2700 6450 2700 4600
Wire Wire Line
	2050 7300 2800 7300
Wire Wire Line
	2800 7300 2800 4700
Wire Wire Line
	2050 7400 2150 7400
Wire Wire Line
	2150 7400 2150 6550
$Comp
L power:+5V #PWR01
U 1 1 5E24B916
P 2150 1000
F 0 "#PWR01" H 2150 850 50  0001 C CNN
F 1 "+5V" H 2165 1173 50  0000 C CNN
F 2 "" H 2150 1000 50  0001 C CNN
F 3 "" H 2150 1000 50  0001 C CNN
	1    2150 1000
	1    0    0    -1  
$EndComp
Wire Wire Line
	2050 1400 2150 1400
Connection ~ 2150 1400
Wire Wire Line
	2150 1400 2150 1000
Wire Wire Line
	2050 2250 2150 2250
Connection ~ 2150 2250
Wire Wire Line
	2150 2250 2150 1400
Wire Wire Line
	2050 3100 2150 3100
Connection ~ 2150 3100
Wire Wire Line
	2150 3100 2150 2250
Wire Wire Line
	2050 3950 2150 3950
Connection ~ 2150 3950
Wire Wire Line
	2150 3950 2150 3100
Wire Wire Line
	2050 4850 2150 4850
Connection ~ 2150 4850
Wire Wire Line
	2150 4850 2150 3950
Wire Wire Line
	2050 5700 2150 5700
Connection ~ 2150 5700
Wire Wire Line
	2150 5700 2150 4850
Wire Wire Line
	2050 6550 2150 6550
Connection ~ 2150 6550
Wire Wire Line
	2150 6550 2150 5700
Wire Wire Line
	2050 2350 2250 2350
Wire Wire Line
	2250 2350 2250 3200
Wire Wire Line
	2050 7500 2250 7500
Connection ~ 2250 7500
Wire Wire Line
	2250 7500 2250 7600
$Comp
L power:GND #PWR02
U 1 1 5E25018B
P 2250 7600
F 0 "#PWR02" H 2250 7350 50  0001 C CNN
F 1 "GND" H 2255 7427 50  0000 C CNN
F 2 "" H 2250 7600 50  0001 C CNN
F 3 "" H 2250 7600 50  0001 C CNN
	1    2250 7600
	1    0    0    -1  
$EndComp
Wire Wire Line
	2050 6650 2250 6650
Connection ~ 2250 6650
Wire Wire Line
	2250 6650 2250 7500
Wire Wire Line
	2050 5800 2250 5800
Connection ~ 2250 5800
Wire Wire Line
	2250 5800 2250 6650
Wire Wire Line
	2050 4950 2250 4950
Connection ~ 2250 4950
Wire Wire Line
	2250 4950 2250 5800
Wire Wire Line
	2050 4050 2250 4050
Connection ~ 2250 4050
Wire Wire Line
	2250 4050 2250 4950
Wire Wire Line
	2050 3200 2250 3200
Connection ~ 2250 3200
Wire Wire Line
	2250 3200 2250 4050
$Comp
L RocketLocatorBoard-rescue:ATmega328P-AU-MCU_Microchip_ATmega U2
U 1 1 5E262907
P 9650 4600
F 0 "U2" H 10100 6050 50  0000 C CNN
F 1 "ATmega328P-AU" H 9300 3150 50  0000 C CNN
F 2 "Package_QFP:TQFP-32_7x7mm_P0.8mm" H 9650 4600 50  0001 C CIN
F 3 "http://ww1.microchip.com/downloads/en/DeviceDoc/ATmega328_P%20AVR%20MCU%20with%20picoPower%20Technology%20Data%20Sheet%2040001984A.pdf" H 9650 4600 50  0001 C CNN
	1    9650 4600
	-1   0    0    -1  
$EndComp
Wire Wire Line
	9050 3400 8700 3400
Wire Wire Line
	9050 3500 8700 3500
Wire Wire Line
	9050 3600 8700 3600
Wire Wire Line
	9050 3700 8700 3700
Wire Wire Line
	9050 3800 8700 3800
Wire Wire Line
	9050 3900 8700 3900
Wire Wire Line
	9050 4300 8700 4300
Wire Wire Line
	9050 4400 8700 4400
Wire Wire Line
	9050 4500 8700 4500
Wire Wire Line
	9050 4600 8700 4600
Wire Wire Line
	9050 4700 8700 4700
Wire Wire Line
	9050 4800 8700 4800
Wire Wire Line
	9050 4900 8700 4900
Wire Wire Line
	9050 5100 8700 5100
Wire Wire Line
	9050 5200 8700 5200
Wire Wire Line
	9050 5300 8700 5300
Wire Wire Line
	9050 5400 8700 5400
Wire Wire Line
	9050 5500 8700 5500
Wire Wire Line
	9050 5600 8700 5600
Wire Wire Line
	9050 5700 8700 5700
Wire Wire Line
	9050 5800 8700 5800
Text Label 8700 5300 0    50   ~ 0
D2
Text Label 8700 5400 0    50   ~ 0
D3
Text Label 8700 5500 0    50   ~ 0
D4
Text Label 8700 5600 0    50   ~ 0
D5
Text Label 8700 5700 0    50   ~ 0
D6
Text Label 8700 5800 0    50   ~ 0
D7
Text Label 8700 3900 0    50   ~ 0
SPI-SCK
Text Label 8700 3800 0    50   ~ 0
SPI-MISO
Text Label 8700 3700 0    50   ~ 0
SPI-MOSI
Text Label 8700 3600 0    50   ~ 0
D10
Text Label 8700 3500 0    50   ~ 0
D9
Text Label 8700 3400 0    50   ~ 0
D8
Text Label 8700 4300 0    50   ~ 0
A0
Text Label 8700 4400 0    50   ~ 0
A1
Text Label 8700 4500 0    50   ~ 0
A2
Text Label 8700 4600 0    50   ~ 0
A3
Text Label 8700 5100 0    50   ~ 0
UART-Rx
Text Label 8700 5200 0    50   ~ 0
UART-Tx
Text Label 8700 4700 0    50   ~ 0
I2C-SDA
Text Label 8700 4800 0    50   ~ 0
I2C-SCL
Text Label 8700 4900 0    50   ~ 0
~Reset
Wire Wire Line
	4600 5600 4600 5700
Connection ~ 4600 5700
$Comp
L power:GND #PWR07
U 1 1 5E29AD1D
P 4600 5800
F 0 "#PWR07" H 4600 5550 50  0001 C CNN
F 1 "GND" H 4605 5627 50  0000 C CNN
F 2 "" H 4600 5800 50  0001 C CNN
F 3 "" H 4600 5800 50  0001 C CNN
	1    4600 5800
	1    0    0    -1  
$EndComp
Wire Wire Line
	4600 5700 4600 5800
NoConn ~ 10250 3700
NoConn ~ 10250 3600
NoConn ~ 10250 3400
$Comp
L power:+5V #PWR021
U 1 1 5E2A7C05
P 9600 2900
F 0 "#PWR021" H 9600 2750 50  0001 C CNN
F 1 "+5V" H 9615 3073 50  0000 C CNN
F 2 "" H 9600 2900 50  0001 C CNN
F 3 "" H 9600 2900 50  0001 C CNN
	1    9600 2900
	1    0    0    -1  
$EndComp
Wire Wire Line
	9550 3100 9550 3000
Wire Wire Line
	9550 3000 9600 3000
Wire Wire Line
	9650 3000 9650 3100
Wire Wire Line
	9600 2900 9600 3000
Connection ~ 9600 3000
Wire Wire Line
	9600 3000 9650 3000
$Comp
L power:GND #PWR022
U 1 1 5E2B01BD
P 9650 6200
F 0 "#PWR022" H 9650 5950 50  0001 C CNN
F 1 "GND" H 9655 6027 50  0000 C CNN
F 2 "" H 9650 6200 50  0001 C CNN
F 3 "" H 9650 6200 50  0001 C CNN
	1    9650 6200
	1    0    0    -1  
$EndComp
Wire Wire Line
	9650 6200 9650 6100
$Comp
L power:GND #PWR015
U 1 1 5E2DA8C1
P 8100 5000
F 0 "#PWR015" H 8100 4750 50  0001 C CNN
F 1 "GND" H 8105 4827 50  0000 C CNN
F 2 "" H 8100 5000 50  0001 C CNN
F 3 "" H 8100 5000 50  0001 C CNN
	1    8100 5000
	1    0    0    -1  
$EndComp
Text Label 2950 4900 0    50   ~ 0
D8
Text Label 2950 5000 0    50   ~ 0
D9
Text Label 2950 5100 0    50   ~ 0
D10
Wire Wire Line
	5100 4100 5300 4100
Text Label 2950 5300 0    50   ~ 0
D7
$Comp
L 74xx:74LS251 U1
U 1 1 5E23A9C9
P 4600 4600
F 0 "U1" H 4250 5450 50  0000 C CNN
F 1 "74LS251" H 4350 5350 50  0000 C CNN
F 2 "Package_DIP:DIP-16_W7.62mm" H 4600 4600 50  0001 C CNN
F 3 "http://www.ti.com/lit/gpn/sn74LS251" H 4600 4600 50  0001 C CNN
	1    4600 4600
	1    0    0    -1  
$EndComp
Wire Wire Line
	4100 5100 4050 5100
Wire Wire Line
	4100 5000 3800 5000
Wire Wire Line
	4100 4900 3550 4900
Wire Wire Line
	4050 5650 4050 5700
Wire Wire Line
	3800 5650 3800 5700
Wire Wire Line
	3550 5700 3550 5650
Wire Wire Line
	4050 5350 4050 5100
Wire Wire Line
	3800 5350 3800 5000
Wire Wire Line
	3550 5350 3550 4900
$Comp
L Device:R R3
U 1 1 5E31FB00
P 3550 5500
F 0 "R3" V 3650 5500 50  0000 C CNN
F 1 "10k" V 3550 5500 50  0000 C CNN
F 2 "Resistor_SMD:R_0402_1005Metric" V 3480 5500 50  0001 C CNN
F 3 "~" H 3550 5500 50  0001 C CNN
	1    3550 5500
	-1   0    0    1   
$EndComp
$Comp
L Device:R R4
U 1 1 5E328062
P 3800 5500
F 0 "R4" V 3900 5500 50  0000 C CNN
F 1 "10k" V 3800 5500 50  0000 C CNN
F 2 "Resistor_SMD:R_0402_1005Metric" V 3730 5500 50  0001 C CNN
F 3 "~" H 3800 5500 50  0001 C CNN
	1    3800 5500
	-1   0    0    1   
$EndComp
$Comp
L Device:R R5
U 1 1 5E32C145
P 4050 5500
F 0 "R5" V 4150 5500 50  0000 C CNN
F 1 "10k" V 4050 5500 50  0000 C CNN
F 2 "Resistor_SMD:R_0402_1005Metric" V 3980 5500 50  0001 C CNN
F 3 "~" H 4050 5500 50  0001 C CNN
	1    4050 5500
	-1   0    0    1   
$EndComp
Connection ~ 3550 4900
Connection ~ 3800 5000
Connection ~ 3800 5700
Wire Wire Line
	3800 5700 4050 5700
Connection ~ 4050 5100
Connection ~ 4050 5700
Wire Wire Line
	4050 5700 4600 5700
Wire Wire Line
	2950 5100 4050 5100
Wire Wire Line
	2950 5000 3800 5000
Wire Wire Line
	2950 4900 3550 4900
Wire Wire Line
	3550 5700 3800 5700
$Comp
L Device:R R2
U 1 1 5E38B020
P 3300 5500
F 0 "R2" V 3400 5500 50  0000 C CNN
F 1 "10k" V 3300 5500 50  0000 C CNN
F 2 "Resistor_SMD:R_0402_1005Metric" V 3230 5500 50  0001 C CNN
F 3 "~" H 3300 5500 50  0001 C CNN
	1    3300 5500
	-1   0    0    1   
$EndComp
Wire Wire Line
	3300 5350 3300 5300
Connection ~ 3300 5300
Wire Wire Line
	3300 5300 4100 5300
Text Label 5200 4000 0    50   ~ 0
D3
Text Label 5200 4100 0    50   ~ 0
D4
$Comp
L Connector:Conn_01x04_Male J6
U 1 1 5E3A0EB7
P 9000 1400
F 0 "J6" H 9108 1681 50  0000 C CNN
F 1 "I2C-Conn" H 9108 1590 50  0000 C CNN
F 2 "Connector_PinSocket_2.54mm:PinSocket_1x04_P2.54mm_Vertical" H 9000 1400 50  0001 C CNN
F 3 "~" H 9000 1400 50  0001 C CNN
	1    9000 1400
	1    0    0    -1  
$EndComp
$Comp
L power:GND #PWR019
U 1 1 5E3B24DC
P 9400 1700
F 0 "#PWR019" H 9400 1450 50  0001 C CNN
F 1 "GND" H 9405 1527 50  0000 C CNN
F 2 "" H 9400 1700 50  0001 C CNN
F 3 "" H 9400 1700 50  0001 C CNN
	1    9400 1700
	1    0    0    -1  
$EndComp
Wire Wire Line
	9200 1600 9400 1600
Wire Wire Line
	9400 1600 9400 1700
Text Label 10000 1400 0    50   ~ 0
I2C-SDA
Text Label 10000 1500 0    50   ~ 0
I2C-SCL
$Comp
L power:+5VP #PWR018
U 1 1 5E417C74
P 9400 950
F 0 "#PWR018" H 9400 800 50  0001 C CNN
F 1 "+5VP" H 9415 1123 50  0000 C CNN
F 2 "" H 9400 950 50  0001 C CNN
F 3 "" H 9400 950 50  0001 C CNN
	1    9400 950 
	1    0    0    -1  
$EndComp
Wire Wire Line
	9200 1300 9400 1300
Wire Wire Line
	9400 1300 9400 950 
$Comp
L Connector_Generic:Conn_02x03_Odd_Even J5
U 1 1 5E429811
P 8050 1450
F 0 "J5" H 8100 1767 50  0000 C CNN
F 1 "ICSP" H 8100 1676 50  0000 C CNN
F 2 "Connector_PinHeader_2.54mm:PinHeader_2x03_P2.54mm_Vertical" H 8050 1450 50  0001 C CNN
F 3 "~" H 8050 1450 50  0001 C CNN
	1    8050 1450
	1    0    0    -1  
$EndComp
Wire Wire Line
	8350 1350 8450 1350
Wire Wire Line
	8450 1350 8450 1200
$Comp
L power:+5V #PWR016
U 1 1 5E431312
P 8450 1200
F 0 "#PWR016" H 8450 1050 50  0001 C CNN
F 1 "+5V" H 8465 1373 50  0000 C CNN
F 2 "" H 8450 1200 50  0001 C CNN
F 3 "" H 8450 1200 50  0001 C CNN
	1    8450 1200
	1    0    0    -1  
$EndComp
Wire Wire Line
	8350 1450 8800 1450
Text Label 8400 1450 0    50   ~ 0
SPI-MOSI
Wire Wire Line
	8350 1550 8450 1550
Wire Wire Line
	8450 1550 8450 1650
$Comp
L power:GND #PWR017
U 1 1 5E44B4BA
P 8450 1650
F 0 "#PWR017" H 8450 1400 50  0001 C CNN
F 1 "GND" H 8455 1477 50  0000 C CNN
F 2 "" H 8450 1650 50  0001 C CNN
F 3 "" H 8450 1650 50  0001 C CNN
	1    8450 1650
	1    0    0    -1  
$EndComp
Wire Wire Line
	7850 1350 7500 1350
Wire Wire Line
	7850 1450 7500 1450
Wire Wire Line
	7850 1550 7500 1550
Text Label 7500 1350 0    50   ~ 0
SPI-MISO
Text Label 7500 1450 0    50   ~ 0
SPI-SCK
Text Label 7500 1550 0    50   ~ 0
~Reset
$Comp
L Connector_Generic:Conn_01x01 J3
U 1 1 5E47E8C0
P 6150 1150
F 0 "J3" H 6068 925 50  0000 C CNN
F 1 "+5V" H 6068 1016 50  0000 C CNN
F 2 "TestPoint:TestPoint_Pad_2.5x2.5mm" H 6150 1150 50  0001 C CNN
F 3 "~" H 6150 1150 50  0001 C CNN
	1    6150 1150
	-1   0    0    1   
$EndComp
$Comp
L Connector_Generic:Conn_01x01 J4
U 1 1 5E47F9A6
P 6150 1650
F 0 "J4" H 6068 1425 50  0000 C CNN
F 1 "GND" H 6068 1516 50  0000 C CNN
F 2 "TestPoint:TestPoint_Pad_2.5x2.5mm" H 6150 1650 50  0001 C CNN
F 3 "~" H 6150 1650 50  0001 C CNN
	1    6150 1650
	-1   0    0    1   
$EndComp
$Comp
L power:GND #PWR011
U 1 1 5E48648E
P 6650 1800
F 0 "#PWR011" H 6650 1550 50  0001 C CNN
F 1 "GND" H 6655 1627 50  0000 C CNN
F 2 "" H 6650 1800 50  0001 C CNN
F 3 "" H 6650 1800 50  0001 C CNN
	1    6650 1800
	1    0    0    -1  
$EndComp
Wire Wire Line
	6350 1650 6650 1650
Wire Wire Line
	6650 1650 6650 1800
$Comp
L Device:Polyfuse_Small F1
U 1 1 5E48E201
P 6800 1150
F 0 "F1" V 6595 1150 50  0000 C CNN
F 1 "250mA" V 6686 1150 50  0000 C CNN
F 2 "Resistor_SMD:R_0805_2012Metric" H 6850 950 50  0001 L CNN
F 3 "~" H 6800 1150 50  0001 C CNN
	1    6800 1150
	0    1    1    0   
$EndComp
Wire Wire Line
	6350 1150 6500 1150
Wire Wire Line
	6900 1150 7150 1150
Wire Wire Line
	7150 1150 7150 1050
Wire Wire Line
	6500 1150 6500 1050
Connection ~ 6500 1150
Wire Wire Line
	6500 1150 6700 1150
$Comp
L power:+5V #PWR013
U 1 1 5E4A4678
P 7150 1050
F 0 "#PWR013" H 7150 900 50  0001 C CNN
F 1 "+5V" H 7165 1223 50  0000 C CNN
F 2 "" H 7150 1050 50  0001 C CNN
F 3 "" H 7150 1050 50  0001 C CNN
	1    7150 1050
	1    0    0    -1  
$EndComp
$Comp
L power:+5VP #PWR010
U 1 1 5E4A4CE2
P 6500 1050
F 0 "#PWR010" H 6500 900 50  0001 C CNN
F 1 "+5VP" H 6515 1223 50  0000 C CNN
F 2 "" H 6500 1050 50  0001 C CNN
F 3 "" H 6500 1050 50  0001 C CNN
	1    6500 1050
	1    0    0    -1  
$EndComp
$Comp
L Device:LED D2
U 1 1 5E4AE4DF
P 6800 3350
F 0 "D2" V 6839 3233 50  0000 R CNN
F 1 "Ind1" V 6748 3233 50  0000 R CNN
F 2 "LED_SMD:LED_0402_1005Metric" H 6800 3350 50  0001 C CNN
F 3 "~" H 6800 3350 50  0001 C CNN
	1    6800 3350
	0    -1   -1   0   
$EndComp
$Comp
L Device:LED D1
U 1 1 5E4AFEED
P 6300 3350
F 0 "D1" V 6339 3233 50  0000 R CNN
F 1 "Ind2" V 6248 3233 50  0000 R CNN
F 2 "LED_SMD:LED_0402_1005Metric" H 6300 3350 50  0001 C CNN
F 3 "~" H 6300 3350 50  0001 C CNN
	1    6300 3350
	0    -1   -1   0   
$EndComp
$Comp
L Device:LED D3
U 1 1 5E4B7AA3
P 7300 3350
F 0 "D3" V 7339 3232 50  0000 R CNN
F 1 "PowerLED" V 7248 3232 50  0000 R CNN
F 2 "LED_SMD:LED_0402_1005Metric" H 7300 3350 50  0001 C CNN
F 3 "~" H 7300 3350 50  0001 C CNN
	1    7300 3350
	0    -1   -1   0   
$EndComp
$Comp
L Device:R R7
U 1 1 5E4C7533
P 6300 2950
F 0 "R7" V 6400 2950 50  0000 C CNN
F 1 "1k" V 6300 2950 50  0000 C CNN
F 2 "Resistor_SMD:R_0402_1005Metric" V 6230 2950 50  0001 C CNN
F 3 "~" H 6300 2950 50  0001 C CNN
	1    6300 2950
	-1   0    0    1   
$EndComp
$Comp
L Device:R R8
U 1 1 5E4D69D4
P 6800 2950
F 0 "R8" V 6900 2950 50  0000 C CNN
F 1 "1k" V 6800 2950 50  0000 C CNN
F 2 "Resistor_SMD:R_0402_1005Metric" V 6730 2950 50  0001 C CNN
F 3 "~" H 6800 2950 50  0001 C CNN
	1    6800 2950
	-1   0    0    1   
$EndComp
$Comp
L Device:R R9
U 1 1 5E4DDE86
P 7300 2950
F 0 "R9" V 7400 2950 50  0000 C CNN
F 1 "1k" V 7300 2950 50  0000 C CNN
F 2 "Resistor_SMD:R_0402_1005Metric" V 7230 2950 50  0001 C CNN
F 3 "~" H 7300 2950 50  0001 C CNN
	1    7300 2950
	-1   0    0    1   
$EndComp
Wire Wire Line
	6300 3200 6300 3100
Wire Wire Line
	6800 3200 6800 3100
Wire Wire Line
	7300 3200 7300 3100
$Comp
L power:GND #PWR014
U 1 1 5E4FC460
P 7300 3700
F 0 "#PWR014" H 7300 3450 50  0001 C CNN
F 1 "GND" H 7305 3527 50  0000 C CNN
F 2 "" H 7300 3700 50  0001 C CNN
F 3 "" H 7300 3700 50  0001 C CNN
	1    7300 3700
	1    0    0    -1  
$EndComp
Wire Wire Line
	7300 3700 7300 3500
Wire Wire Line
	6800 3500 6800 3800
Wire Wire Line
	6800 3800 7000 3800
Wire Wire Line
	6300 3500 6300 3800
Wire Wire Line
	6300 3800 6500 3800
Text Label 6350 3800 0    50   ~ 0
D5
Text Label 6850 3800 0    50   ~ 0
D6
Wire Wire Line
	6300 2800 6300 2650
Wire Wire Line
	6300 2650 6800 2650
Wire Wire Line
	7300 2650 7300 2800
Wire Wire Line
	6800 2800 6800 2650
Connection ~ 6800 2650
Wire Wire Line
	6800 2650 7300 2650
Wire Wire Line
	6800 2550 6800 2650
$Comp
L power:+5V #PWR012
U 1 1 5E53003C
P 6800 2550
F 0 "#PWR012" H 6800 2400 50  0001 C CNN
F 1 "+5V" H 6815 2723 50  0000 C CNN
F 2 "" H 6800 2550 50  0001 C CNN
F 3 "" H 6800 2550 50  0001 C CNN
	1    6800 2550
	1    0    0    -1  
$EndComp
$Comp
L Switch:SW_Push SW1
U 1 1 5E53C692
P 5200 1650
F 0 "SW1" V 5154 1798 50  0000 L CNN
F 1 "Reset" V 5245 1798 50  0000 L CNN
F 2 "Button_Switch_SMD:SW_Push_1P1T_NO_6x6mm_H9.5mm" H 5200 1850 50  0001 C CNN
F 3 "~" H 5200 1850 50  0001 C CNN
	1    5200 1650
	0    1    1    0   
$EndComp
$Comp
L power:GND #PWR09
U 1 1 5E53D761
P 5200 2000
F 0 "#PWR09" H 5200 1750 50  0001 C CNN
F 1 "GND" H 5205 1827 50  0000 C CNN
F 2 "" H 5200 2000 50  0001 C CNN
F 3 "" H 5200 2000 50  0001 C CNN
	1    5200 2000
	1    0    0    -1  
$EndComp
Wire Wire Line
	5200 2000 5200 1850
$Comp
L power:+5V #PWR08
U 1 1 5E546C16
P 5200 850
F 0 "#PWR08" H 5200 700 50  0001 C CNN
F 1 "+5V" H 5215 1023 50  0000 C CNN
F 2 "" H 5200 850 50  0001 C CNN
F 3 "" H 5200 850 50  0001 C CNN
	1    5200 850 
	1    0    0    -1  
$EndComp
$Comp
L Device:R R6
U 1 1 5E54875D
P 5200 1100
F 0 "R6" V 5300 1100 50  0000 C CNN
F 1 "10k" V 5200 1100 50  0000 C CNN
F 2 "Resistor_SMD:R_0402_1005Metric" V 5130 1100 50  0001 C CNN
F 3 "~" H 5200 1100 50  0001 C CNN
	1    5200 1100
	-1   0    0    1   
$EndComp
Wire Wire Line
	5200 950  5200 850 
Wire Wire Line
	5200 1450 5200 1350
Wire Wire Line
	5200 1350 5750 1350
Connection ~ 5200 1350
Wire Wire Line
	5200 1350 5200 1250
Text Label 5500 1350 0    50   ~ 0
~Reset
$Comp
L Connector:Conn_01x03_Male J1
U 1 1 5E5B3670
P 3600 1500
F 0 "J1" H 3600 1700 50  0000 C CNN
F 1 "UART" H 3700 1350 50  0000 C CNN
F 2 "Connector_PinHeader_2.54mm:PinHeader_1x03_P2.54mm_Vertical" H 3600 1500 50  0001 C CNN
F 3 "~" H 3600 1500 50  0001 C CNN
	1    3600 1500
	1    0    0    -1  
$EndComp
Wire Wire Line
	3800 1600 3950 1600
Wire Wire Line
	3950 1600 3950 1750
$Comp
L power:GND #PWR06
U 1 1 5E5BDDF5
P 3950 1750
F 0 "#PWR06" H 3950 1500 50  0001 C CNN
F 1 "GND" H 3955 1577 50  0000 C CNN
F 2 "" H 3950 1750 50  0001 C CNN
F 3 "" H 3950 1750 50  0001 C CNN
	1    3950 1750
	1    0    0    -1  
$EndComp
Wire Wire Line
	3800 1500 4200 1500
Wire Wire Line
	3800 1400 4200 1400
Text Label 3900 1500 0    50   ~ 0
UART-Tx
Text Label 3900 1400 0    50   ~ 0
UART-Rx
Wire Wire Line
	2050 1500 2250 1500
Wire Wire Line
	2250 1500 2250 2350
Connection ~ 2250 2350
Wire Wire Line
	3550 5700 3300 5700
Wire Wire Line
	3300 5700 3300 5650
Connection ~ 3550 5700
Wire Wire Line
	5100 4000 5300 4000
$Comp
L Mechanical:MountingHole H1
U 1 1 5E429773
P 3250 7000
F 0 "H1" H 3350 7046 50  0000 L CNN
F 1 "M3" H 3350 6955 50  0000 L CNN
F 2 "MountingHole:MountingHole_3.2mm_M3" H 3250 7000 50  0001 C CNN
F 3 "~" H 3250 7000 50  0001 C CNN
	1    3250 7000
	1    0    0    -1  
$EndComp
$Comp
L Mechanical:MountingHole H2
U 1 1 5E42A34E
P 3250 7300
F 0 "H2" H 3350 7346 50  0000 L CNN
F 1 "M3" H 3350 7255 50  0000 L CNN
F 2 "MountingHole:MountingHole_3.2mm_M3" H 3250 7300 50  0001 C CNN
F 3 "~" H 3250 7300 50  0001 C CNN
	1    3250 7300
	1    0    0    -1  
$EndComp
$Comp
L Mechanical:MountingHole H3
U 1 1 5E42B3AC
P 3250 7600
F 0 "H3" H 3350 7646 50  0000 L CNN
F 1 "M3" H 3350 7555 50  0000 L CNN
F 2 "MountingHole:MountingHole_3.2mm_M3" H 3250 7600 50  0001 C CNN
F 3 "~" H 3250 7600 50  0001 C CNN
	1    3250 7600
	1    0    0    -1  
$EndComp
$Comp
L Device:Resonator Y1
U 1 1 5E422E9D
P 8100 4450
F 0 "Y1" H 8100 4698 50  0000 C CNN
F 1 "16M" H 8100 4607 50  0000 C CNN
F 2 "Crystal:Resonator_SMD_muRata_CSTxExxV-3Pin_3.0x1.1mm" H 8075 4450 50  0001 C CNN
F 3 "~" H 8075 4450 50  0001 C CNN
	1    8100 4450
	1    0    0    -1  
$EndComp
Wire Wire Line
	8100 5000 8100 4650
Wire Wire Line
	8250 4450 8350 4450
Wire Wire Line
	8350 4450 8350 4100
Wire Wire Line
	8350 4100 9050 4100
Wire Wire Line
	9050 4000 7850 4000
Wire Wire Line
	7850 4000 7850 4450
Wire Wire Line
	7850 4450 7950 4450
$Comp
L power:+5V #PWR023
U 1 1 5E462094
P 6600 4500
F 0 "#PWR023" H 6600 4350 50  0001 C CNN
F 1 "+5V" H 6615 4673 50  0000 C CNN
F 2 "" H 6600 4500 50  0001 C CNN
F 3 "" H 6600 4500 50  0001 C CNN
	1    6600 4500
	1    0    0    -1  
$EndComp
$Comp
L Device:C C1
U 1 1 5E46B030
P 6150 4850
F 0 "C1" H 6265 4896 50  0000 L CNN
F 1 "0.1u" H 6265 4805 50  0000 L CNN
F 2 "Capacitor_SMD:C_0805_2012Metric" H 6188 4700 50  0001 C CNN
F 3 "~" H 6150 4850 50  0001 C CNN
	1    6150 4850
	1    0    0    -1  
$EndComp
$Comp
L Device:C C2
U 1 1 5E46C074
P 6600 4850
F 0 "C2" H 6715 4896 50  0000 L CNN
F 1 "0.1u" H 6715 4805 50  0000 L CNN
F 2 "Capacitor_SMD:C_0805_2012Metric" H 6638 4700 50  0001 C CNN
F 3 "~" H 6600 4850 50  0001 C CNN
	1    6600 4850
	1    0    0    -1  
$EndComp
$Comp
L Device:C C3
U 1 1 5E486C18
P 7050 4850
F 0 "C3" H 7165 4896 50  0000 L CNN
F 1 "0.1u" H 7165 4805 50  0000 L CNN
F 2 "Capacitor_SMD:C_0805_2012Metric" H 7088 4700 50  0001 C CNN
F 3 "~" H 7050 4850 50  0001 C CNN
	1    7050 4850
	1    0    0    -1  
$EndComp
Wire Wire Line
	6150 4700 6150 4600
Wire Wire Line
	6150 4600 6600 4600
Wire Wire Line
	7050 4600 7050 4700
Wire Wire Line
	6600 4700 6600 4600
Connection ~ 6600 4600
Wire Wire Line
	6600 4600 7050 4600
Wire Wire Line
	6600 4500 6600 4600
Wire Wire Line
	6150 5000 6150 5100
Wire Wire Line
	6150 5100 6600 5100
Wire Wire Line
	7050 5100 7050 5000
Wire Wire Line
	6600 5000 6600 5100
Connection ~ 6600 5100
Wire Wire Line
	6600 5100 7050 5100
Wire Wire Line
	6600 5100 6600 5200
$Comp
L power:GND #PWR024
U 1 1 5E4C8C55
P 6600 5200
F 0 "#PWR024" H 6600 4950 50  0001 C CNN
F 1 "GND" H 6605 5027 50  0000 C CNN
F 2 "" H 6600 5200 50  0001 C CNN
F 3 "" H 6600 5200 50  0001 C CNN
	1    6600 5200
	1    0    0    -1  
$EndComp
Wire Wire Line
	2800 4000 4100 4000
Wire Wire Line
	2700 4100 4100 4100
Wire Wire Line
	2600 4200 4100 4200
Wire Wire Line
	2500 4300 4100 4300
Wire Wire Line
	2500 4400 4100 4400
Wire Wire Line
	2600 4500 4100 4500
Wire Wire Line
	2700 4600 4100 4600
Wire Wire Line
	2800 4700 4100 4700
$Comp
L power:+5V #PWR0101
U 1 1 5E5048B7
P 4600 3600
F 0 "#PWR0101" H 4600 3450 50  0001 C CNN
F 1 "+5V" H 4615 3773 50  0000 C CNN
F 2 "" H 4600 3600 50  0001 C CNN
F 3 "" H 4600 3600 50  0001 C CNN
	1    4600 3600
	1    0    0    -1  
$EndComp
Wire Wire Line
	4600 3700 4600 3600
Wire Wire Line
	2950 5300 3300 5300
Wire Wire Line
	9200 1400 10350 1400
Wire Wire Line
	9200 1500 10350 1500
$Comp
L NUAV_Logo:LOGO #G?
U 1 1 5E591D5E
P 7200 7050
F 0 "#G?" H 7200 6857 60  0001 C CNN
F 1 "LOGO" H 7200 7243 60  0001 C CNN
F 2 "" H 7200 7050 50  0001 C CNN
F 3 "" H 7200 7050 50  0001 C CNN
	1    7200 7050
	1    0    0    -1  
$EndComp
$EndSCHEMATC
