(module LOGO (layer F.Cu)
  (at 0 0)
 (fp_text reference "G***" (at 0 0) (layer F.SilkS) hide
  (effects (font (thickness 0.3)))
  )
  (fp_text value "LOGO" (at 0.75 0) (layer F.SilkS) hide
  (effects (font (thickness 0.3)))
  )
  (fp_poly (pts (xy -8.018220 -2.835084) (xy -8.005484 -2.828857) (xy -7.993965 -2.811850) (xy -7.970877 -2.769794) (xy -7.938097 -2.706401) (xy -7.897506 -2.625383) (xy -7.850981 -2.530451) (xy -7.800403 -2.425319)
     (xy -7.787651 -2.398521) (xy -7.589146 -1.980466) (xy -7.598799 -1.888110) (xy -7.602068 -1.837678) (xy -7.598551 -1.793470) (xy -7.586193 -1.744558) (xy -7.562941 -1.680017) (xy -7.556636 -1.663847)
     (xy -7.523060 -1.584582) (xy -7.482938 -1.498805) (xy -7.444426 -1.423877) (xy -7.440994 -1.417679) (xy -7.377168 -1.303420) (xy -6.708803 -1.000355) (xy -6.549827 -0.928167) (xy -6.417028 -0.867459)
     (xy -6.307629 -0.816688) (xy -6.218850 -0.774314) (xy -6.147912 -0.738795) (xy -6.092037 -0.708590) (xy -6.048445 -0.682156) (xy -6.014358 -0.657952) (xy -5.986996 -0.634437) (xy -5.963581 -0.610069)
     (xy -5.941334 -0.583306) (xy -5.929313 -0.567943) (xy -5.896466 -0.540148) (xy -5.853663 -0.521496) (xy -5.811017 -0.514225) (xy -5.778646 -0.520570) (xy -5.768168 -0.532329) (xy -5.774384 -0.550831)
     (xy -5.796273 -0.593101) (xy -5.832167 -0.656312) (xy -5.880393 -0.737640) (xy -5.939284 -0.834257) (xy -6.007167 -0.943338) (xy -6.066654 -1.037406) (xy -6.154404 -1.174489) (xy -6.227247 -1.286506)
     (xy -6.286671 -1.375581) (xy -6.334166 -1.443838) (xy -6.371221 -1.493401) (xy -6.399325 -1.526391) (xy -6.419966 -1.544934) (xy -6.424559 -1.547797) (xy -6.499612 -1.603137) (xy -6.551788 -1.676690)
     (xy -6.563543 -1.702272) (xy -6.577298 -1.738895) (xy -6.577641 -1.763947) (xy -6.561740 -1.790325) (xy -6.538128 -1.817964) (xy -6.510206 -1.855519) (xy -6.500146 -1.882148) (xy -6.502422 -1.888584)
     (xy -6.520890 -1.896552) (xy -6.565741 -1.912078) (xy -6.632870 -1.933857) (xy -6.718172 -1.960582) (xy -6.817542 -1.990948) (xy -6.926876 -2.023650) (xy -6.929438 -2.024408) (xy -7.039800 -2.057294)
     (xy -7.141091 -2.087922) (xy -7.229031 -2.114961) (xy -7.299341 -2.137082) (xy -7.347742 -2.152956) (xy -7.369955 -2.161253) (xy -7.369969 -2.161261) (xy -7.392055 -2.189317) (xy -7.397750 -2.223059)
     (xy -7.397905 -2.239063) (xy -7.396174 -2.251506) (xy -7.389266 -2.260375) (xy -7.373889 -2.265658) (xy -7.346750 -2.267342) (xy -7.304559 -2.265414) (xy -7.244022 -2.259860) (xy -7.161849 -2.250669)
     (xy -7.054746 -2.237828) (xy -6.919423 -2.221323) (xy -6.918340 -2.221191) (xy -6.767643 -2.201999) (xy -6.645309 -2.184489) (xy -6.548028 -2.168091) (xy -6.472491 -2.152238) (xy -6.415391 -2.136358)
     (xy -6.405563 -2.133013) (xy -6.335654 -2.111819) (xy -6.250283 -2.090929) (xy -6.165540 -2.074196) (xy -6.148035 -2.071372) (xy -6.074734 -2.061090) (xy -6.023424 -2.056982) (xy -5.984950 -2.059065)
     (xy -5.950155 -2.067353) (xy -5.937115 -2.071736) (xy -5.916474 -2.078239) (xy -5.895050 -2.082145) (xy -5.868843 -2.082892) (xy -5.833853 -2.079919) (xy -5.786079 -2.072667) (xy -5.721519 -2.060572)
     (xy -5.636174 -2.043075) (xy -5.526043 -2.019615) (xy -5.452815 -2.003828) (xy -5.327785 -1.976728) (xy -5.230206 -1.955147) (xy -5.156475 -1.937976) (xy -5.102993 -1.924105) (xy -5.066159 -1.912427)
     (xy -5.042371 -1.901831) (xy -5.028029 -1.891208) (xy -5.019533 -1.879450) (xy -5.014691 -1.868883) (xy -5.004374 -1.834934) (xy -5.005344 -1.815615) (xy -5.022965 -1.814813) (xy -5.067721 -1.817329)
     (xy -5.135212 -1.822783) (xy -5.221038 -1.830798) (xy -5.320801 -1.840993) (xy -5.400387 -1.849649) (xy -5.525103 -1.863849) (xy -5.623013 -1.875889) (xy -5.698912 -1.886644) (xy -5.757599 -1.896987)
     (xy -5.803871 -1.907795) (xy -5.842525 -1.919941) (xy -5.878360 -1.934300) (xy -5.887853 -1.938525) (xy -5.944791 -1.961840) (xy -5.995358 -1.978348) (xy -6.027656 -1.984375) (xy -6.052759 -1.982805)
     (xy -6.057006 -1.972382) (xy -6.042509 -1.944542) (xy -6.038958 -1.938520) (xy -6.019387 -1.892033) (xy -6.026329 -1.861299) (xy -6.060944 -1.844653) (xy -6.107409 -1.840385) (xy -6.149940 -1.838412)
     (xy -6.163393 -1.833615) (xy -6.151563 -1.825625) (xy -6.111223 -1.814806) (xy -6.074678 -1.810866) (xy -6.029544 -1.809750) (xy -6.096533 -1.729740) (xy -6.129615 -1.688776) (xy -6.151541 -1.658788)
     (xy -6.157542 -1.646396) (xy -6.140663 -1.637723) (xy -6.107570 -1.621067) (xy -6.103938 -1.619250) (xy -6.083772 -1.603307) (xy -6.053995 -1.570101) (xy -6.013328 -1.517884) (xy -5.960489 -1.444910)
     (xy -5.894198 -1.349433) (xy -5.813173 -1.229706) (xy -5.760569 -1.150938) (xy -5.671583 -1.018108) (xy -5.598321 -0.910832) (xy -5.539749 -0.827698) (xy -5.494830 -0.767293) (xy -5.462533 -0.728205)
     (xy -5.441821 -0.709020) (xy -5.435131 -0.706438) (xy -5.405889 -0.699344) (xy -5.359878 -0.680911) (xy -5.316069 -0.659703) (xy -5.226700 -0.612967) (xy -5.147762 -0.679057) (xy -5.103242 -0.717446)
     (xy -5.066769 -0.750882) (xy -5.048656 -0.769449) (xy -5.012206 -0.790680) (xy -4.963131 -0.789511) (xy -4.910286 -0.766923) (xy -4.889724 -0.751815) (xy -4.839887 -0.709880) (xy -4.763241 -0.745779)
     (xy -4.717079 -0.764976) (xy -4.681635 -0.775363) (xy -4.669554 -0.775808) (xy -4.646414 -0.761705) (xy -4.605728 -0.731158) (xy -4.552984 -0.688852) (xy -4.493667 -0.639470) (xy -4.433264 -0.587697)
     (xy -4.377261 -0.538217) (xy -4.331144 -0.495715) (xy -4.300401 -0.464876) (xy -4.290826 -0.452438) (xy -4.284449 -0.417522) (xy -4.285359 -0.367921) (xy -4.287624 -0.349250) (xy -4.292300 -0.303737)
     (xy -4.285542 -0.272330) (xy -4.262511 -0.240607) (xy -4.244778 -0.221581) (xy -4.213064 -0.183024) (xy -4.193749 -0.149136) (xy -4.191000 -0.137490) (xy -4.198335 -0.111169) (xy -4.217820 -0.065917)
     (xy -4.245681 -0.010269) (xy -4.254500 0.006070) (xy -4.283691 0.060440) (xy -4.305803 0.103879) (xy -4.317206 0.129172) (xy -4.318000 0.132277) (xy -4.308189 0.148952) (xy -4.282938 0.180718)
     (xy -4.259713 0.207300) (xy -4.226314 0.249770) (xy -4.204053 0.288503) (xy -4.198925 0.305769) (xy -4.194685 0.316506) (xy -4.181642 0.329257) (xy -4.157064 0.345362) (xy -4.118217 0.366161)
     (xy -4.062370 0.392993) (xy -3.986788 0.427199) (xy -3.888740 0.470119) (xy -3.765493 0.523092) (xy -3.690321 0.555149) (xy -3.553182 0.613739) (xy -3.442571 0.661593) (xy -3.355673 0.700097)
     (xy -3.289673 0.730637) (xy -3.241754 0.754599) (xy -3.209101 0.773371) (xy -3.188897 0.788338) (xy -3.178328 0.800887) (xy -3.175203 0.808767) (xy -3.162733 0.839492) (xy -3.150750 0.850956)
     (xy -3.134249 0.841373) (xy -3.103777 0.812365) (xy -3.064971 0.769478) (xy -3.051041 0.752914) (xy -3.001357 0.696464) (xy -2.963150 0.664221) (xy -2.930751 0.653670) (xy -2.898495 0.662294)
     (xy -2.876908 0.675587) (xy -2.851465 0.691289) (xy -2.842581 0.686285) (xy -2.841625 0.670234) (xy -2.850413 0.642238) (xy -2.873342 0.598880) (xy -2.902255 0.554240) (xy -2.924128 0.520027)
     (xy -2.945417 0.478886) (xy -2.967771 0.426494) (xy -2.992839 0.358528) (xy -3.022267 0.270666) (xy -3.057705 0.158585) (xy -3.077230 0.095250) (xy -3.108969 -0.009512) (xy -3.137295 -0.105327)
     (xy -3.160925 -0.187664) (xy -3.178575 -0.251992) (xy -3.188963 -0.293779) (xy -3.191225 -0.307315) (xy -3.185399 -0.327339) (xy -3.162778 -0.329378) (xy -3.147219 -0.326036) (xy -3.112013 -0.314622)
     (xy -3.093916 -0.304471) (xy -3.085405 -0.287433) (xy -3.066482 -0.245108) (xy -3.038891 -0.181540) (xy -3.004374 -0.100774) (xy -2.964674 -0.006854) (xy -2.928540 0.079375) (xy -2.880451 0.195081)
     (xy -2.843448 0.285879) (xy -2.816139 0.356053) (xy -2.797134 0.409891) (xy -2.785041 0.451678) (xy -2.778468 0.485701) (xy -2.776025 0.516247) (xy -2.776321 0.547601) (xy -2.776346 0.548277)
     (xy -2.768588 0.643740) (xy -2.740793 0.752731) (xy -2.695670 0.866629) (xy -2.647491 0.957896) (xy -2.627236 0.998943) (xy -2.600135 1.063989) (xy -2.568614 1.146667) (xy -2.535099 1.240612)
     (xy -2.502015 1.339455) (xy -2.501375 1.341437) (xy -2.404009 1.643062) (xy -2.142599 1.648130) (xy -2.034831 1.649210) (xy -1.907659 1.648889) (xy -1.773394 1.647292) (xy -1.644345 1.644541)
     (xy -1.575594 1.642426) (xy -1.270000 1.631656) (xy -1.270000 0.126314) (xy -0.964929 0.130625) (xy -0.659857 0.134937) (xy -0.111647 0.839638) (xy 0.436562 1.544339) (xy 0.440694 0.835669)
     (xy 0.444826 0.127000) (xy 1.047750 0.127000) (xy 1.047750 2.444750) (xy 0.446456 2.444750) (xy -0.106178 1.732418) (xy -0.658813 1.020087) (xy -0.662944 1.732418) (xy -0.667074 2.444750)
     (xy -1.270000 2.444750) (xy -1.270000 2.082270) (xy -1.270312 1.978279) (xy -1.271186 1.885291) (xy -1.272529 1.807878) (xy -1.274252 1.750609) (xy -1.276260 1.718054) (xy -1.277431 1.712361)
     (xy -1.294921 1.712034) (xy -1.337985 1.716163) (xy -1.400868 1.724064) (xy -1.477812 1.735052) (xy -1.511587 1.740212) (xy -1.606642 1.754364) (xy -1.721982 1.770545) (xy -1.846343 1.787230)
     (xy -1.968459 1.802897) (xy -2.036987 1.811297) (xy -2.335662 1.847100) (xy -2.325482 1.887660) (xy -2.316733 1.924381) (xy -2.312557 1.944391) (xy -2.324449 1.956686) (xy -2.357113 1.965068)
     (xy -2.361351 1.965532) (xy -2.397368 1.964782) (xy -2.422348 1.948876) (xy -2.446420 1.913673) (xy -2.479950 1.856844) (xy -2.577444 1.866637) (xy -2.622214 1.870334) (xy -2.692492 1.875155)
     (xy -2.782071 1.880721) (xy -2.884745 1.886651) (xy -2.994307 1.892566) (xy -3.035527 1.894683) (xy -3.396117 1.912937) (xy -3.320168 2.016125) (xy -3.286251 2.059776) (xy -3.253456 2.093946)
     (xy -3.216553 2.121099) (xy -3.170312 2.143697) (xy -3.109501 2.164203) (xy -3.028892 2.185079) (xy -2.923252 2.208788) (xy -2.900614 2.213667) (xy -2.823270 2.229715) (xy -2.768146 2.238938)
     (xy -2.726559 2.241799) (xy -2.689827 2.238763) (xy -2.649269 2.230294) (xy -2.638676 2.227674) (xy -2.547938 2.204918) (xy -2.095500 2.325505) (xy -1.944216 2.366586) (xy -1.821186 2.401635)
     (xy -1.727035 2.430457) (xy -1.662388 2.452857) (xy -1.627871 2.468642) (xy -1.622760 2.472895) (xy -1.607323 2.508013) (xy -1.614099 2.534970) (xy -1.640481 2.544744) (xy -1.643454 2.544503)
     (xy -1.667236 2.541750) (xy -1.717991 2.535775) (xy -1.791169 2.527117) (xy -1.882215 2.516315) (xy -1.986578 2.503908) (xy -2.087563 2.491884) (xy -2.500313 2.442699) (xy -2.606677 2.379986)
     (xy -2.689827 2.335400) (xy -2.754185 2.310433) (xy -2.798002 2.305608) (xy -2.817443 2.317151) (xy -2.816657 2.341457) (xy -2.801612 2.365735) (xy -2.782829 2.405332) (xy -2.787756 2.446496)
     (xy -2.813467 2.477585) (xy -2.831675 2.485350) (xy -2.883845 2.484024) (xy -2.945314 2.460106) (xy -3.007672 2.417355) (xy -3.030238 2.396570) (xy -3.082953 2.343855) (xy -3.132945 2.400792)
     (xy -3.167089 2.435943) (xy -3.195962 2.459376) (xy -3.204818 2.463825) (xy -3.211513 2.476833) (xy -3.196509 2.501944) (xy -3.165011 2.534398) (xy -3.122222 2.569438) (xy -3.073348 2.602302)
     (xy -3.026367 2.627022) (xy -2.979472 2.649700) (xy -2.947073 2.669076) (xy -2.936875 2.679590) (xy -2.947400 2.705029) (xy -2.973915 2.742541) (xy -3.008836 2.782933) (xy -3.044577 2.817013)
     (xy -3.059583 2.828290) (xy -3.099010 2.849862) (xy -3.134673 2.854908) (xy -3.178330 2.843400) (xy -3.214688 2.827882) (xy -3.284969 2.782181) (xy -3.354185 2.712349) (xy -3.415778 2.625525)
     (xy -3.438547 2.584226) (xy -3.470156 2.527472) (xy -3.511792 2.460242) (xy -3.526396 2.438600) (xy -3.264794 2.438600) (xy -3.262313 2.444750) (xy -3.248048 2.459894) (xy -3.245501 2.460625)
     (xy -3.238683 2.448342) (xy -3.238500 2.444750) (xy -3.250704 2.429485) (xy -3.255312 2.428875) (xy -3.264794 2.438600) (xy -3.526396 2.438600) (xy -3.553196 2.398888) (xy -3.578002 2.364349)
     (xy -3.600014 2.336677) (xy -3.623383 2.313594) (xy -3.652261 2.292823) (xy -3.690800 2.272084) (xy -3.743151 2.249099) (xy -3.813465 2.221591) (xy -3.905895 2.187280) (xy -4.004469 2.151241)
     (xy -4.254500 2.059908) (xy -4.254500 2.006266) (xy -4.253613 1.979887) (xy -4.247504 1.963110) (xy -4.231002 1.955126) (xy -4.198937 1.955125) (xy -4.146136 1.962297) (xy -4.067429 1.975833)
     (xy -4.064000 1.976437) (xy -3.996287 1.987467) (xy -3.935540 1.995783) (xy -3.892339 1.999981) (xy -3.884599 2.000228) (xy -3.840135 2.000250) (xy -3.880973 1.946708) (xy -3.901637 1.921434)
     (xy -3.922089 1.905085) (xy -3.950105 1.894985) (xy -3.993459 1.888454) (xy -4.059928 1.882814) (xy -4.068312 1.882184) (xy -4.271320 1.862432) (xy -4.478726 1.833874) (xy -4.682794 1.797971)
     (xy -4.875787 1.756184) (xy -5.049967 1.709975) (xy -5.151438 1.677564) (xy -5.341281 1.602135) (xy -5.504611 1.517072) (xy -5.640304 1.423164) (xy -5.747235 1.321197) (xy -5.824277 1.211958)
     (xy -5.828495 1.204109) (xy -5.853779 1.132635) (xy -5.865554 1.047620) (xy -5.863558 0.961214) (xy -5.847533 0.885569) (xy -5.835885 0.858666) (xy -5.806795 0.804519) (xy -5.758104 0.895261)
     (xy -5.687303 0.996776) (xy -5.587499 1.093484) (xy -5.461304 1.183533) (xy -5.311327 1.265072) (xy -5.140179 1.336249) (xy -5.132626 1.338962) (xy -5.056119 1.363892) (xy -4.962388 1.390679)
     (xy -4.856629 1.418206) (xy -4.744039 1.445357) (xy -4.629815 1.471016) (xy -4.519151 1.494064) (xy -4.417244 1.513387) (xy -4.329291 1.527867) (xy -4.260486 1.536388) (xy -4.216028 1.537833)
     (xy -4.210365 1.537149) (xy -4.203376 1.531568) (xy -4.205665 1.516767) (xy -4.218941 1.489973) (xy -4.244913 1.448412) (xy -4.285291 1.389308) (xy -4.341784 1.309888) (xy -4.399401 1.230312)
     (xy -4.461484 1.144181) (xy -4.516789 1.065941) (xy -4.562691 0.999425) (xy -4.596571 0.948468) (xy -4.615806 0.916905) (xy -4.619227 0.908843) (xy -4.624156 0.891932) (xy -4.639398 0.894572)
     (xy -4.667210 0.918518) (xy -4.709849 0.965521) (xy -4.743188 1.005159) (xy -4.795569 1.065450) (xy -4.837121 1.104904) (xy -4.874573 1.129138) (xy -4.906428 1.141439) (xy -4.950693 1.152594)
     (xy -4.979388 1.150866) (xy -5.006679 1.134491) (xy -5.014885 1.127948) (xy -5.055095 1.100370) (xy -5.107374 1.070762) (xy -5.127625 1.060735) (xy -5.160877 1.040716) (xy -5.212582 1.004107)
     (xy -5.279220 0.953838) (xy -5.357269 0.892838) (xy -5.443210 0.824034) (xy -5.533522 0.750357) (xy -5.624683 0.674735) (xy -5.634481 0.666470) (xy -4.362621 0.666470) (xy -4.358880 0.690133)
     (xy -4.342505 0.729085) (xy -4.318869 0.772467) (xy -4.293346 0.809420) (xy -4.289813 0.813593) (xy -4.256246 0.836034) (xy -4.231760 0.841375) (xy -4.192712 0.850394) (xy -4.163440 0.865627)
     (xy -4.145294 0.884604) (xy -4.111582 0.925896) (xy -4.065062 0.985886) (xy -4.008492 1.060960) (xy -3.944628 1.147503) (xy -3.876229 1.241899) (xy -3.872810 1.246663) (xy -3.783040 1.370245)
     (xy -3.709058 1.468805) (xy -3.651187 1.541935) (xy -3.609752 1.589229) (xy -3.585077 1.610279) (xy -3.582433 1.611251) (xy -3.552658 1.615024) (xy -3.496482 1.619459) (xy -3.419239 1.624307)
     (xy -3.326266 1.629319) (xy -3.222897 1.634246) (xy -3.114469 1.638840) (xy -3.006316 1.642853) (xy -2.903773 1.646035) (xy -2.812177 1.648138) (xy -2.780844 1.648608) (xy -2.585125 1.651000)
     (xy -2.715411 1.400968) (xy -2.758370 1.319156) (xy -2.796980 1.246813) (xy -2.828595 1.188800) (xy -2.850571 1.149977) (xy -2.859736 1.135656) (xy -2.877936 1.137061) (xy -2.908100 1.163000)
     (xy -2.922356 1.179312) (xy -2.968031 1.223178) (xy -3.009975 1.238216) (xy -3.012043 1.238250) (xy -3.056061 1.228396) (xy -3.110947 1.203350) (xy -3.164643 1.169886) (xy -3.205090 1.134777)
     (xy -3.212259 1.125774) (xy -3.231176 1.113254) (xy -3.275014 1.091489) (xy -3.339927 1.062015) (xy -3.422069 1.026369) (xy -3.517591 0.986085) (xy -3.622646 0.942701) (xy -3.733389 0.897751)
     (xy -3.845971 0.852773) (xy -3.956546 0.809302) (xy -4.061266 0.768874) (xy -4.156285 0.733025) (xy -4.237755 0.703292) (xy -4.301830 0.681210) (xy -4.344662 0.668315) (xy -4.362404 0.666143)
     (xy -4.362621 0.666470) (xy -5.634481 0.666470) (xy -5.713174 0.600096) (xy -5.795474 0.529369) (xy -5.868062 0.465483) (xy -5.927417 0.411368) (xy -5.970018 0.369951) (xy -5.992346 0.344161)
     (xy -5.994704 0.339430) (xy -6.011625 0.307554) (xy -6.044379 0.267621) (xy -6.066046 0.246328) (xy -6.102265 0.211318) (xy -6.119027 0.184413) (xy -6.121461 0.153631) (xy -6.117747 0.125598)
     (xy -6.103566 0.083215) (xy -6.075425 0.027528) (xy -6.039305 -0.031949) (xy -6.001191 -0.085698) (xy -5.967065 -0.124204) (xy -5.954451 -0.134119) (xy -5.937764 -0.154357) (xy -5.944862 -0.170025)
     (xy -5.965757 -0.170874) (xy -5.986432 -0.175853) (xy -6.032785 -0.193560) (xy -6.101986 -0.222743) (xy -6.191206 -0.262152) (xy -6.297617 -0.310533) (xy -6.418389 -0.366635) (xy -6.550693 -0.429207)
     (xy -6.565039 -0.436053) (xy -6.689866 -0.495305) (xy -6.805527 -0.549490) (xy -6.908956 -0.597224) (xy -6.997090 -0.637125) (xy -7.066863 -0.667813) (xy -7.115211 -0.687904) (xy -7.139069 -0.696016)
     (xy -7.141052 -0.695814) (xy -7.138178 -0.676418) (xy -7.126317 -0.633996) (xy -7.107489 -0.575306) (xy -7.089458 -0.523126) (xy -7.066114 -0.456152) (xy -7.047419 -0.399987) (xy -7.035612 -0.361520)
     (xy -7.032626 -0.348343) (xy -7.046552 -0.338322) (xy -7.080656 -0.333462) (xy -7.086429 -0.333375) (xy -7.105716 -0.334206) (xy -7.122329 -0.339165) (xy -7.139123 -0.351955) (xy -7.158949 -0.376277)
     (xy -7.184660 -0.415834) (xy -7.219109 -0.474328) (xy -7.265148 -0.555459) (xy -7.285696 -0.591965) (xy -7.431158 -0.850554) (xy -7.624798 -0.939899) (xy -7.704579 -0.976129) (xy -7.781462 -1.010019)
     (xy -7.847047 -1.037929) (xy -7.892931 -1.056219) (xy -7.895308 -1.057089) (xy -7.925071 -1.071563) (xy -7.286625 -1.071563) (xy -7.278688 -1.063625) (xy -7.270750 -1.071563) (xy -7.278688 -1.079500)
     (xy -7.286625 -1.071563) (xy -7.925071 -1.071563) (xy -7.951031 -1.084187) (xy -8.011625 -1.123894) (xy -8.046121 -1.151876) (xy -8.087399 -1.191514) (xy -8.109631 -1.222176) (xy -8.118583 -1.254690)
     (xy -8.119212 -1.270000) (xy -7.699375 -1.270000) (xy -7.689193 -1.243932) (xy -7.675004 -1.238250) (xy -7.659201 -1.243739) (xy -7.665189 -1.265329) (xy -7.667625 -1.270000) (xy -7.683795 -1.294936)
     (xy -7.691997 -1.301750) (xy -7.698001 -1.288396) (xy -7.699375 -1.270000) (xy -8.119212 -1.270000) (xy -8.120063 -1.290668) (xy -8.110834 -1.347960) (xy -8.086764 -1.407014) (xy -8.053276 -1.458859)
     (xy -8.015794 -1.494520) (xy -7.990517 -1.504988) (xy -7.965311 -1.518625) (xy -7.926935 -1.550758) (xy -7.882358 -1.595336) (xy -7.867123 -1.612144) (xy -7.808246 -1.672813) (xy -7.761275 -1.706772)
     (xy -7.723308 -1.715393) (xy -7.691441 -1.700050) (xy -7.688059 -1.696834) (xy -7.663242 -1.686893) (xy -7.653192 -1.689797) (xy -7.646861 -1.711386) (xy -7.663852 -1.753149) (xy -7.703706 -1.814226)
     (xy -7.754218 -1.879462) (xy -7.776054 -1.907684) (xy -7.795508 -1.937164) (xy -7.814254 -1.971994) (xy -7.833969 -2.016266) (xy -7.856327 -2.074071) (xy -7.883003 -2.149501) (xy -7.915674 -2.246649)
     (xy -7.956015 -2.369605) (xy -7.960351 -2.382912) (xy -7.995928 -2.492863) (xy -8.028027 -2.593457) (xy -8.055377 -2.680599) (xy -8.076706 -2.750192) (xy -8.090744 -2.798141) (xy -8.096220 -2.820349)
     (xy -8.096251 -2.820880) (xy -8.083197 -2.836011) (xy -8.052804 -2.841130) (xy -8.018220 -2.835084) )(layer F.SilkS) (width  0.010000)
  )
  (fp_poly (pts (xy 1.737317 0.127000) (xy 2.032000 0.127000) (xy 2.032314 0.781843) (xy 2.032951 0.987972) (xy 2.034875 1.164995) (xy 2.038424 1.315539) (xy 2.043937 1.442234) (xy 2.051753 1.547710)
     (xy 2.062209 1.634594) (xy 2.075644 1.705516) (xy 2.092398 1.763105) (xy 2.112807 1.809989) (xy 2.137211 1.848799) (xy 2.165948 1.882162) (xy 2.175137 1.891190) (xy 2.251510 1.943212)
     (xy 2.343478 1.973780) (xy 2.443635 1.983329) (xy 2.544576 1.972293) (xy 2.638898 1.941108) (xy 2.719194 1.890209) (xy 2.751924 1.857318) (xy 2.777199 1.821250) (xy 2.798908 1.775987)
     (xy 2.817288 1.719185) (xy 2.832576 1.648500) (xy 2.845011 1.561587) (xy 2.854829 1.456102) (xy 2.862269 1.329701) (xy 2.867568 1.180039) (xy 2.870964 1.004773) (xy 2.872695 0.801558)
     (xy 2.873035 0.662781) (xy 2.873375 0.127000) (xy 3.460750 0.127000) (xy 3.460750 0.902795) (xy 3.460506 1.105238) (xy 3.459615 1.278822) (xy 3.457841 1.426433) (xy 3.454944 1.550959)
     (xy 3.450686 1.655288) (xy 3.444831 1.742307) (xy 3.437139 1.814903) (xy 3.427373 1.875964) (xy 3.415295 1.928378) (xy 3.400667 1.975032) (xy 3.383250 2.018814) (xy 3.365642 2.056820)
     (xy 3.305908 2.151934) (xy 3.223517 2.244640) (xy 3.127038 2.326788) (xy 3.025042 2.390226) (xy 3.004982 2.399839) (xy 2.856287 2.453162) (xy 2.688718 2.488489) (xy 2.510170 2.504891)
     (xy 2.328540 2.501442) (xy 2.230437 2.490782) (xy 2.048236 2.452421) (xy 1.889499 2.392708) (xy 1.754247 2.311658) (xy 1.642501 2.209288) (xy 1.554282 2.085612) (xy 1.489610 1.940646)
     (xy 1.488295 1.936750) (xy 1.480731 1.913235) (xy 1.474333 1.889694) (xy 1.468983 1.863311) (xy 1.464564 1.831273) (xy 1.460957 1.790763) (xy 1.458044 1.738966) (xy 1.455707 1.673068)
     (xy 1.453828 1.590254) (xy 1.452289 1.487708) (xy 1.450971 1.362614) (xy 1.449758 1.212159) (xy 1.448530 1.033528) (xy 1.448182 0.980281) (xy 1.442635 0.126999) (xy 1.737317 0.127000) )(layer F.SilkS) (width  0.010000)
  )
  (fp_poly (pts (xy 5.631656 1.274391) (xy 5.700224 1.456451) (xy 5.765443 1.629899) (xy 5.826459 1.792443) (xy 5.882415 1.941791) (xy 5.932457 2.075652) (xy 5.975730 2.191734) (xy 6.011378 2.287746)
     (xy 6.038545 2.361397) (xy 6.056378 2.410394) (xy 6.064019 2.432446) (xy 6.064250 2.433428) (xy 6.049170 2.436879) (xy 6.007108 2.439906) (xy 5.942831 2.442338) (xy 5.861108 2.444003)
     (xy 5.766704 2.444731) (xy 5.748742 2.444750) (xy 5.433234 2.444750) (xy 5.373068 2.282031) (xy 5.346116 2.210490) (xy 5.320873 2.145870) (xy 5.300682 2.096605) (xy 5.291157 2.075393)
     (xy 5.269413 2.031474) (xy 4.855336 2.035706) (xy 4.441260 2.039937) (xy 4.361032 2.242343) (xy 4.280804 2.444750) (xy 3.966027 2.444750) (xy 3.869965 2.444249) (xy 3.785731 2.442852)
     (xy 3.718098 2.440718) (xy 3.671838 2.438005) (xy 3.651725 2.434872) (xy 3.651250 2.434296) (xy 3.652629 2.428996) (xy 3.657143 2.415752) (xy 3.665355 2.393096) (xy 3.677827 2.359559)
     (xy 3.695122 2.313674) (xy 3.717803 2.253972) (xy 3.746433 2.178985) (xy 3.781575 2.087246) (xy 3.823792 1.977287) (xy 3.873646 1.847639) (xy 3.931701 1.696834) (xy 3.981467 1.567664)
     (xy 4.619625 1.567664) (xy 4.627707 1.575643) (xy 4.654234 1.581340) (xy 4.702619 1.585030) (xy 4.776281 1.586989) (xy 4.865687 1.587500) (xy 4.950013 1.586775) (xy 5.021886 1.584777)
     (xy 5.075908 1.581765) (xy 5.106681 1.578002) (xy 5.111750 1.575600) (xy 5.106833 1.552508) (xy 5.093229 1.506315) (xy 5.072657 1.441924) (xy 5.046837 1.364240) (xy 5.017489 1.278166)
     (xy 4.986331 1.188604) (xy 4.955084 1.100458) (xy 4.925468 1.018632) (xy 4.899201 0.948029) (xy 4.878003 0.893551) (xy 4.863594 0.860103) (xy 4.857948 0.851890) (xy 4.849551 0.870386)
     (xy 4.833263 0.913875) (xy 4.810835 0.977099) (xy 4.784017 1.054798) (xy 4.754560 1.141716) (xy 4.724214 1.232594) (xy 4.694732 1.322175) (xy 4.667862 1.405199) (xy 4.645357 1.476409)
     (xy 4.628966 1.530547) (xy 4.620440 1.562355) (xy 4.619625 1.567664) (xy 3.981467 1.567664) (xy 3.998519 1.523405) (xy 4.074664 1.325883) (xy 4.160697 1.102800) (xy 4.257183 0.852689)
     (xy 4.338114 0.642937) (xy 4.534134 0.134937) (xy 5.199062 0.126675) (xy 5.631656 1.274391) )(layer F.SilkS) (width  0.010000)
  )
  (fp_poly (pts (xy 6.342062 0.127184) (xy 6.619345 0.824403) (xy 6.675285 0.964519) (xy 6.727802 1.095011) (xy 6.775717 1.213030) (xy 6.817856 1.315726) (xy 6.853041 1.400252) (xy 6.880096 1.463760)
     (xy 6.897845 1.503399) (xy 6.905095 1.516335) (xy 6.912543 1.500981) (xy 6.930575 1.459054) (xy 6.957997 1.393465) (xy 6.993613 1.307123) (xy 7.036228 1.202940) (xy 7.084647 1.083826)
     (xy 7.137673 0.952692) (xy 7.191375 0.819268) (xy 7.469187 0.127488) (xy 7.790656 0.127244) (xy 7.887755 0.127728) (xy 7.973045 0.129223) (xy 8.041813 0.131556) (xy 8.089342 0.134556)
     (xy 8.110919 0.138052) (xy 8.111715 0.138906) (xy 8.105555 0.155037) (xy 8.087838 0.198114) (xy 8.059512 0.265899) (xy 8.021525 0.356154) (xy 7.974824 0.466640) (xy 7.920358 0.595119)
     (xy 7.859075 0.739354) (xy 7.791922 0.897106) (xy 7.719847 1.066138) (xy 7.643798 1.244210) (xy 7.622594 1.293812) (xy 7.133882 2.436812) (xy 6.901885 2.441198) (xy 6.819415 2.441949)
     (xy 6.748814 2.441060) (xy 6.695877 2.438722) (xy 6.666404 2.435129) (xy 6.662397 2.433261) (xy 6.654963 2.416646) (xy 6.636417 2.373548) (xy 6.607942 2.306756) (xy 6.570720 2.219060)
     (xy 6.525933 2.113251) (xy 6.474762 1.992117) (xy 6.418389 1.858450) (xy 6.357997 1.715038) (xy 6.337734 1.666875) (xy 6.232604 1.416900) (xy 6.139172 1.194660) (xy 6.056801 0.998634)
     (xy 5.984858 0.827300) (xy 5.922707 0.679135) (xy 5.869713 0.552620) (xy 5.825241 0.446230) (xy 5.788656 0.358446) (xy 5.759323 0.287745) (xy 5.736607 0.232604) (xy 5.719873 0.191504)
     (xy 5.708486 0.162921) (xy 5.701811 0.145334) (xy 5.699212 0.137222) (xy 5.699125 0.136538) (xy 5.714212 0.133660) (xy 5.756326 0.131140) (xy 5.820743 0.129115) (xy 5.902741 0.127725)
     (xy 5.997597 0.127109) (xy 6.020593 0.127092) (xy 6.342062 0.127184) )(layer F.SilkS) (width  0.010000)
  )
)
