EESchema Schematic File Version 4
EELAYER 30 0
EELAYER END
$Descr USLetter 11000 8500
encoding utf-8
Sheet 1 1
Title ""
Date ""
Rev ""
Comp ""
Comment1 ""
Comment2 ""
Comment3 ""
Comment4 ""
$EndDescr
$Comp
L Mechanical:MountingHole H2
U 1 1 5E644588
P 750 7650
F 0 "H2" H 850 7696 50  0000 L CNN
F 1 "M3" H 850 7605 50  0000 L CNN
F 2 "MountingHole:MountingHole_3.2mm_M3" H 750 7650 50  0001 C CNN
F 3 "~" H 750 7650 50  0001 C CNN
	1    750  7650
	1    0    0    -1  
$EndComp
$Comp
L Mechanical:MountingHole H1
U 1 1 5E64538F
P 750 7450
F 0 "H1" H 850 7496 50  0000 L CNN
F 1 "M3" H 850 7405 50  0000 L CNN
F 2 "MountingHole:MountingHole_3.2mm_M3" H 750 7450 50  0001 C CNN
F 3 "~" H 750 7450 50  0001 C CNN
	1    750  7450
	1    0    0    -1  
$EndComp
$Comp
L Mechanical:MountingHole H3
U 1 1 5E6456F3
P 1050 7450
F 0 "H3" H 1150 7496 50  0000 L CNN
F 1 "M3" H 1150 7405 50  0000 L CNN
F 2 "MountingHole:MountingHole_3.2mm_M3" H 1050 7450 50  0001 C CNN
F 3 "~" H 1050 7450 50  0001 C CNN
	1    1050 7450
	1    0    0    -1  
$EndComp
$Comp
L Mechanical:MountingHole H4
U 1 1 5E645A34
P 1050 7650
F 0 "H4" H 1150 7696 50  0000 L CNN
F 1 "M3" H 1150 7605 50  0000 L CNN
F 2 "MountingHole:MountingHole_3.2mm_M3" H 1050 7650 50  0001 C CNN
F 3 "~" H 1050 7650 50  0001 C CNN
	1    1050 7650
	1    0    0    -1  
$EndComp
$Comp
L MCU_Microchip_ATmega:ATmega328P-AU U1
U 1 1 5E646B80
P 3850 3250
F 0 "U1" H 4250 4700 50  0000 C CNN
F 1 "ATmega328P-AU" H 4300 1800 50  0000 C CNN
F 2 "Package_QFP:TQFP-32_7x7mm_P0.8mm" H 3850 3250 50  0001 C CIN
F 3 "http://ww1.microchip.com/downloads/en/DeviceDoc/40001906C.pdf" H 3850 3250 50  0001 C CNN
	1    3850 3250
	1    0    0    -1  
$EndComp
$Comp
L Connector_Generic:Conn_01x08 J1
U 1 1 5E6490A5
P 5550 4050
F 0 "J1" H 5630 4042 50  0000 L CNN
F 1 "GPIO1" H 5630 3951 50  0000 L CNN
F 2 "Connector_PinHeader_2.54mm:PinHeader_1x08_P2.54mm_Vertical" H 5550 4050 50  0001 C CNN
F 3 "~" H 5550 4050 50  0001 C CNN
	1    5550 4050
	1    0    0    -1  
$EndComp
Wire Wire Line
	4450 3750 5350 3750
Wire Wire Line
	4450 3850 5350 3850
Wire Wire Line
	4450 3950 5350 3950
Wire Wire Line
	4450 4050 5350 4050
Wire Wire Line
	4450 4150 5350 4150
Wire Wire Line
	4450 4250 5350 4250
Wire Wire Line
	4450 4350 5350 4350
Wire Wire Line
	4450 4450 5350 4450
Text Label 4550 3750 0    50   ~ 0
RXD
Text Label 4550 3850 0    50   ~ 0
TXD
Text Label 4550 3950 0    50   ~ 0
D2
Text Label 4550 4050 0    50   ~ 0
D3
Text Label 4550 4150 0    50   ~ 0
D4
Text Label 4550 4250 0    50   ~ 0
D5
Text Label 4550 4350 0    50   ~ 0
D6
Text Label 4550 4450 0    50   ~ 0
D7
Wire Wire Line
	5950 4450 6050 4450
Wire Wire Line
	6050 3750 5950 3750
Connection ~ 5950 3750
Wire Wire Line
	5950 3750 5950 3850
Wire Wire Line
	6050 3850 5950 3850
Connection ~ 5950 3850
Wire Wire Line
	5950 3850 5950 3950
Wire Wire Line
	6050 3950 5950 3950
Connection ~ 5950 3950
Wire Wire Line
	5950 3950 5950 4050
Wire Wire Line
	6050 4050 5950 4050
Connection ~ 5950 4050
Wire Wire Line
	5950 4050 5950 4150
Wire Wire Line
	6050 4150 5950 4150
Connection ~ 5950 4150
Wire Wire Line
	5950 4150 5950 4250
Wire Wire Line
	6050 4250 5950 4250
Connection ~ 5950 4250
Wire Wire Line
	5950 4250 5950 4350
Wire Wire Line
	6050 4350 5950 4350
Connection ~ 5950 4350
Wire Wire Line
	5950 4350 5950 4450
$Comp
L power:GND #PWR0102
U 1 1 5E652F51
P 6650 4500
F 0 "#PWR0102" H 6650 4250 50  0001 C CNN
F 1 "GND" H 6655 4327 50  0000 C CNN
F 2 "" H 6650 4500 50  0001 C CNN
F 3 "" H 6650 4500 50  0001 C CNN
	1    6650 4500
	1    0    0    -1  
$EndComp
Wire Wire Line
	6650 4500 6650 4450
Wire Wire Line
	6650 3750 6550 3750
Wire Wire Line
	6550 3850 6650 3850
Connection ~ 6650 3850
Wire Wire Line
	6650 3850 6650 3750
Connection ~ 6650 3950
Wire Wire Line
	6650 3950 6650 3850
Wire Wire Line
	6550 3950 6650 3950
Connection ~ 6650 4050
Wire Wire Line
	6650 4050 6650 3950
Wire Wire Line
	6550 4050 6650 4050
Wire Wire Line
	6550 4150 6650 4150
Connection ~ 6650 4150
Wire Wire Line
	6650 4150 6650 4050
Connection ~ 6650 4250
Wire Wire Line
	6650 4250 6650 4150
Wire Wire Line
	6550 4250 6650 4250
Wire Wire Line
	6550 4350 6650 4350
Connection ~ 6650 4350
Wire Wire Line
	6650 4350 6650 4250
Wire Wire Line
	6550 4450 6650 4450
Connection ~ 6650 4450
Wire Wire Line
	6650 4450 6650 4350
$Comp
L Connector_Generic:Conn_01x07 J5
U 1 1 5E65AD84
P 5550 3250
F 0 "J5" H 5630 3242 50  0000 L CNN
F 1 "Analog" H 5630 3151 50  0000 L CNN
F 2 "Connector_PinHeader_2.54mm:PinHeader_1x07_P2.54mm_Vertical" H 5550 3250 50  0001 C CNN
F 3 "~" H 5550 3250 50  0001 C CNN
	1    5550 3250
	1    0    0    -1  
$EndComp
Wire Wire Line
	4450 2950 5350 2950
Wire Wire Line
	4450 3050 5350 3050
Wire Wire Line
	4450 3150 5350 3150
Wire Wire Line
	4450 3250 5350 3250
Wire Wire Line
	4450 3350 5350 3350
Wire Wire Line
	4450 3450 5350 3450
Text Label 4550 3550 0    50   ~ 0
~RESET
$Comp
L power:+5V #PWR0101
U 1 1 5E6513DB
P 5950 1700
F 0 "#PWR0101" H 5950 1550 50  0001 C CNN
F 1 "+5V" H 5965 1873 50  0000 C CNN
F 2 "" H 5950 1700 50  0001 C CNN
F 3 "" H 5950 1700 50  0001 C CNN
	1    5950 1700
	1    0    0    -1  
$EndComp
$Comp
L Connector_Generic:Conn_02x08_Odd_Even J2
U 1 1 5E64E376
P 6350 4050
F 0 "J2" H 6500 4450 50  0000 C CNN
F 1 "Power1" H 6250 4450 50  0000 C CNN
F 2 "Connector_PinHeader_2.54mm:PinHeader_2x08_P2.54mm_Vertical" H 6350 4050 50  0001 C CNN
F 3 "~" H 6350 4050 50  0001 C CNN
	1    6350 4050
	-1   0    0    -1  
$EndComp
$Comp
L Connector_Generic:Conn_02x07_Odd_Even J6
U 1 1 5E66482E
P 6350 3250
F 0 "J6" H 6500 3650 50  0000 C CNN
F 1 "Power3" H 6250 3650 50  0000 C CNN
F 2 "Connector_PinHeader_2.54mm:PinHeader_2x07_P2.54mm_Vertical" H 6350 3250 50  0001 C CNN
F 3 "~" H 6350 3250 50  0001 C CNN
	1    6350 3250
	-1   0    0    -1  
$EndComp
Wire Wire Line
	6050 3450 5950 3450
Connection ~ 5950 3450
Wire Wire Line
	5950 3450 5950 3550
Wire Wire Line
	6050 3350 5950 3350
Connection ~ 5950 3350
Wire Wire Line
	5950 3350 5950 3450
Wire Wire Line
	6050 3250 5950 3250
Connection ~ 5950 3250
Wire Wire Line
	5950 3250 5950 3350
Wire Wire Line
	6050 3150 5950 3150
Connection ~ 5950 3150
Wire Wire Line
	5950 3150 5950 3250
Wire Wire Line
	6050 3050 5950 3050
Connection ~ 5950 3050
Wire Wire Line
	5950 3050 5950 3150
Wire Wire Line
	6050 2950 5950 2950
Connection ~ 5950 2950
Wire Wire Line
	5950 2950 5950 3050
Wire Wire Line
	6650 3750 6650 3550
Wire Wire Line
	6650 2950 6550 2950
Connection ~ 6650 3750
Wire Wire Line
	6550 3050 6650 3050
Connection ~ 6650 3050
Wire Wire Line
	6650 3050 6650 2950
Wire Wire Line
	6550 3150 6650 3150
Connection ~ 6650 3150
Wire Wire Line
	6650 3150 6650 3050
Wire Wire Line
	6550 3250 6650 3250
Connection ~ 6650 3250
Wire Wire Line
	6650 3250 6650 3150
Wire Wire Line
	6550 3350 6650 3350
Connection ~ 6650 3350
Wire Wire Line
	6650 3350 6650 3250
Wire Wire Line
	6550 3450 6650 3450
Connection ~ 6650 3450
Wire Wire Line
	6650 3450 6650 3350
Text Label 4550 2950 0    50   ~ 0
A0
Text Label 4550 3050 0    50   ~ 0
A1
Text Label 4550 3150 0    50   ~ 0
A2
Text Label 4550 3250 0    50   ~ 0
A3
Text Label 4550 3350 0    50   ~ 0
SDA
Text Label 4550 3450 0    50   ~ 0
SCL
Wire Wire Line
	5950 1700 5950 2050
$Comp
L Device:Resonator Y1
U 1 1 5E676ECB
P 7350 3200
F 0 "Y1" H 7350 3448 50  0000 C CNN
F 1 "16MHz" H 7350 3357 50  0000 C CNN
F 2 "Crystal:Resonator_SMD_muRata_CSTxExxV-3Pin_3.0x1.1mm" H 7325 3200 50  0001 C CNN
F 3 "~" H 7325 3200 50  0001 C CNN
	1    7350 3200
	1    0    0    -1  
$EndComp
Wire Wire Line
	4450 2750 7050 2750
Wire Wire Line
	7050 2750 7050 3200
Wire Wire Line
	7050 3200 7200 3200
Wire Wire Line
	4450 2650 7600 2650
Wire Wire Line
	7600 2650 7600 3200
Wire Wire Line
	7600 3200 7500 3200
$Comp
L power:GND #PWR0103
U 1 1 5E67DAE5
P 7350 3500
F 0 "#PWR0103" H 7350 3250 50  0001 C CNN
F 1 "GND" H 7355 3327 50  0000 C CNN
F 2 "" H 7350 3500 50  0001 C CNN
F 3 "" H 7350 3500 50  0001 C CNN
	1    7350 3500
	1    0    0    -1  
$EndComp
Wire Wire Line
	7350 3500 7350 3400
$Comp
L Connector_Generic:Conn_01x04 J7
U 1 1 5E688A3A
P 9050 3150
F 0 "J7" H 9130 3142 50  0000 L CNN
F 1 "I2C" H 9130 3051 50  0000 L CNN
F 2 "Connector_PinHeader_2.54mm:PinHeader_1x04_P2.54mm_Vertical" H 9050 3150 50  0001 C CNN
F 3 "~" H 9050 3150 50  0001 C CNN
	1    9050 3150
	1    0    0    -1  
$EndComp
$Comp
L power:+5V #PWR0104
U 1 1 5E689E4D
P 8750 2950
F 0 "#PWR0104" H 8750 2800 50  0001 C CNN
F 1 "+5V" H 8765 3123 50  0000 C CNN
F 2 "" H 8750 2950 50  0001 C CNN
F 3 "" H 8750 2950 50  0001 C CNN
	1    8750 2950
	1    0    0    -1  
$EndComp
Wire Wire Line
	8850 3050 8750 3050
Wire Wire Line
	8750 3050 8750 2950
Wire Wire Line
	8850 3150 8450 3150
Wire Wire Line
	8850 3250 8450 3250
$Comp
L power:GND #PWR0105
U 1 1 5E68FFBB
P 8750 3450
F 0 "#PWR0105" H 8750 3200 50  0001 C CNN
F 1 "GND" H 8755 3277 50  0000 C CNN
F 2 "" H 8750 3450 50  0001 C CNN
F 3 "" H 8750 3450 50  0001 C CNN
	1    8750 3450
	1    0    0    -1  
$EndComp
Wire Wire Line
	8750 3450 8750 3350
Wire Wire Line
	8750 3350 8850 3350
Text Label 8450 3150 0    50   ~ 0
SDA
Text Label 8450 3250 0    50   ~ 0
SCL
$Comp
L Connector_Generic:Conn_01x06 J3
U 1 1 5E696A86
P 5550 2250
F 0 "J3" H 5630 2242 50  0000 L CNN
F 1 "GPIO2" H 5630 2151 50  0000 L CNN
F 2 "Connector_PinHeader_2.54mm:PinHeader_1x06_P2.54mm_Vertical" H 5550 2250 50  0001 C CNN
F 3 "~" H 5550 2250 50  0001 C CNN
	1    5550 2250
	1    0    0    -1  
$EndComp
Wire Wire Line
	5350 2050 4450 2050
Wire Wire Line
	4450 2150 5350 2150
Wire Wire Line
	4450 2250 5350 2250
Wire Wire Line
	4450 2350 5350 2350
Wire Wire Line
	4450 2450 5350 2450
Wire Wire Line
	5350 2550 4450 2550
Text Label 4550 2050 0    50   ~ 0
D8
Text Label 4550 2150 0    50   ~ 0
D9
Text Label 4550 2250 0    50   ~ 0
D10
Text Label 4550 2350 0    50   ~ 0
MOSI
Text Label 4550 2450 0    50   ~ 0
MISO
Text Label 4550 2550 0    50   ~ 0
SCK
$Comp
L Connector_Generic:Conn_02x06_Odd_Even J4
U 1 1 5E6A89E9
P 6350 2250
F 0 "J4" H 6500 2550 50  0000 C CNN
F 1 "Power2" H 6250 2550 50  0000 C CNN
F 2 "Connector_PinHeader_2.54mm:PinHeader_2x06_P2.54mm_Vertical" H 6350 2250 50  0001 C CNN
F 3 "~" H 6350 2250 50  0001 C CNN
	1    6350 2250
	-1   0    0    -1  
$EndComp
Wire Wire Line
	6050 2050 5950 2050
Connection ~ 5950 2050
Wire Wire Line
	5950 2050 5950 2150
Wire Wire Line
	6050 2150 5950 2150
Connection ~ 5950 2150
Wire Wire Line
	5950 2150 5950 2250
Wire Wire Line
	6050 2250 5950 2250
Connection ~ 5950 2250
Wire Wire Line
	5950 2250 5950 2350
Wire Wire Line
	6050 2350 5950 2350
Connection ~ 5950 2350
Wire Wire Line
	5950 2350 5950 2450
Wire Wire Line
	6050 2450 5950 2450
Connection ~ 5950 2450
Wire Wire Line
	5950 2450 5950 2550
Wire Wire Line
	6050 2550 5950 2550
Connection ~ 5950 2550
Wire Wire Line
	5950 2550 5950 2950
Wire Wire Line
	6650 2950 6650 2550
Wire Wire Line
	6650 2050 6550 2050
Connection ~ 6650 2950
Wire Wire Line
	6550 2150 6650 2150
Connection ~ 6650 2150
Wire Wire Line
	6650 2150 6650 2050
Wire Wire Line
	6550 2250 6650 2250
Connection ~ 6650 2250
Wire Wire Line
	6650 2250 6650 2150
Wire Wire Line
	6550 2350 6650 2350
Connection ~ 6650 2350
Wire Wire Line
	6650 2350 6650 2250
Wire Wire Line
	6550 2450 6650 2450
Connection ~ 6650 2450
Wire Wire Line
	6650 2450 6650 2350
Wire Wire Line
	6550 2550 6650 2550
Connection ~ 6650 2550
Wire Wire Line
	6650 2550 6650 2450
$Comp
L Connector_Generic:Conn_02x03_Odd_Even J8
U 1 1 5E6D10D3
P 8800 2300
F 0 "J8" H 8850 2617 50  0000 C CNN
F 1 "ICSP" H 8850 2526 50  0000 C CNN
F 2 "Connector_PinHeader_2.54mm:PinHeader_2x03_P2.54mm_Vertical" H 8800 2300 50  0001 C CNN
F 3 "~" H 8800 2300 50  0001 C CNN
	1    8800 2300
	1    0    0    -1  
$EndComp
Wire Wire Line
	8600 2400 8250 2400
Wire Wire Line
	8600 2300 8250 2300
Wire Wire Line
	8600 2200 8250 2200
Text Label 8250 2200 0    50   ~ 0
MISO
Text Label 8250 2300 0    50   ~ 0
SCK
Text Label 8250 2400 0    50   ~ 0
~RESET
Wire Wire Line
	9450 2300 9100 2300
Text Label 9250 2300 0    50   ~ 0
MOSI
$Comp
L power:+5V #PWR0106
U 1 1 5E6E2EE8
P 9250 2050
F 0 "#PWR0106" H 9250 1900 50  0001 C CNN
F 1 "+5V" H 9265 2223 50  0000 C CNN
F 2 "" H 9250 2050 50  0001 C CNN
F 3 "" H 9250 2050 50  0001 C CNN
	1    9250 2050
	1    0    0    -1  
$EndComp
Wire Wire Line
	9100 2200 9250 2200
Wire Wire Line
	9250 2200 9250 2050
$Comp
L power:GND #PWR0107
U 1 1 5E6E8095
P 9250 2500
F 0 "#PWR0107" H 9250 2250 50  0001 C CNN
F 1 "GND" H 9255 2327 50  0000 C CNN
F 2 "" H 9250 2500 50  0001 C CNN
F 3 "" H 9250 2500 50  0001 C CNN
	1    9250 2500
	1    0    0    -1  
$EndComp
Wire Wire Line
	9250 2500 9250 2400
Wire Wire Line
	9250 2400 9100 2400
$Comp
L Switch:SW_Push SW1
U 1 1 5E6ECE00
P 9800 4550
F 0 "SW1" V 9754 4698 50  0000 L CNN
F 1 "Reset" V 9845 4698 50  0000 L CNN
F 2 "Button_Switch_SMD:SW_Push_1P1T_NO_6x6mm_H9.5mm" H 9800 4750 50  0001 C CNN
F 3 "~" H 9800 4750 50  0001 C CNN
	1    9800 4550
	0    1    1    0   
$EndComp
$Comp
L Device:R R3
U 1 1 5E6EE102
P 9800 4050
F 0 "R3" H 9870 4096 50  0000 L CNN
F 1 "10k" H 9870 4005 50  0000 L CNN
F 2 "Resistor_SMD:R_0402_1005Metric" V 9730 4050 50  0001 C CNN
F 3 "~" H 9800 4050 50  0001 C CNN
	1    9800 4050
	1    0    0    -1  
$EndComp
Wire Wire Line
	9800 4350 9800 4300
$Comp
L power:GND #PWR0108
U 1 1 5E6F2B0A
P 9800 4900
F 0 "#PWR0108" H 9800 4650 50  0001 C CNN
F 1 "GND" H 9805 4727 50  0000 C CNN
F 2 "" H 9800 4900 50  0001 C CNN
F 3 "" H 9800 4900 50  0001 C CNN
	1    9800 4900
	1    0    0    -1  
$EndComp
Wire Wire Line
	9800 4900 9800 4750
$Comp
L power:+5V #PWR0109
U 1 1 5E6FFF32
P 9800 3800
F 0 "#PWR0109" H 9800 3650 50  0001 C CNN
F 1 "+5V" H 9815 3973 50  0000 C CNN
F 2 "" H 9800 3800 50  0001 C CNN
F 3 "" H 9800 3800 50  0001 C CNN
	1    9800 3800
	1    0    0    -1  
$EndComp
Wire Wire Line
	9800 3900 9800 3800
Wire Wire Line
	9800 4300 9350 4300
Connection ~ 9800 4300
Wire Wire Line
	9800 4300 9800 4200
Text Label 9350 4300 0    50   ~ 0
~RESET
$Comp
L Device:R R2
U 1 1 5E717528
P 8300 4050
F 0 "R2" H 8370 4096 50  0000 L CNN
F 1 "1k" H 8370 4005 50  0000 L CNN
F 2 "Resistor_SMD:R_0402_1005Metric" V 8230 4050 50  0001 C CNN
F 3 "~" H 8300 4050 50  0001 C CNN
	1    8300 4050
	1    0    0    -1  
$EndComp
$Comp
L Device:R R1
U 1 1 5E718BC7
P 7800 4050
F 0 "R1" H 7870 4096 50  0000 L CNN
F 1 "1k" H 7870 4005 50  0000 L CNN
F 2 "Resistor_SMD:R_0402_1005Metric" V 7730 4050 50  0001 C CNN
F 3 "~" H 7800 4050 50  0001 C CNN
	1    7800 4050
	1    0    0    -1  
$EndComp
Wire Wire Line
	7800 3900 7800 3800
$Comp
L power:+5V #PWR0110
U 1 1 5E721923
P 7800 3800
F 0 "#PWR0110" H 7800 3650 50  0001 C CNN
F 1 "+5V" H 7815 3973 50  0000 C CNN
F 2 "" H 7800 3800 50  0001 C CNN
F 3 "" H 7800 3800 50  0001 C CNN
	1    7800 3800
	1    0    0    -1  
$EndComp
Wire Wire Line
	8300 3900 8300 3800
Wire Wire Line
	8300 3800 8550 3800
Text Label 8400 3800 0    50   ~ 0
SCK
$Comp
L Device:LED D1
U 1 1 5E742BFE
P 7800 4450
F 0 "D1" V 7839 4332 50  0000 R CNN
F 1 "Power" V 7748 4332 50  0000 R CNN
F 2 "LED_SMD:LED_0402_1005Metric" H 7800 4450 50  0001 C CNN
F 3 "~" H 7800 4450 50  0001 C CNN
	1    7800 4450
	0    -1   -1   0   
$EndComp
$Comp
L Device:LED D2
U 1 1 5E7436B3
P 8300 4450
F 0 "D2" V 8339 4332 50  0000 R CNN
F 1 "D13" V 8248 4332 50  0000 R CNN
F 2 "LED_SMD:LED_0402_1005Metric" H 8300 4450 50  0001 C CNN
F 3 "~" H 8300 4450 50  0001 C CNN
	1    8300 4450
	0    -1   -1   0   
$EndComp
Wire Wire Line
	7800 4300 7800 4200
Wire Wire Line
	8300 4300 8300 4200
Wire Wire Line
	7800 4600 7800 4750
Wire Wire Line
	7800 4750 8050 4750
Wire Wire Line
	8300 4750 8300 4600
$Comp
L power:GND #PWR0111
U 1 1 5E752209
P 8050 4850
F 0 "#PWR0111" H 8050 4600 50  0001 C CNN
F 1 "GND" H 8055 4677 50  0000 C CNN
F 2 "" H 8050 4850 50  0001 C CNN
F 3 "" H 8050 4850 50  0001 C CNN
	1    8050 4850
	1    0    0    -1  
$EndComp
Wire Wire Line
	8050 4850 8050 4750
Connection ~ 8050 4750
Wire Wire Line
	8050 4750 8300 4750
$Comp
L power:+5V #PWR0112
U 1 1 5E76F9A3
P 3900 1550
F 0 "#PWR0112" H 3900 1400 50  0001 C CNN
F 1 "+5V" H 3915 1723 50  0000 C CNN
F 2 "" H 3900 1550 50  0001 C CNN
F 3 "" H 3900 1550 50  0001 C CNN
	1    3900 1550
	1    0    0    -1  
$EndComp
Wire Wire Line
	3850 1750 3850 1650
Wire Wire Line
	3850 1650 3900 1650
Wire Wire Line
	3950 1650 3950 1750
Wire Wire Line
	3900 1650 3900 1550
Connection ~ 3900 1650
Wire Wire Line
	3900 1650 3950 1650
NoConn ~ 3250 2050
$Comp
L power:GND #PWR0113
U 1 1 5E78072A
P 3850 4850
F 0 "#PWR0113" H 3850 4600 50  0001 C CNN
F 1 "GND" H 3855 4677 50  0000 C CNN
F 2 "" H 3850 4850 50  0001 C CNN
F 3 "" H 3850 4850 50  0001 C CNN
	1    3850 4850
	1    0    0    -1  
$EndComp
Wire Wire Line
	3850 4850 3850 4750
$Comp
L Device:C C2
U 1 1 5E78D4B1
P 6800 5800
F 0 "C2" H 6915 5846 50  0000 L CNN
F 1 "0.1u" H 6915 5755 50  0000 L CNN
F 2 "Capacitor_SMD:C_0402_1005Metric" H 6838 5650 50  0001 C CNN
F 3 "~" H 6800 5800 50  0001 C CNN
	1    6800 5800
	1    0    0    -1  
$EndComp
$Comp
L Device:C C3
U 1 1 5E78D75F
P 7200 5800
F 0 "C3" H 7315 5846 50  0000 L CNN
F 1 "0.1u" H 7315 5755 50  0000 L CNN
F 2 "Capacitor_SMD:C_0402_1005Metric" H 7238 5650 50  0001 C CNN
F 3 "~" H 7200 5800 50  0001 C CNN
	1    7200 5800
	1    0    0    -1  
$EndComp
$Comp
L power:+5V #PWR0114
U 1 1 5E78E39C
P 6800 5450
F 0 "#PWR0114" H 6800 5300 50  0001 C CNN
F 1 "+5V" H 6815 5623 50  0000 C CNN
F 2 "" H 6800 5450 50  0001 C CNN
F 3 "" H 6800 5450 50  0001 C CNN
	1    6800 5450
	1    0    0    -1  
$EndComp
$Comp
L Device:C C1
U 1 1 5E78FA5A
P 6350 5800
F 0 "C1" H 6465 5846 50  0000 L CNN
F 1 "0.1u" H 6465 5755 50  0000 L CNN
F 2 "Capacitor_SMD:C_0402_1005Metric" H 6388 5650 50  0001 C CNN
F 3 "~" H 6350 5800 50  0001 C CNN
	1    6350 5800
	1    0    0    -1  
$EndComp
Wire Wire Line
	6350 5650 6350 5550
Wire Wire Line
	6350 5550 6800 5550
Wire Wire Line
	7200 5550 7200 5650
Wire Wire Line
	6800 5650 6800 5550
Connection ~ 6800 5550
Wire Wire Line
	6800 5550 7200 5550
Wire Wire Line
	6800 5450 6800 5550
Wire Wire Line
	6350 5950 6350 6050
Wire Wire Line
	6350 6050 6800 6050
Wire Wire Line
	7200 6050 7200 5950
Wire Wire Line
	6800 5950 6800 6050
Connection ~ 6800 6050
Wire Wire Line
	6800 6050 7200 6050
Wire Wire Line
	6800 6050 6800 6150
$Comp
L power:GND #PWR0115
U 1 1 5E7D1AEE
P 6800 6150
F 0 "#PWR0115" H 6800 5900 50  0001 C CNN
F 1 "GND" H 6805 5977 50  0000 C CNN
F 2 "" H 6800 6150 50  0001 C CNN
F 3 "" H 6800 6150 50  0001 C CNN
	1    6800 6150
	1    0    0    -1  
$EndComp
$Comp
L Regulator_Linear:L7805 U2
U 1 1 5E7E6519
P 4800 5650
F 0 "U2" H 4800 5892 50  0000 C CNN
F 1 "L7805" H 4800 5801 50  0000 C CNN
F 2 "Package_TO_SOT_SMD:SOT-223-3_TabPin2" H 4825 5500 50  0001 L CIN
F 3 "http://www.st.com/content/ccc/resource/technical/document/datasheet/41/4f/b3/b0/12/d4/47/88/CD00000444.pdf/files/CD00000444.pdf/jcr:content/translations/en.CD00000444.pdf" H 4800 5600 50  0001 C CNN
	1    4800 5650
	1    0    0    -1  
$EndComp
$Comp
L power:VPP #PWR0116
U 1 1 5E824B6E
P 4250 5550
F 0 "#PWR0116" H 4250 5400 50  0001 C CNN
F 1 "VPP" H 4265 5723 50  0000 C CNN
F 2 "" H 4250 5550 50  0001 C CNN
F 3 "" H 4250 5550 50  0001 C CNN
	1    4250 5550
	1    0    0    -1  
$EndComp
$Comp
L Device:C C4
U 1 1 5E825FC1
P 4250 5900
F 0 "C4" H 4365 5946 50  0000 L CNN
F 1 "10u" H 4365 5855 50  0000 L CNN
F 2 "Capacitor_SMD:C_0805_2012Metric" H 4288 5750 50  0001 C CNN
F 3 "~" H 4250 5900 50  0001 C CNN
	1    4250 5900
	1    0    0    -1  
$EndComp
Wire Wire Line
	4250 5750 4250 5650
Wire Wire Line
	4500 5650 4250 5650
Connection ~ 4250 5650
Wire Wire Line
	4250 5650 4250 5550
$Comp
L Device:C C5
U 1 1 5E833C99
P 5400 5900
F 0 "C5" H 5515 5946 50  0000 L CNN
F 1 "10u" H 5515 5855 50  0000 L CNN
F 2 "Capacitor_SMD:C_0805_2012Metric" H 5438 5750 50  0001 C CNN
F 3 "~" H 5400 5900 50  0001 C CNN
	1    5400 5900
	1    0    0    -1  
$EndComp
Wire Wire Line
	4250 6050 4250 6150
Wire Wire Line
	4250 6150 4800 6150
Wire Wire Line
	5400 6150 5400 6050
Connection ~ 4800 6150
Wire Wire Line
	4800 6150 5400 6150
Wire Wire Line
	4800 5950 4800 6150
Wire Wire Line
	5100 5650 5400 5650
Wire Wire Line
	5400 5650 5400 5750
Wire Wire Line
	4800 6150 4800 6300
$Comp
L power:GND #PWR0117
U 1 1 5E873F0A
P 4800 6300
F 0 "#PWR0117" H 4800 6050 50  0001 C CNN
F 1 "GND" H 4805 6127 50  0000 C CNN
F 2 "" H 4800 6300 50  0001 C CNN
F 3 "" H 4800 6300 50  0001 C CNN
	1    4800 6300
	1    0    0    -1  
$EndComp
$Comp
L power:+5V #PWR0118
U 1 1 5E874A78
P 5400 5550
F 0 "#PWR0118" H 5400 5400 50  0001 C CNN
F 1 "+5V" H 5415 5723 50  0000 C CNN
F 2 "" H 5400 5550 50  0001 C CNN
F 3 "" H 5400 5550 50  0001 C CNN
	1    5400 5550
	1    0    0    -1  
$EndComp
Wire Wire Line
	5400 5650 5400 5550
Connection ~ 5400 5650
$Comp
L Device:R R4
U 1 1 5E87CBEA
P 2750 5650
F 0 "R4" H 2820 5696 50  0000 L CNN
F 1 "10k" H 2820 5605 50  0000 L CNN
F 2 "Resistor_SMD:R_0402_1005Metric" V 2680 5650 50  0001 C CNN
F 3 "~" H 2750 5650 50  0001 C CNN
	1    2750 5650
	1    0    0    -1  
$EndComp
$Comp
L Device:R R5
U 1 1 5E87D746
P 2750 6150
F 0 "R5" H 2820 6196 50  0000 L CNN
F 1 "1k" H 2820 6105 50  0000 L CNN
F 2 "Resistor_SMD:R_0402_1005Metric" V 2680 6150 50  0001 C CNN
F 3 "~" H 2750 6150 50  0001 C CNN
	1    2750 6150
	1    0    0    -1  
$EndComp
Wire Wire Line
	2750 6000 2750 5900
$Comp
L power:VPP #PWR0119
U 1 1 5E895120
P 2750 5400
F 0 "#PWR0119" H 2750 5250 50  0001 C CNN
F 1 "VPP" H 2765 5573 50  0000 C CNN
F 2 "" H 2750 5400 50  0001 C CNN
F 3 "" H 2750 5400 50  0001 C CNN
	1    2750 5400
	1    0    0    -1  
$EndComp
Wire Wire Line
	2750 5500 2750 5400
$Comp
L power:GND #PWR0120
U 1 1 5E89D684
P 2750 6450
F 0 "#PWR0120" H 2750 6200 50  0001 C CNN
F 1 "GND" H 2755 6277 50  0000 C CNN
F 2 "" H 2750 6450 50  0001 C CNN
F 3 "" H 2750 6450 50  0001 C CNN
	1    2750 6450
	1    0    0    -1  
$EndComp
Wire Wire Line
	2750 6450 2750 6300
Wire Wire Line
	2750 5900 3150 5900
Connection ~ 2750 5900
Wire Wire Line
	2750 5900 2750 5800
Text Label 2950 5900 0    50   ~ 0
A7
$Comp
L Connector:TestPoint TP2
U 1 1 5E8BF64A
P 4000 5650
F 0 "TP2" V 4195 5722 50  0000 C CNN
F 1 "Vin" V 4104 5722 50  0000 C CNN
F 2 "TestPoint:TestPoint_Pad_2.5x2.5mm" H 4200 5650 50  0001 C CNN
F 3 "~" H 4200 5650 50  0001 C CNN
	1    4000 5650
	0    -1   -1   0   
$EndComp
Wire Wire Line
	4000 5650 4250 5650
$Comp
L Connector:TestPoint TP3
U 1 1 5E8D237A
P 4000 6150
F 0 "TP3" V 4195 6222 50  0000 C CNN
F 1 "GND" V 4104 6222 50  0000 C CNN
F 2 "TestPoint:TestPoint_Pad_2.5x2.5mm" H 4200 6150 50  0001 C CNN
F 3 "~" H 4200 6150 50  0001 C CNN
	1    4000 6150
	0    -1   -1   0   
$EndComp
Wire Wire Line
	4000 6150 4250 6150
Connection ~ 4250 6150
Wire Wire Line
	3250 2250 2850 2250
Text Label 3050 2250 0    50   ~ 0
A6
Text Label 3050 2350 0    50   ~ 0
A7
Wire Wire Line
	4450 3550 4700 3550
Wire Wire Line
	5350 3550 4950 3550
Wire Wire Line
	3250 2350 2850 2350
Text Label 4950 3550 0    50   ~ 0
A6
Wire Wire Line
	6550 3550 6650 3550
Connection ~ 6650 3550
Wire Wire Line
	6650 3550 6650 3450
Wire Wire Line
	6050 3550 5950 3550
Connection ~ 5950 3550
Wire Wire Line
	5950 3550 5950 3750
$Comp
L Connector:TestPoint TP1
U 1 1 5E77D8D5
P 5500 5650
F 0 "TP1" V 5454 5838 50  0000 L CNN
F 1 "5V" V 5545 5838 50  0000 L CNN
F 2 "TestPoint:TestPoint_Pad_2.5x2.5mm" H 5700 5650 50  0001 C CNN
F 3 "~" H 5700 5650 50  0001 C CNN
	1    5500 5650
	0    1    1    0   
$EndComp
Wire Wire Line
	5500 5650 5400 5650
$EndSCHEMATC
