EESchema Schematic File Version 4
EELAYER 30 0
EELAYER END
$Descr A4 11693 8268
encoding utf-8
Sheet 1 1
Title ""
Date ""
Rev ""
Comp ""
Comment1 ""
Comment2 ""
Comment3 ""
Comment4 ""
$EndDescr
$Comp
L matched_pnp:Matched_PNP U1
U 1 1 61734A4A
P 3300 2900
F 0 "U1" H 3628 2971 39  0000 L CNN
F 1 "BCM857BS-7-F" H 3628 2888 50  0000 L CNN
F 2 "Package_TO_SOT_SMD:SOT-363_SC-70-6_Handsoldering" H 3300 2850 50  0001 C CNN
F 3 "" H 3300 2850 50  0001 C CNN
	1    3300 2900
	1    0    0    -1  
$EndComp
Wire Wire Line
	3050 3200 3050 3350
Wire Wire Line
	3050 3350 3200 3350
Wire Wire Line
	3300 3350 3300 3200
Wire Wire Line
	3050 2550 3050 2450
Wire Wire Line
	3050 2450 2800 2450
$Comp
L Device:R R1
U 1 1 6173C5AF
P 2800 3500
F 0 "R1" H 2870 3546 50  0000 L CNN
F 1 "10k" H 2870 3455 50  0000 L CNN
F 2 "Resistor_SMD:R_0603_1608Metric_Pad0.98x0.95mm_HandSolder" V 2730 3500 50  0001 C CNN
F 3 "~" H 2800 3500 50  0001 C CNN
	1    2800 3500
	1    0    0    -1  
$EndComp
$Comp
L Device:R R2
U 1 1 6173CF11
P 3200 3500
F 0 "R2" H 3270 3546 50  0000 L CNN
F 1 "100k" H 3270 3455 50  0000 L CNN
F 2 "Resistor_SMD:R_0603_1608Metric_Pad0.98x0.95mm_HandSolder" V 3130 3500 50  0001 C CNN
F 3 "~" H 3200 3500 50  0001 C CNN
	1    3200 3500
	1    0    0    -1  
$EndComp
Connection ~ 3200 3350
Wire Wire Line
	3200 3350 3300 3350
$Comp
L Device:R R3
U 1 1 6173D8DE
P 3550 3500
F 0 "R3" H 3620 3546 50  0000 L CNN
F 1 "10k" H 3620 3455 50  0000 L CNN
F 2 "Resistor_SMD:R_0603_1608Metric_Pad0.98x0.95mm_HandSolder" V 3480 3500 50  0001 C CNN
F 3 "~" H 3550 3500 50  0001 C CNN
	1    3550 3500
	1    0    0    -1  
$EndComp
Wire Wire Line
	3550 3200 3550 3250
Wire Wire Line
	3200 3650 3200 3850
$Comp
L power:GND #PWR0101
U 1 1 6173F048
P 2800 3850
F 0 "#PWR0101" H 2800 3600 50  0001 C CNN
F 1 "GND" H 2805 3677 50  0000 C CNN
F 2 "" H 2800 3850 50  0001 C CNN
F 3 "" H 2800 3850 50  0001 C CNN
	1    2800 3850
	1    0    0    -1  
$EndComp
$Comp
L power:GND #PWR0102
U 1 1 6173FE17
P 3200 3850
F 0 "#PWR0102" H 3200 3600 50  0001 C CNN
F 1 "GND" H 3205 3677 50  0000 C CNN
F 2 "" H 3200 3850 50  0001 C CNN
F 3 "" H 3200 3850 50  0001 C CNN
	1    3200 3850
	1    0    0    -1  
$EndComp
$Comp
L power:GND #PWR0103
U 1 1 617401E6
P 3550 3850
F 0 "#PWR0103" H 3550 3600 50  0001 C CNN
F 1 "GND" H 3555 3677 50  0000 C CNN
F 2 "" H 3550 3850 50  0001 C CNN
F 3 "" H 3550 3850 50  0001 C CNN
	1    3550 3850
	1    0    0    -1  
$EndComp
Wire Wire Line
	3300 2550 3300 2350
Wire Wire Line
	3550 2550 3550 2450
Wire Wire Line
	4150 3250 3550 3250
Connection ~ 3550 3250
Wire Wire Line
	3550 3250 3550 3350
Wire Wire Line
	2800 3650 2800 3850
Wire Wire Line
	3550 3650 3550 3850
$Comp
L power:PWR_FLAG #FLG0101
U 1 1 6179560F
P 3850 3850
F 0 "#FLG0101" H 3850 3925 50  0001 C CNN
F 1 "PWR_FLAG" H 3850 4023 50  0000 C CNN
F 2 "" H 3850 3850 50  0001 C CNN
F 3 "~" H 3850 3850 50  0001 C CNN
	1    3850 3850
	1    0    0    -1  
$EndComp
Connection ~ 3550 3850
Wire Wire Line
	3550 3850 3850 3850
$Comp
L power:GND #PWR0104
U 1 1 617484BB
P 1200 2150
F 0 "#PWR0104" H 1200 1900 50  0001 C CNN
F 1 "GND" H 1205 1977 50  0000 C CNN
F 2 "" H 1200 2150 50  0001 C CNN
F 3 "" H 1200 2150 50  0001 C CNN
	1    1200 2150
	1    0    0    -1  
$EndComp
$Comp
L power:GND #PWR0105
U 1 1 61748E71
P 4800 2850
F 0 "#PWR0105" H 4800 2600 50  0001 C CNN
F 1 "GND" H 4805 2677 50  0000 C CNN
F 2 "" H 4800 2850 50  0001 C CNN
F 3 "" H 4800 2850 50  0001 C CNN
	1    4800 2850
	1    0    0    -1  
$EndComp
$Comp
L Device:Battery_Cell BT2
U 1 1 61746079
P 4800 2750
F 0 "BT2" H 4918 2846 50  0000 L CNN
F 1 "1568-1816-ND" H 4918 2755 50  0000 L CNN
F 2 "Connector_AMASS:AMASS_XT60-M_1x02_P7.20mm_Vertical" V 4800 2810 50  0001 C CNN
F 3 "~" V 4800 2810 50  0001 C CNN
	1    4800 2750
	1    0    0    -1  
$EndComp
Wire Wire Line
	2250 2350 2250 1850
Wire Wire Line
	3300 2350 2250 2350
Wire Wire Line
	4150 2250 4000 2250
Wire Wire Line
	2500 2250 2500 2150
Wire Wire Line
	3000 2150 3000 2250
Connection ~ 3000 2250
Wire Wire Line
	3500 2150 3500 2250
Connection ~ 3500 2250
Wire Wire Line
	3500 2250 3000 2250
Connection ~ 4000 2250
Wire Wire Line
	4000 2250 3500 2250
Wire Wire Line
	2100 1750 2300 1750
Wire Wire Line
	2300 1750 2300 1850
Wire Wire Line
	2300 1750 2800 1750
Wire Wire Line
	2800 1750 2800 1850
Connection ~ 2300 1750
Wire Wire Line
	2800 1750 3300 1750
Wire Wire Line
	3300 1750 3300 1850
Connection ~ 2800 1750
Wire Wire Line
	3300 1750 3800 1750
Wire Wire Line
	3800 1750 3800 1850
Connection ~ 3300 1750
Wire Wire Line
	2700 1850 2700 2050
Wire Wire Line
	2700 2050 3200 2050
Wire Wire Line
	3200 2050 3200 1850
Connection ~ 3200 2050
Wire Wire Line
	3200 2050 3700 2050
Wire Wire Line
	3700 2050 3700 1850
Connection ~ 3700 2050
$Comp
L Device:Q_PMOS_GDS Q1
U 1 1 61868E30
P 2500 1950
F 0 "Q1" H 2705 1996 50  0000 L CNN
F 1 "NP100P04PDG-E1-AY" H 2705 1905 50  0000 L CNN
F 2 "Package_TO_SOT_SMD:TO-263-2" H 2700 2050 50  0001 C CNN
F 3 "~" H 2500 1950 50  0001 C CNN
	1    2500 1950
	0    -1   -1   0   
$EndComp
$Comp
L Device:Q_PMOS_GDS Q2
U 1 1 6186ADC1
P 3000 1950
F 0 "Q2" H 3205 1996 50  0000 L CNN
F 1 "NP100P04PDG-E1-AY" H 3205 1905 50  0000 L CNN
F 2 "Package_TO_SOT_SMD:TO-263-2" H 3200 2050 50  0001 C CNN
F 3 "~" H 3000 1950 50  0001 C CNN
	1    3000 1950
	0    -1   -1   0   
$EndComp
$Comp
L Device:Q_PMOS_GDS Q3
U 1 1 6186BB14
P 3500 1950
F 0 "Q3" H 3705 1996 50  0000 L CNN
F 1 "NP100P04PDG-E1-AY" H 3705 1905 50  0000 L CNN
F 2 "Package_TO_SOT_SMD:TO-263-2" H 3700 2050 50  0001 C CNN
F 3 "~" H 3500 1950 50  0001 C CNN
	1    3500 1950
	0    -1   -1   0   
$EndComp
$Comp
L Device:Q_PMOS_GDS Q4
U 1 1 6186C370
P 4000 1950
F 0 "Q4" H 4205 1996 50  0000 L CNN
F 1 "NP100P04PDG-E1-AY" H 4205 1905 50  0000 L CNN
F 2 "Package_TO_SOT_SMD:TO-263-2" H 4200 2050 50  0001 C CNN
F 3 "~" H 4000 1950 50  0001 C CNN
	1    4000 1950
	0    -1   -1   0   
$EndComp
Wire Wire Line
	4000 2150 4000 2250
Wire Wire Line
	4150 2250 4150 3250
Wire Wire Line
	1200 1850 2100 1850
Wire Wire Line
	4800 2450 4800 2550
Wire Wire Line
	2100 1750 2100 1850
Connection ~ 2100 1850
Wire Wire Line
	2100 1850 2250 1850
Wire Wire Line
	3700 2050 4250 2050
Connection ~ 4150 2250
Wire Wire Line
	4200 1850 4250 1850
Wire Wire Line
	4250 1850 4250 2050
Connection ~ 4800 2450
Wire Wire Line
	4800 1850 4800 2000
Wire Wire Line
	4700 2250 4700 2200
Wire Wire Line
	4700 2000 4800 2000
Connection ~ 4800 2000
Wire Wire Line
	4800 2000 4800 2450
Wire Wire Line
	3550 2450 4800 2450
Wire Wire Line
	4150 2250 4700 2250
Wire Wire Line
	2500 2250 3000 2250
Wire Wire Line
	4250 1850 4800 1850
Connection ~ 4250 1850
Wire Wire Line
	2800 2450 2800 3350
$Comp
L Device:D_Zener_Small D1
U 1 1 61923E61
P 4700 2100
F 0 "D1" V 4654 2170 50  0000 L CNN
F 1 "D_Zener_Small" V 4745 2170 50  0000 L CNN
F 2 "Diode_SMD:D_SOD-323F" V 4700 2100 50  0001 C CNN
F 3 "~" V 4700 2100 50  0001 C CNN
	1    4700 2100
	0    1    1    0   
$EndComp
$Comp
L Device:Battery_Cell BT1
U 1 1 61744E37
P 1200 2050
F 0 "BT1" H 1318 2146 50  0000 L CNN
F 1 "1568-1816-ND" H 1318 2055 50  0000 L CNN
F 2 "Connector_AMASS:AMASS_XT60-M_1x02_P7.20mm_Vertical" V 1200 2110 50  0001 C CNN
F 3 "~" V 1200 2110 50  0001 C CNN
	1    1200 2050
	1    0    0    -1  
$EndComp
$Comp
L NUAV_Logo:LOGO G1
U 1 1 61977651
P 1900 7150
F 0 "G1" H 1900 6750 60  0001 C CNN
F 1 "LOGO" H 1900 7550 60  0001 C CNN
F 2 "logo:NUAV logo" H 1900 7150 50  0001 C CNN
F 3 "" H 1900 7150 50  0001 C CNN
	1    1900 7150
	1    0    0    -1  
$EndComp
$EndSCHEMATC
