@startuml

participant Sender as S
participant "KYC List" as K
participant "Receiver" as R


S -> K: Check KYC
K -> S: Pass/Fail
S --> R: Send Tokens (Gas)
R --> K: Allow to Send?
K --> S: No-Reject (refund)
K --> R: Yes (Deliver)
R --> S: Transaction Detail

@enduml