{
	"data": [{
		"id": "0",
		"VISIBLE": true,
		"BOTTON_SAVE": true,
		"BOTTON_PRINT": true,
		"MODE_TABLE": "MultiSelect",
		"FIRSTNAME": "ALEXANDER",
		"LASTNAME": "HERNANDEZ",
		"TRUCK_PLATE": "A35BA0A",
		"TICKET": "ALG-C000128559",
		"TICKET_STATUS": "Bloqueado",
		"STATUS_TICKET": "Warning",
		"TRAILER": 1,
		"UNIT": "TRAILER",
		"ID_MEASURE_UNIT": "SACOS",
		"CODE_MATERIAL": "100004",
        "NAME_MATERIAL": "CALCIO",
        "QUANTITY_MATERIAL": 30,
        "QUANTITY_TARA": 17000,
        "QUANTITY_BRUTO": 1200,
        "TRUCK_PLATE": "A17AK8K",
        "SUPPLIER": "LA PASTOREÑA",
		"MATERIAL": [{
	        "ID_DOCUMENT": "0000000022",
	        "NAME_DOCUMENT_TYPE": "Orden de Compra",
	        "QUANTITY_MATERIAL": 40,
	        "ID_MEASURE_UNIT": "SACOS",
	        "CODE_MATERIAL": "100004",
	        "NAME_MATERIAL": "CALCIO",
	        "QUANTITY_BRUTO": 1200,
	        "TRUCK_PLATE": "A17AK8K",
	        "SUPPLIER": "LA PASTOREÑA",
	        "NAME_DOCUMENT_TYPE": "Orden de Compra",
	        "QUANTITY_MATERIAL": 30,
	        "QUANTITY_TARA": 17000,
	        "QUANTITY_BRUTO": 11000
	      }, {
	        "ID_DOCUMENT": "0000000023",
	        "NAME_DOCUMENT_TYPE": "Orden de Compra",
	        "QUANTITY_MATERIAL": 35,
	        "ID_MEASURE_UNIT": "SACOS",
	        "CODE_MATERIAL": "100005",
	        "NAME_MATERIAL": "SAL REFINADA",
	        "QUANTITY_BRUTO": 1000,
	        "TRUCK_PLATE": "A35BA0A",
	        "SUPPLIER": "CARIDAD III"
	    }]
	},
	{
		"id": "1",
		"VISIBLE": true,
		"BOTTON_SAVE": true,
		"BOTTON_PRINT": false,
		"MODE_TABLE": "MultiSelect",
		"FIRSTNAME": "WILLIAN",
		"LASTNAME": "CASTILLO",
		"TRUCK_PLATE": "A16AK8K",
		"TICKET": "ALG-C000128560",
		"TICKET_STATUS": "Bloqueado",
		"STATUS_TICKET": "Warning",
		"TRAILER": 0,
		"UNIT": "TRAILER",
		"ID_MEASURE_UNIT": "TON",
        "CODE_MATERIAL": "100001",
        "NAME_MATERIAL": "Harina de Soya",
        "SUPPLIER": "CARIDAD IV",
        "TRUCK_PLATE": "A16AK8K",
        "NAME_DOCUMENT_TYPE": "Orden de Compra",
        "QUANTITY_MATERIAL": 30,
        "QUANTITY_TARA": 17000,
        "QUANTITY_BRUTO": 11000,
		"MATERIAL": [{
	        "ID_DOCUMENT": "0000000021",
	        "NAME_DOCUMENT_TYPE": "Orden de Compra",
	        "QUANTITY_MATERIAL": 30,
	        "QUANTITY_TARA": 17000,
	        "QUANTITY_BRUTO": 11000,
	        "ID_MEASURE_UNIT": "TON",
	        "CODE_MATERIAL": "100001",
	        "NAME_MATERIAL": "Harina de Soya",
	        "SUPPLIER": "CARIDAD IV",
	        "TRUCK_PLATE": "A16AK8K"
	    }]
	}],
	"MATERIAL_SELECCIONADO": [],
	"availability": true
}